SuccessConsole Output

maven31-agent.jar already up to date
maven31-interceptor.jar already up to date
maven3-interceptor-commons.jar already up to date
<===[JENKINS REMOTING CAPACITY]===>channel started
Executing Maven:  -B -f /var/lib/jenkins/workspace/taverna-wsdl-activity-maintenance/pom.xml -Dmaven.repo.local=/var/lib/jenkins/workspace/taverna-wsdl-activity-maintenance/.repository clean install
[INFO] Scanning for projects...
[INFO] Initializing Artifactory Build-Info Recording
[HUDSON] Collecting dependencies info
[INFO] 
[INFO] Using the builder org.apache.maven.lifecycle.internal.builder.singlethreaded.SingleThreadedBuilder with a thread count of 1
[INFO]                                                                         
[INFO] ------------------------------------------------------------------------
[INFO] Building Taverna 2 WSDL Activity 1.6.test
[INFO] ------------------------------------------------------------------------
[INFO] 
[INFO] --- maven-clean-plugin:2.5:clean (default-clean) @ wsdl-activity ---
[INFO] Deleting /var/lib/jenkins/workspace/taverna-wsdl-activity-maintenance/target
[INFO] 
[INFO] --- maven-resources-plugin:2.6:resources (default-resources) @ wsdl-activity ---
[INFO] Using 'UTF-8' encoding to copy filtered resources.
[INFO] Copying 1 resource
[INFO] 
[INFO] --- maven-compiler-plugin:3.1:compile (default-compile) @ wsdl-activity ---
[INFO] Changes detected - recompiling the module!
[INFO] Compiling 19 source files to /var/lib/jenkins/workspace/taverna-wsdl-activity-maintenance/target/classes
[WARNING] /var/lib/jenkins/workspace/taverna-wsdl-activity-maintenance/src/main/java/net/sf/taverna/t2/activities/wsdl/xmlsplitter/AddXMLSplitterEdit.java: /var/lib/jenkins/workspace/taverna-wsdl-activity-maintenance/src/main/java/net/sf/taverna/t2/activities/wsdl/xmlsplitter/AddXMLSplitterEdit.java uses or overrides a deprecated API.
[WARNING] /var/lib/jenkins/workspace/taverna-wsdl-activity-maintenance/src/main/java/net/sf/taverna/t2/activities/wsdl/xmlsplitter/AddXMLSplitterEdit.java: Recompile with -Xlint:deprecation for details.
[WARNING] /var/lib/jenkins/workspace/taverna-wsdl-activity-maintenance/src/main/java/net/sf/taverna/t2/activities/wsdl/wss4j/T2WSDoAllSender.java: /var/lib/jenkins/workspace/taverna-wsdl-activity-maintenance/src/main/java/net/sf/taverna/t2/activities/wsdl/wss4j/T2WSDoAllSender.java uses unchecked or unsafe operations.
[WARNING] /var/lib/jenkins/workspace/taverna-wsdl-activity-maintenance/src/main/java/net/sf/taverna/t2/activities/wsdl/wss4j/T2WSDoAllSender.java: Recompile with -Xlint:unchecked for details.
[INFO] 
[INFO] --- maven-resources-plugin:2.6:testResources (default-testResources) @ wsdl-activity ---
[INFO] Using 'UTF-8' encoding to copy filtered resources.
[INFO] Copying 13 resources
[INFO] 
[INFO] --- maven-compiler-plugin:3.1:testCompile (default-testCompile) @ wsdl-activity ---
[INFO] Changes detected - recompiling the module!
[INFO] Compiling 8 source files to /var/lib/jenkins/workspace/taverna-wsdl-activity-maintenance/target/test-classes
[INFO] 
[INFO] --- maven-surefire-plugin:2.17:test (default-test) @ wsdl-activity ---
[INFO] Surefire report directory: /var/lib/jenkins/workspace/taverna-wsdl-activity-maintenance/target/surefire-reports

-------------------------------------------------------
 T E S T S
-------------------------------------------------------
Running net.sf.taverna.t2.activities.wsdl.xmlsplitter.XMLOutputSplitterActivityTest
ApplicationConfig could not determine application name, using unknownApplication-ff68a784-193c-4b57-ba23-f735e94d70d2
Tests run: 1, Failures: 0, Errors: 0, Skipped: 0, Time elapsed: 0.831 sec - in net.sf.taverna.t2.activities.wsdl.xmlsplitter.XMLOutputSplitterActivityTest
Running net.sf.taverna.t2.activities.wsdl.xmlsplitter.AddXMLSplitterEditTest
Tests run: 3, Failures: 0, Errors: 0, Skipped: 3, Time elapsed: 0.002 sec - in net.sf.taverna.t2.activities.wsdl.xmlsplitter.AddXMLSplitterEditTest
Running net.sf.taverna.t2.activities.wsdl.xmlsplitter.XMLInputSplitterActivityTest
Tests run: 2, Failures: 0, Errors: 0, Skipped: 0, Time elapsed: 0.001 sec - in net.sf.taverna.t2.activities.wsdl.xmlsplitter.XMLInputSplitterActivityTest
Running net.sf.taverna.t2.activities.wsdl.xmlsplitter.XMLSplitterConfigurationBeanBuilderTest
Tests run: 3, Failures: 0, Errors: 0, Skipped: 0, Time elapsed: 0.002 sec - in net.sf.taverna.t2.activities.wsdl.xmlsplitter.XMLSplitterConfigurationBeanBuilderTest
Running net.sf.taverna.t2.activities.wsdl.WSDLActivityTest
Tests run: 5, Failures: 0, Errors: 0, Skipped: 5, Time elapsed: 0.001 sec - in net.sf.taverna.t2.activities.wsdl.WSDLActivityTest
Running net.sf.taverna.t2.activities.wsdl.security.SecureServicesInvokerTest
Tests run: 1, Failures: 0, Errors: 0, Skipped: 1, Time elapsed: 0 sec - in net.sf.taverna.t2.activities.wsdl.security.SecureServicesInvokerTest
Running net.sf.taverna.t2.activities.wsdl.security.HTTPSConnectionsTest
java.net.UnknownHostException: rpc103.cs.man.ac.uk
	at java.net.AbstractPlainSocketImpl.connect(AbstractPlainSocketImpl.java:178)
	at java.net.SocksSocketImpl.connect(SocksSocketImpl.java:392)
	at java.net.Socket.connect(Socket.java:579)
	at sun.security.ssl.SSLSocketImpl.connect(SSLSocketImpl.java:618)
	at sun.security.ssl.BaseSSLSocketImpl.connect(BaseSSLSocketImpl.java:160)
	at sun.net.NetworkClient.doConnect(NetworkClient.java:180)
	at sun.net.www.http.HttpClient.openServer(HttpClient.java:432)
	at sun.net.www.http.HttpClient.openServer(HttpClient.java:527)
	at sun.net.www.protocol.https.HttpsClient.<init>(HttpsClient.java:275)
	at sun.net.www.protocol.https.HttpsClient.New(HttpsClient.java:371)
	at sun.net.www.protocol.https.AbstractDelegateHttpsURLConnection.getNewHttpClient(AbstractDelegateHttpsURLConnection.java:191)
	at sun.net.www.protocol.http.HttpURLConnection.plainConnect(HttpURLConnection.java:932)
	at sun.net.www.protocol.https.AbstractDelegateHttpsURLConnection.connect(AbstractDelegateHttpsURLConnection.java:177)
	at sun.net.www.protocol.https.HttpsURLConnectionImpl.connect(HttpsURLConnectionImpl.java:153)
	at net.sf.taverna.t2.activities.wsdl.security.HTTPSConnectionsTest.testHTTPSConnections(HTTPSConnectionsTest.java:26)
	at sun.reflect.NativeMethodAccessorImpl.invoke0(Native Method)
	at sun.reflect.NativeMethodAccessorImpl.invoke(NativeMethodAccessorImpl.java:57)
	at sun.reflect.DelegatingMethodAccessorImpl.invoke(DelegatingMethodAccessorImpl.java:43)
	at java.lang.reflect.Method.invoke(Method.java:606)
	at org.junit.runners.model.FrameworkMethod$1.runReflectiveCall(FrameworkMethod.java:44)
	at org.junit.internal.runners.model.ReflectiveCallable.run(ReflectiveCallable.java:15)
	at org.junit.runners.model.FrameworkMethod.invokeExplosively(FrameworkMethod.java:41)
	at org.junit.internal.runners.statements.InvokeMethod.evaluate(InvokeMethod.java:20)
	at org.junit.runners.BlockJUnit4ClassRunner.runChild(BlockJUnit4ClassRunner.java:76)
	at org.junit.runners.BlockJUnit4ClassRunner.runChild(BlockJUnit4ClassRunner.java:50)
	at org.junit.runners.ParentRunner$3.run(ParentRunner.java:193)
	at org.junit.runners.ParentRunner$1.schedule(ParentRunner.java:52)
	at org.junit.runners.ParentRunner.runChildren(ParentRunner.java:191)
	at org.junit.runners.ParentRunner.access$000(ParentRunner.java:42)
	at org.junit.runners.ParentRunner$2.evaluate(ParentRunner.java:184)
	at org.junit.runners.ParentRunner.run(ParentRunner.java:236)
	at org.apache.maven.surefire.junit4.JUnit4Provider.execute(JUnit4Provider.java:264)
	at org.apache.maven.surefire.junit4.JUnit4Provider.executeTestSet(JUnit4Provider.java:153)
	at org.apache.maven.surefire.junit4.JUnit4Provider.invoke(JUnit4Provider.java:124)
	at org.apache.maven.surefire.booter.ForkedBooter.invokeProviderInSameClassLoader(ForkedBooter.java:200)
	at org.apache.maven.surefire.booter.ForkedBooter.runSuitesInProcess(ForkedBooter.java:153)
	at org.apache.maven.surefire.booter.ForkedBooter.main(ForkedBooter.java:103)
Tests run: 1, Failures: 0, Errors: 0, Skipped: 0, Time elapsed: 0.421 sec - in net.sf.taverna.t2.activities.wsdl.security.HTTPSConnectionsTest
Running net.sf.taverna.t2.activities.wsdl.WSRFActivityTest
WARN  2014-05-09 15:36:05,642 (org.apache.axis.utils.JavaUtils:1308) - Unable to find required classes (javax.activation.DataHandler and javax.mail.internet.MimeMultipart). Attachment support is disabled.
Tests run: 2, Failures: 0, Errors: 0, Skipped: 0, Time elapsed: 2.465 sec - in net.sf.taverna.t2.activities.wsdl.WSRFActivityTest

Results :

Tests run: 18, Failures: 0, Errors: 0, Skipped: 9

[JENKINS] Recording test results
[INFO] 
[INFO] --- maven-jar-plugin:2.4:jar (default-jar) @ wsdl-activity ---
[INFO] Building jar: /var/lib/jenkins/workspace/taverna-wsdl-activity-maintenance/target/wsdl-activity-1.6.test.jar
[INFO] 
[INFO] >>> maven-source-plugin:2.2.1:jar (default) @ wsdl-activity >>>
[WARNING] Failed to getClass for org.apache.maven.plugin.source.SourceJarMojo
[INFO] 
[INFO] <<< maven-source-plugin:2.2.1:jar (default) @ wsdl-activity <<<
[INFO] 
[INFO] --- maven-source-plugin:2.2.1:jar (default) @ wsdl-activity ---
[INFO] Building jar: /var/lib/jenkins/workspace/taverna-wsdl-activity-maintenance/target/wsdl-activity-1.6.test-sources.jar
[INFO] 
[INFO] >>> maven-source-plugin:2.2.1:test-jar (default) @ wsdl-activity >>>
[WARNING] Failed to getClass for org.apache.maven.plugin.source.TestSourceJarMojo
[INFO] 
[INFO] <<< maven-source-plugin:2.2.1:test-jar (default) @ wsdl-activity <<<
[INFO] 
[INFO] --- maven-source-plugin:2.2.1:test-jar (default) @ wsdl-activity ---
[INFO] Building jar: /var/lib/jenkins/workspace/taverna-wsdl-activity-maintenance/target/wsdl-activity-1.6.test-test-sources.jar
[INFO] 
[INFO] --- maven-jar-plugin:2.4:test-jar (default) @ wsdl-activity ---
[INFO] Building jar: /var/lib/jenkins/workspace/taverna-wsdl-activity-maintenance/target/wsdl-activity-1.6.test-tests.jar
[INFO] 
[INFO] --- maven-install-plugin:2.4:install (default-install) @ wsdl-activity ---
[INFO] Installing /var/lib/jenkins/workspace/taverna-wsdl-activity-maintenance/target/wsdl-activity-1.6.test.jar to /var/lib/jenkins/workspace/taverna-wsdl-activity-maintenance/.repository/net/sf/taverna/t2/activities/wsdl-activity/1.6.test/wsdl-activity-1.6.test.jar
[INFO] Installing /var/lib/jenkins/workspace/taverna-wsdl-activity-maintenance/pom.xml to /var/lib/jenkins/workspace/taverna-wsdl-activity-maintenance/.repository/net/sf/taverna/t2/activities/wsdl-activity/1.6.test/wsdl-activity-1.6.test.pom
[INFO] Installing /var/lib/jenkins/workspace/taverna-wsdl-activity-maintenance/target/wsdl-activity-1.6.test-sources.jar to /var/lib/jenkins/workspace/taverna-wsdl-activity-maintenance/.repository/net/sf/taverna/t2/activities/wsdl-activity/1.6.test/wsdl-activity-1.6.test-sources.jar
[INFO] Installing /var/lib/jenkins/workspace/taverna-wsdl-activity-maintenance/target/wsdl-activity-1.6.test-test-sources.jar to /var/lib/jenkins/workspace/taverna-wsdl-activity-maintenance/.repository/net/sf/taverna/t2/activities/wsdl-activity/1.6.test/wsdl-activity-1.6.test-test-sources.jar
[INFO] Installing /var/lib/jenkins/workspace/taverna-wsdl-activity-maintenance/target/wsdl-activity-1.6.test-tests.jar to /var/lib/jenkins/workspace/taverna-wsdl-activity-maintenance/.repository/net/sf/taverna/t2/activities/wsdl-activity/1.6.test/wsdl-activity-1.6.test-tests.jar
[INFO] Artifactory Build Info Recorder: Saving Build Info to '/var/lib/jenkins/workspace/taverna-wsdl-activity-maintenance/target/build-info.json'
[INFO] Deploying artifact: http://repository.mygrid.org.uk/artifactory/libs-release-local/net/sf/taverna/t2/activities/wsdl-activity/1.6.test/wsdl-activity-1.6.test-sources.jar
[INFO] I/O exception (java.net.SocketException) caught when processing request: Broken pipe
[INFO] Retrying request
[INFO] I/O exception (java.net.SocketException) caught when processing request: Broken pipe
[INFO] Retrying request
[INFO] I/O exception (java.net.SocketException) caught when processing request: Broken pipe
[INFO] Retrying request
[ERROR] org.jfrog.build.extractor.maven.BuildInfoRecorder.sessionEnded() listener has failed: 
java.lang.RuntimeException: Error occurred while publishing artifact to Artifactory: /var/lib/jenkins/workspace/taverna-wsdl-activity-maintenance/target/wsdl-activity-1.6.test-sources.jar.
 Skipping deployment of remaining artifacts (if any) and build info.
	at org.jfrog.build.extractor.maven.BuildDeploymentHelper.deployArtifacts(BuildDeploymentHelper.java:272)
	at org.jfrog.build.extractor.maven.BuildDeploymentHelper.deploy(BuildDeploymentHelper.java:108)
	at org.jfrog.build.extractor.maven.BuildInfoRecorder.sessionEnded(BuildInfoRecorder.java:139)
	at org.apache.maven.lifecycle.internal.DefaultExecutionEventCatapult.fire(DefaultExecutionEventCatapult.java:64)
	at org.apache.maven.lifecycle.internal.DefaultExecutionEventCatapult.fire(DefaultExecutionEventCatapult.java:42)
	at org.apache.maven.lifecycle.internal.LifecycleStarter.execute(LifecycleStarter.java:125)
	at org.apache.maven.DefaultMaven.doExecute(DefaultMaven.java:361)
	at org.apache.maven.DefaultMaven.execute(DefaultMaven.java:155)
	at org.jvnet.hudson.maven3.launcher.Maven31Launcher.main(Maven31Launcher.java:132)
	at sun.reflect.NativeMethodAccessorImpl.invoke0(Native Method)
	at sun.reflect.NativeMethodAccessorImpl.invoke(NativeMethodAccessorImpl.java:57)
	at sun.reflect.DelegatingMethodAccessorImpl.invoke(DelegatingMethodAccessorImpl.java:43)
	at java.lang.reflect.Method.invoke(Method.java:606)
	at org.codehaus.plexus.classworlds.launcher.Launcher.launchStandard(Launcher.java:330)
	at org.codehaus.plexus.classworlds.launcher.Launcher.launch(Launcher.java:238)
	at jenkins.maven3.agent.Maven31Main.launch(Maven31Main.java:181)
	at sun.reflect.NativeMethodAccessorImpl.invoke0(Native Method)
	at sun.reflect.NativeMethodAccessorImpl.invoke(NativeMethodAccessorImpl.java:57)
	at sun.reflect.DelegatingMethodAccessorImpl.invoke(DelegatingMethodAccessorImpl.java:43)
	at java.lang.reflect.Method.invoke(Method.java:606)
	at hudson.maven.Maven3Builder.call(Maven3Builder.java:134)
	at hudson.maven.Maven3Builder.call(Maven3Builder.java:69)
	at hudson.remoting.UserRequest.perform(UserRequest.java:118)
	at hudson.remoting.UserRequest.perform(UserRequest.java:48)
	at hudson.remoting.Request$2.run(Request.java:328)
	at hudson.remoting.InterceptingExecutorService$1.call(InterceptingExecutorService.java:72)
	at java.util.concurrent.FutureTask.run(FutureTask.java:262)
	at java.util.concurrent.ThreadPoolExecutor.runWorker(ThreadPoolExecutor.java:1145)
	at java.util.concurrent.ThreadPoolExecutor$Worker.run(ThreadPoolExecutor.java:615)
	at java.lang.Thread.run(Thread.java:744)
Caused by: java.net.SocketException: Broken pipe
	at java.net.SocketOutputStream.socketWrite0(Native Method)
	at java.net.SocketOutputStream.socketWrite(SocketOutputStream.java:113)
	at java.net.SocketOutputStream.write(SocketOutputStream.java:159)
	at org.apache.http.impl.io.AbstractSessionOutputBuffer.write(AbstractSessionOutputBuffer.java:169)
	at org.apache.http.impl.io.ContentLengthOutputStream.write(ContentLengthOutputStream.java:119)
	at org.apache.http.entity.FileEntity.writeTo(FileEntity.java:107)
	at org.apache.http.entity.HttpEntityWrapper.writeTo(HttpEntityWrapper.java:98)
	at org.apache.http.impl.client.EntityEnclosingRequestWrapper$EntityWrapper.writeTo(EntityEnclosingRequestWrapper.java:108)
	at org.apache.http.impl.entity.EntitySerializer.serialize(EntitySerializer.java:122)
	at org.apache.http.impl.AbstractHttpClientConnection.sendRequestEntity(AbstractHttpClientConnection.java:271)
	at org.apache.http.impl.conn.ManagedClientConnectionImpl.sendRequestEntity(ManagedClientConnectionImpl.java:197)
	at org.apache.http.protocol.HttpRequestExecutor.doSendRequest(HttpRequestExecutor.java:257)
	at org.apache.http.protocol.HttpRequestExecutor.execute(HttpRequestExecutor.java:125)
	at org.apache.http.impl.client.DefaultRequestDirector.tryExecute(DefaultRequestDirector.java:715)
	at org.apache.http.impl.client.DefaultRequestDirector.execute(DefaultRequestDirector.java:520)
	at org.apache.http.impl.client.AbstractHttpClient.execute(AbstractHttpClient.java:906)
	at org.apache.http.impl.client.AbstractHttpClient.execute(AbstractHttpClient.java:805)
	at org.jfrog.build.client.PreemptiveHttpClient.execute(PreemptiveHttpClient.java:88)
	at org.jfrog.build.client.ArtifactoryHttpClient.execute(ArtifactoryHttpClient.java:193)
	at org.jfrog.build.client.ArtifactoryHttpClient.upload(ArtifactoryHttpClient.java:189)
	at org.jfrog.build.client.ArtifactoryBuildInfoClient.uploadFile(ArtifactoryBuildInfoClient.java:514)
	at org.jfrog.build.client.ArtifactoryBuildInfoClient.deployArtifact(ArtifactoryBuildInfoClient.java:294)
	at org.jfrog.build.extractor.maven.BuildDeploymentHelper.deployArtifacts(BuildDeploymentHelper.java:270)
	... 29 more
[ERROR] Internal error: java.lang.RuntimeException: org.jfrog.build.extractor.maven.BuildInfoRecorder.sessionEnded() listener has failed: Error occurred while publishing artifact to Artifactory: /var/lib/jenkins/workspace/taverna-wsdl-activity-maintenance/target/wsdl-activity-1.6.test-sources.jar.
[ERROR] Skipping deployment of remaining artifacts (if any) and build info. Broken pipe
[ERROR] -> [Help 1]
org.apache.maven.InternalErrorException: Internal error: java.lang.RuntimeException: org.jfrog.build.extractor.maven.BuildInfoRecorder.sessionEnded() listener has failed: 
	at org.apache.maven.DefaultMaven.execute(DefaultMaven.java:167)
	at org.jvnet.hudson.maven3.launcher.Maven31Launcher.main(Maven31Launcher.java:132)
	at sun.reflect.NativeMethodAccessorImpl.invoke0(Native Method)
	at sun.reflect.NativeMethodAccessorImpl.invoke(NativeMethodAccessorImpl.java:57)
	at sun.reflect.DelegatingMethodAccessorImpl.invoke(DelegatingMethodAccessorImpl.java:43)
	at java.lang.reflect.Method.invoke(Method.java:606)
	at org.codehaus.plexus.classworlds.launcher.Launcher.launchStandard(Launcher.java:330)
	at org.codehaus.plexus.classworlds.launcher.Launcher.launch(Launcher.java:238)
	at jenkins.maven3.agent.Maven31Main.launch(Maven31Main.java:181)
	at sun.reflect.NativeMethodAccessorImpl.invoke0(Native Method)
	at sun.reflect.NativeMethodAccessorImpl.invoke(NativeMethodAccessorImpl.java:57)
	at sun.reflect.DelegatingMethodAccessorImpl.invoke(DelegatingMethodAccessorImpl.java:43)
	at java.lang.reflect.Method.invoke(Method.java:606)
	at hudson.maven.Maven3Builder.call(Maven3Builder.java:134)
	at hudson.maven.Maven3Builder.call(Maven3Builder.java:69)
	at hudson.remoting.UserRequest.perform(UserRequest.java:118)
	at hudson.remoting.UserRequest.perform(UserRequest.java:48)
	at hudson.remoting.Request$2.run(Request.java:328)
	at hudson.remoting.InterceptingExecutorService$1.call(InterceptingExecutorService.java:72)
	at java.util.concurrent.FutureTask.run(FutureTask.java:262)
	at java.util.concurrent.ThreadPoolExecutor.runWorker(ThreadPoolExecutor.java:1145)
	at java.util.concurrent.ThreadPoolExecutor$Worker.run(ThreadPoolExecutor.java:615)
	at java.lang.Thread.run(Thread.java:744)
Caused by: java.lang.RuntimeException: org.jfrog.build.extractor.maven.BuildInfoRecorder.sessionEnded() listener has failed: 
	at org.jfrog.build.extractor.maven.BuildInfoRecorder.sessionEnded(BuildInfoRecorder.java:150)
	at org.apache.maven.lifecycle.internal.DefaultExecutionEventCatapult.fire(DefaultExecutionEventCatapult.java:64)
	at org.apache.maven.lifecycle.internal.DefaultExecutionEventCatapult.fire(DefaultExecutionEventCatapult.java:42)
	at org.apache.maven.lifecycle.internal.LifecycleStarter.execute(LifecycleStarter.java:125)
	at org.apache.maven.DefaultMaven.doExecute(DefaultMaven.java:361)
	at org.apache.maven.DefaultMaven.execute(DefaultMaven.java:155)
	... 22 more
Caused by: java.lang.RuntimeException: Error occurred while publishing artifact to Artifactory: /var/lib/jenkins/workspace/taverna-wsdl-activity-maintenance/target/wsdl-activity-1.6.test-sources.jar.
 Skipping deployment of remaining artifacts (if any) and build info.
	at org.jfrog.build.extractor.maven.BuildDeploymentHelper.deployArtifacts(BuildDeploymentHelper.java:272)
	at org.jfrog.build.extractor.maven.BuildDeploymentHelper.deploy(BuildDeploymentHelper.java:108)
	at org.jfrog.build.extractor.maven.BuildInfoRecorder.sessionEnded(BuildInfoRecorder.java:139)
	... 27 more
Caused by: java.net.SocketException: Broken pipe
	at java.net.SocketOutputStream.socketWrite0(Native Method)
	at java.net.SocketOutputStream.socketWrite(SocketOutputStream.java:113)
	at java.net.SocketOutputStream.write(SocketOutputStream.java:159)
	at org.apache.http.impl.io.AbstractSessionOutputBuffer.write(AbstractSessionOutputBuffer.java:169)
	at org.apache.http.impl.io.ContentLengthOutputStream.write(ContentLengthOutputStream.java:119)
	at org.apache.http.entity.FileEntity.writeTo(FileEntity.java:107)
	at org.apache.http.entity.HttpEntityWrapper.writeTo(HttpEntityWrapper.java:98)
	at org.apache.http.impl.client.EntityEnclosingRequestWrapper$EntityWrapper.writeTo(EntityEnclosingRequestWrapper.java:108)
	at org.apache.http.impl.entity.EntitySerializer.serialize(EntitySerializer.java:122)
	at org.apache.http.impl.AbstractHttpClientConnection.sendRequestEntity(AbstractHttpClientConnection.java:271)
	at org.apache.http.impl.conn.ManagedClientConnectionImpl.sendRequestEntity(ManagedClientConnectionImpl.java:197)
	at org.apache.http.protocol.HttpRequestExecutor.doSendRequest(HttpRequestExecutor.java:257)
	at org.apache.http.protocol.HttpRequestExecutor.execute(HttpRequestExecutor.java:125)
	at org.apache.http.impl.client.DefaultRequestDirector.tryExecute(DefaultRequestDirector.java:715)
	at org.apache.http.impl.client.DefaultRequestDirector.execute(DefaultRequestDirector.java:520)
	at org.apache.http.impl.client.AbstractHttpClient.execute(AbstractHttpClient.java:906)
	at org.apache.http.impl.client.AbstractHttpClient.execute(AbstractHttpClient.java:805)
	at org.jfrog.build.client.PreemptiveHttpClient.execute(PreemptiveHttpClient.java:88)
	at org.jfrog.build.client.ArtifactoryHttpClient.execute(ArtifactoryHttpClient.java:193)
	at org.jfrog.build.client.ArtifactoryHttpClient.upload(ArtifactoryHttpClient.java:189)
	at org.jfrog.build.client.ArtifactoryBuildInfoClient.uploadFile(ArtifactoryBuildInfoClient.java:514)
	at org.jfrog.build.client.ArtifactoryBuildInfoClient.deployArtifact(ArtifactoryBuildInfoClient.java:294)
	at org.jfrog.build.extractor.maven.BuildDeploymentHelper.deployArtifacts(BuildDeploymentHelper.java:270)
	... 29 more
[ERROR] 
[ERROR] To see the full stack trace of the errors, re-run Maven with the -e switch.
[ERROR] Re-run Maven using the -X switch to enable full debug logging.
[ERROR] 
[ERROR] For more information about the errors and possible solutions, please read the following articles:
[ERROR] [Help 1] http://cwiki.apache.org/confluence/display/MAVEN/InternalErrorException