SuccessConsole Output

[INFO]                                                                         
[INFO] ------------------------------------------------------------------------
[INFO] Building Help System (legacy dependency) 1.6-SNAPSHOT
[INFO] ------------------------------------------------------------------------
[INFO] 
[INFO] --- maven-clean-plugin:2.5:clean (default-clean) @ helper ---
[INFO] Deleting /local/jenkins/jobs/taverna-ui-impl-maintenance/workspace/helper/target
[INFO] 
[INFO] --- maven-resources-plugin:2.6:resources (default-resources) @ helper ---
[INFO] Using 'UTF-8' encoding to copy filtered resources.
[INFO] skip non existing resourceDirectory /local/jenkins/jobs/taverna-ui-impl-maintenance/workspace/helper/src/main/resources
[INFO] 
[INFO] --- maven-compiler-plugin:3.1:compile (default-compile) @ helper ---
[INFO] No sources to compile
[INFO] 
[INFO] --- maven-resources-plugin:2.6:testResources (default-testResources) @ helper ---
[INFO] Using 'UTF-8' encoding to copy filtered resources.
[INFO] skip non existing resourceDirectory /local/jenkins/jobs/taverna-ui-impl-maintenance/workspace/helper/src/test/resources
[INFO] 
[INFO] --- maven-compiler-plugin:3.1:testCompile (default-testCompile) @ helper ---
[INFO] No sources to compile
[INFO] 
[INFO] --- maven-surefire-plugin:2.17:test (default-test) @ helper ---
[INFO] No tests to run.
[JENKINS] Recording test results
[INFO] 
[INFO] --- maven-jar-plugin:2.4:jar (default-jar) @ helper ---
[WARNING] JAR will be empty - no content was marked for inclusion!
[INFO] Building jar: /local/jenkins/jobs/taverna-ui-impl-maintenance/workspace/helper/target/helper-1.6-SNAPSHOT.jar
[INFO] 
[INFO] >>> maven-source-plugin:2.2.1:jar (default) @ helper >>>
[WARNING] Failed to getClass for org.apache.maven.plugin.source.SourceJarMojo
[INFO] 
[INFO] <<< maven-source-plugin:2.2.1:jar (default) @ helper <<<
[INFO] 
[INFO] --- maven-source-plugin:2.2.1:jar (default) @ helper ---
[INFO] No sources in project. Archive not created.
[INFO] 
[INFO] >>> maven-source-plugin:2.2.1:test-jar (default) @ helper >>>
[WARNING] Failed to getClass for org.apache.maven.plugin.source.TestSourceJarMojo
[INFO] 
[INFO] <<< maven-source-plugin:2.2.1:test-jar (default) @ helper <<<
[INFO] 
[INFO] --- maven-source-plugin:2.2.1:test-jar (default) @ helper ---
[INFO] No sources in project. Archive not created.
[INFO] 
[INFO] --- maven-jar-plugin:2.4:test-jar (default) @ helper ---
[WARNING] JAR will be empty - no content was marked for inclusion!
[INFO] Building jar: /local/jenkins/jobs/taverna-ui-impl-maintenance/workspace/helper/target/helper-1.6-SNAPSHOT-tests.jar
[INFO] 
[INFO] --- maven-install-plugin:2.4:install (default-install) @ helper ---
[INFO] Installing /local/jenkins/jobs/taverna-ui-impl-maintenance/workspace/helper/target/helper-1.6-SNAPSHOT.jar to /local/jenkins/jobs/taverna-ui-impl-maintenance/workspace/.repository/net/sf/taverna/t2/ui-impl/helper/1.6-SNAPSHOT/helper-1.6-SNAPSHOT.jar
[INFO] Installing /local/jenkins/jobs/taverna-ui-impl-maintenance/workspace/helper/pom.xml to /local/jenkins/jobs/taverna-ui-impl-maintenance/workspace/.repository/net/sf/taverna/t2/ui-impl/helper/1.6-SNAPSHOT/helper-1.6-SNAPSHOT.pom
[INFO] Installing /local/jenkins/jobs/taverna-ui-impl-maintenance/workspace/helper/target/helper-1.6-SNAPSHOT-tests.jar to /local/jenkins/jobs/taverna-ui-impl-maintenance/workspace/.repository/net/sf/taverna/t2/ui-impl/helper/1.6-SNAPSHOT/helper-1.6-SNAPSHOT-tests.jar
[INFO] ------------------------------------------------------------------------
[INFO] Reactor Summary:
[INFO] 
[INFO] Taverna 2 UI implementations ...................... SUCCESS [  4.297 s]
[INFO] Activity Palette Impl ............................. SUCCESS [ 18.912 s]
[INFO] Activity tools .................................... SUCCESS [  1.228 s]
[INFO] Help System (legacy dependency) ................... SUCCESS [  0.861 s]
[INFO] Configuration Management Implementations .......... SUCCESS [  3.407 s]
[INFO] Edits implementation .............................. SUCCESS [  2.500 s]
[INFO] File opening implementation ....................... FAILURE [  0.473 s]
[INFO] Zaria ............................................. SKIPPED
[INFO] Workbench UI implementation ....................... SKIPPED
[INFO] Contextual Views Implementation ................... SKIPPED
[INFO] HTTP Proxy configuration .......................... SKIPPED
[INFO] Menu generation implementation .................... SKIPPED
[INFO] Raven plugin manager GUI .......................... SKIPPED
[INFO] Data management configuration ..................... SKIPPED
[INFO] Renderers Implementation .......................... SKIPPED
[INFO] Update manager .................................... SKIPPED
[INFO] ------------------------------------------------------------------------
[INFO] BUILD FAILURE
[INFO] ------------------------------------------------------------------------
[INFO] Total time: 38.231 s
[INFO] Finished at: 2014-10-27T15:34:13+00:00
[INFO] Final Memory: 27M/88M
[INFO] ------------------------------------------------------------------------
[ERROR] Failed to execute goal on project file-impl: Could not resolve dependencies for project net.sf.taverna.t2.ui-impl:file-impl:jar:1.6-SNAPSHOT: Could not find artifact net.sf.taverna.t2.activities:beanshell-activity:jar:1.6-SNAPSHOT in repo (http://repository.mygrid.org.uk/artifactory/repo) -> [Help 1]
[ERROR] 
[ERROR] To see the full stack trace of the errors, re-run Maven with the -e switch.
[ERROR] Re-run Maven using the -X switch to enable full debug logging.
[ERROR] 
[ERROR] For more information about the errors and possible solutions, please read the following articles:
[ERROR] [Help 1] http://cwiki.apache.org/confluence/display/MAVEN/DependencyResolutionException
[ERROR] 
[ERROR] After correcting the problems, you can resume the build with the command
[ERROR]   mvn <goals> -rf :file-impl