SuccessConsole Output

[INFO]                                                                         
[INFO] ------------------------------------------------------------------------
[INFO] Building Help System (legacy dependency) 1.6-SNAPSHOT
[INFO] ------------------------------------------------------------------------
[INFO] 
[INFO] --- maven-clean-plugin:2.5:clean (default-clean) @ helper ---
[INFO] Deleting /local/jenkins/jobs/taverna-ui-impl-maintenance/workspace/helper/target
[INFO] 
[INFO] --- maven-resources-plugin:2.6:resources (default-resources) @ helper ---
[INFO] Using 'UTF-8' encoding to copy filtered resources.
[INFO] skip non existing resourceDirectory /local/jenkins/jobs/taverna-ui-impl-maintenance/workspace/helper/src/main/resources
[INFO] 
[INFO] --- maven-compiler-plugin:3.1:compile (default-compile) @ helper ---
[INFO] No sources to compile
[INFO] 
[INFO] --- maven-resources-plugin:2.6:testResources (default-testResources) @ helper ---
[INFO] Using 'UTF-8' encoding to copy filtered resources.
[INFO] skip non existing resourceDirectory /local/jenkins/jobs/taverna-ui-impl-maintenance/workspace/helper/src/test/resources
[INFO] 
[INFO] --- maven-compiler-plugin:3.1:testCompile (default-testCompile) @ helper ---
[INFO] No sources to compile
[INFO] 
[INFO] --- maven-surefire-plugin:2.17:test (default-test) @ helper ---
[INFO] No tests to run.
[JENKINS] Recording test results
[INFO] 
[INFO] --- maven-jar-plugin:2.4:jar (default-jar) @ helper ---
[WARNING] JAR will be empty - no content was marked for inclusion!
[INFO] Building jar: /local/jenkins/jobs/taverna-ui-impl-maintenance/workspace/helper/target/helper-1.6-SNAPSHOT.jar
[INFO] 
[INFO] >>> maven-source-plugin:2.2.1:jar (default) @ helper >>>
[WARNING] Failed to getClass for org.apache.maven.plugin.source.SourceJarMojo
[INFO] 
[INFO] <<< maven-source-plugin:2.2.1:jar (default) @ helper <<<
[INFO] 
[INFO] --- maven-source-plugin:2.2.1:jar (default) @ helper ---
[INFO] No sources in project. Archive not created.
[INFO] 
[INFO] >>> maven-source-plugin:2.2.1:test-jar (default) @ helper >>>
[WARNING] Failed to getClass for org.apache.maven.plugin.source.TestSourceJarMojo
[INFO] 
[INFO] <<< maven-source-plugin:2.2.1:test-jar (default) @ helper <<<
[INFO] 
[INFO] --- maven-source-plugin:2.2.1:test-jar (default) @ helper ---
[INFO] No sources in project. Archive not created.
[INFO] 
[INFO] --- maven-jar-plugin:2.4:test-jar (default) @ helper ---
[WARNING] JAR will be empty - no content was marked for inclusion!
[INFO] Building jar: /local/jenkins/jobs/taverna-ui-impl-maintenance/workspace/helper/target/helper-1.6-SNAPSHOT-tests.jar
[INFO] 
[INFO] --- maven-install-plugin:2.4:install (default-install) @ helper ---
[INFO] Installing /local/jenkins/jobs/taverna-ui-impl-maintenance/workspace/helper/target/helper-1.6-SNAPSHOT.jar to /local/jenkins/jobs/taverna-ui-impl-maintenance/workspace/.repository/net/sf/taverna/t2/ui-impl/helper/1.6-SNAPSHOT/helper-1.6-SNAPSHOT.jar
[INFO] Installing /local/jenkins/jobs/taverna-ui-impl-maintenance/workspace/helper/pom.xml to /local/jenkins/jobs/taverna-ui-impl-maintenance/workspace/.repository/net/sf/taverna/t2/ui-impl/helper/1.6-SNAPSHOT/helper-1.6-SNAPSHOT.pom
[INFO] Installing /local/jenkins/jobs/taverna-ui-impl-maintenance/workspace/helper/target/helper-1.6-SNAPSHOT-tests.jar to /local/jenkins/jobs/taverna-ui-impl-maintenance/workspace/.repository/net/sf/taverna/t2/ui-impl/helper/1.6-SNAPSHOT/helper-1.6-SNAPSHOT-tests.jar
[INFO] ------------------------------------------------------------------------
[INFO] Reactor Summary:
[INFO] 
[INFO] Taverna 2 UI implementations ...................... SUCCESS [  3.240 s]
[INFO] Activity Palette Impl ............................. SUCCESS [  9.655 s]
[INFO] Activity tools .................................... SUCCESS [  1.309 s]
[INFO] Help System (legacy dependency) ................... SUCCESS [  0.870 s]
[INFO] Configuration Management Implementations .......... SUCCESS [  3.123 s]
[INFO] Edits implementation .............................. SUCCESS [  2.661 s]
[INFO] File opening implementation ....................... SUCCESS [  7.354 s]
[INFO] Zaria ............................................. SUCCESS [  2.868 s]
[INFO] Workbench UI implementation ....................... SUCCESS [  4.857 s]
[INFO] Contextual Views Implementation ................... FAILURE [  0.421 s]
[INFO] HTTP Proxy configuration .......................... SKIPPED
[INFO] Menu generation implementation .................... SKIPPED
[INFO] Raven plugin manager GUI .......................... SKIPPED
[INFO] Data management configuration ..................... SKIPPED
[INFO] Renderers Implementation .......................... SKIPPED
[INFO] Update manager .................................... SKIPPED
[INFO] ------------------------------------------------------------------------
[INFO] BUILD FAILURE
[INFO] ------------------------------------------------------------------------
[INFO] Total time: 45.141 s
[INFO] Finished at: 2014-08-19T17:15:44+00:00
[INFO] Final Memory: 33M/88M
[INFO] ------------------------------------------------------------------------
[ERROR] Failed to execute goal on project contextual-views-impl: Could not resolve dependencies for project net.sf.taverna.t2.ui-impl:contextual-views-impl:jar:1.6-SNAPSHOT: The following artifacts could not be resolved: net.sf.taverna.t2.lang:io:jar:1.6-SNAPSHOT, net.sf.taverna.t2.ui-api:perspective-core:jar:1.6-SNAPSHOT, net.sf.taverna.t2.infrastructure:plugins-api:jar:2.6-SNAPSHOT: Could not find artifact net.sf.taverna.t2.lang:io:jar:1.6-SNAPSHOT -> [Help 1]
org.apache.maven.lifecycle.LifecycleExecutionException: Failed to execute goal on project contextual-views-impl: Could not resolve dependencies for project net.sf.taverna.t2.ui-impl:contextual-views-impl:jar:1.6-SNAPSHOT: The following artifacts could not be resolved: net.sf.taverna.t2.lang:io:jar:1.6-SNAPSHOT, net.sf.taverna.t2.ui-api:perspective-core:jar:1.6-SNAPSHOT, net.sf.taverna.t2.infrastructure:plugins-api:jar:2.6-SNAPSHOT: Could not find artifact net.sf.taverna.t2.lang:io:jar:1.6-SNAPSHOT
	at org.apache.maven.lifecycle.internal.LifecycleDependencyResolver.getDependencies(LifecycleDependencyResolver.java:220)
	at org.apache.maven.lifecycle.internal.LifecycleDependencyResolver.resolveProjectDependencies(LifecycleDependencyResolver.java:127)
	at org.apache.maven.lifecycle.internal.MojoExecutor.ensureDependenciesAreResolved(MojoExecutor.java:257)
	at org.apache.maven.lifecycle.internal.MojoExecutor.execute(MojoExecutor.java:200)
	at org.apache.maven.lifecycle.internal.MojoExecutor.execute(MojoExecutor.java:153)
	at org.apache.maven.lifecycle.internal.MojoExecutor.execute(MojoExecutor.java:145)
	at org.apache.maven.lifecycle.internal.LifecycleModuleBuilder.buildProject(LifecycleModuleBuilder.java:108)
	at org.apache.maven.lifecycle.internal.LifecycleModuleBuilder.buildProject(LifecycleModuleBuilder.java:76)
	at org.apache.maven.lifecycle.internal.builder.singlethreaded.SingleThreadedBuilder.build(SingleThreadedBuilder.java:51)
	at org.apache.maven.lifecycle.internal.LifecycleStarter.execute(LifecycleStarter.java:116)
	at org.apache.maven.DefaultMaven.doExecute(DefaultMaven.java:361)
	at org.apache.maven.DefaultMaven.execute(DefaultMaven.java:155)
	at org.jvnet.hudson.maven3.launcher.Maven31Launcher.main(Maven31Launcher.java:132)
	at sun.reflect.NativeMethodAccessorImpl.invoke0(Native Method)
	at sun.reflect.NativeMethodAccessorImpl.invoke(NativeMethodAccessorImpl.java:57)
	at sun.reflect.DelegatingMethodAccessorImpl.invoke(DelegatingMethodAccessorImpl.java:43)
	at java.lang.reflect.Method.invoke(Method.java:606)
	at org.codehaus.plexus.classworlds.launcher.Launcher.launchStandard(Launcher.java:330)
	at org.codehaus.plexus.classworlds.launcher.Launcher.launch(Launcher.java:238)
	at jenkins.maven3.agent.Maven31Main.launch(Maven31Main.java:181)
	at sun.reflect.NativeMethodAccessorImpl.invoke0(Native Method)
	at sun.reflect.NativeMethodAccessorImpl.invoke(NativeMethodAccessorImpl.java:57)
	at sun.reflect.DelegatingMethodAccessorImpl.invoke(DelegatingMethodAccessorImpl.java:43)
	at java.lang.reflect.Method.invoke(Method.java:606)
	at hudson.maven.Maven3Builder.call(Maven3Builder.java:134)
	at hudson.maven.Maven3Builder.call(Maven3Builder.java:69)
	at hudson.remoting.UserRequest.perform(UserRequest.java:118)
	at hudson.remoting.UserRequest.perform(UserRequest.java:48)
	at hudson.remoting.Request$2.run(Request.java:328)
	at hudson.remoting.InterceptingExecutorService$1.call(InterceptingExecutorService.java:72)
	at java.util.concurrent.FutureTask.run(FutureTask.java:262)
	at java.util.concurrent.ThreadPoolExecutor.runWorker(ThreadPoolExecutor.java:1145)
	at java.util.concurrent.ThreadPoolExecutor$Worker.run(ThreadPoolExecutor.java:615)
	at java.lang.Thread.run(Thread.java:745)
Caused by: org.apache.maven.project.DependencyResolutionException: Could not resolve dependencies for project net.sf.taverna.t2.ui-impl:contextual-views-impl:jar:1.6-SNAPSHOT: The following artifacts could not be resolved: net.sf.taverna.t2.lang:io:jar:1.6-SNAPSHOT, net.sf.taverna.t2.ui-api:perspective-core:jar:1.6-SNAPSHOT, net.sf.taverna.t2.infrastructure:plugins-api:jar:2.6-SNAPSHOT: Could not find artifact net.sf.taverna.t2.lang:io:jar:1.6-SNAPSHOT
	at org.apache.maven.project.DefaultProjectDependenciesResolver.resolve(DefaultProjectDependenciesResolver.java:198)
	at org.apache.maven.lifecycle.internal.LifecycleDependencyResolver.getDependencies(LifecycleDependencyResolver.java:195)
	... 33 more
Caused by: org.eclipse.aether.resolution.DependencyResolutionException: The following artifacts could not be resolved: net.sf.taverna.t2.lang:io:jar:1.6-SNAPSHOT, net.sf.taverna.t2.ui-api:perspective-core:jar:1.6-SNAPSHOT, net.sf.taverna.t2.infrastructure:plugins-api:jar:2.6-SNAPSHOT: Could not find artifact net.sf.taverna.t2.lang:io:jar:1.6-SNAPSHOT
	at org.eclipse.aether.internal.impl.DefaultRepositorySystem.resolveDependencies(DefaultRepositorySystem.java:384)
	at org.apache.maven.project.DefaultProjectDependenciesResolver.resolve(DefaultProjectDependenciesResolver.java:192)
	... 34 more
Caused by: org.eclipse.aether.resolution.ArtifactResolutionException: The following artifacts could not be resolved: net.sf.taverna.t2.lang:io:jar:1.6-SNAPSHOT, net.sf.taverna.t2.ui-api:perspective-core:jar:1.6-SNAPSHOT, net.sf.taverna.t2.infrastructure:plugins-api:jar:2.6-SNAPSHOT: Could not find artifact net.sf.taverna.t2.lang:io:jar:1.6-SNAPSHOT
	at org.eclipse.aether.internal.impl.DefaultArtifactResolver.resolve(DefaultArtifactResolver.java:459)
	at org.eclipse.aether.internal.impl.DefaultArtifactResolver.resolveArtifacts(DefaultArtifactResolver.java:262)
	at org.eclipse.aether.internal.impl.DefaultRepositorySystem.resolveDependencies(DefaultRepositorySystem.java:367)
	... 35 more
Caused by: org.eclipse.aether.transfer.ArtifactNotFoundException: Could not find artifact net.sf.taverna.t2.lang:io:jar:1.6-SNAPSHOT
	at org.eclipse.aether.internal.impl.DefaultArtifactResolver.resolve(DefaultArtifactResolver.java:449)
	... 37 more
[ERROR] 
[ERROR] Re-run Maven using the -X switch to enable full debug logging.
[ERROR] 
[ERROR] For more information about the errors and possible solutions, please read the following articles:
[ERROR] [Help 1] http://cwiki.apache.org/confluence/display/MAVEN/DependencyResolutionException
[ERROR] 
[ERROR] After correcting the problems, you can resume the build with the command
[ERROR]   mvn <goals> -rf :contextual-views-impl