SuccessConsole Output

[INFO]                                                                         
[INFO] ------------------------------------------------------------------------
[INFO] Building Help System (legacy dependency) 1.6-SNAPSHOT
[INFO] ------------------------------------------------------------------------
[INFO] Downloading: http://repository.mygrid.org.uk/artifactory/repo/net/sf/taverna/t2/ui-api/helper-api/1.6-SNAPSHOT/maven-metadata.xml
[INFO] Downloaded: http://repository.mygrid.org.uk/artifactory/repo/net/sf/taverna/t2/ui-api/helper-api/1.6-SNAPSHOT/maven-metadata.xml (2 KB at 37.6 KB/sec)
[INFO] 
[INFO] --- maven-clean-plugin:2.5:clean (default-clean) @ helper ---
[INFO] Deleting /local/jenkins/jobs/taverna-ui-impl-maintenance/workspace/helper/target
[INFO] 
[INFO] --- maven-resources-plugin:2.6:resources (default-resources) @ helper ---
[INFO] Using 'UTF-8' encoding to copy filtered resources.
[INFO] skip non existing resourceDirectory /local/jenkins/jobs/taverna-ui-impl-maintenance/workspace/helper/src/main/resources
[INFO] 
[INFO] --- maven-compiler-plugin:3.1:compile (default-compile) @ helper ---
[INFO] No sources to compile
[INFO] 
[INFO] --- maven-resources-plugin:2.6:testResources (default-testResources) @ helper ---
[INFO] Using 'UTF-8' encoding to copy filtered resources.
[INFO] skip non existing resourceDirectory /local/jenkins/jobs/taverna-ui-impl-maintenance/workspace/helper/src/test/resources
[INFO] 
[INFO] --- maven-compiler-plugin:3.1:testCompile (default-testCompile) @ helper ---
[INFO] No sources to compile
[INFO] 
[INFO] --- maven-surefire-plugin:2.17:test (default-test) @ helper ---
[INFO] No tests to run.
[JENKINS] Recording test results
[INFO] 
[INFO] --- maven-jar-plugin:2.4:jar (default-jar) @ helper ---
[WARNING] JAR will be empty - no content was marked for inclusion!
[INFO] Building jar: /local/jenkins/jobs/taverna-ui-impl-maintenance/workspace/helper/target/helper-1.6-SNAPSHOT.jar
[INFO] 
[INFO] >>> maven-source-plugin:2.2.1:jar (default) @ helper >>>
[WARNING] Failed to getClass for org.apache.maven.plugin.source.SourceJarMojo
[INFO] 
[INFO] <<< maven-source-plugin:2.2.1:jar (default) @ helper <<<
[INFO] 
[INFO] --- maven-source-plugin:2.2.1:jar (default) @ helper ---
[INFO] No sources in project. Archive not created.
[INFO] 
[INFO] >>> maven-source-plugin:2.2.1:test-jar (default) @ helper >>>
[WARNING] Failed to getClass for org.apache.maven.plugin.source.TestSourceJarMojo
[INFO] 
[INFO] <<< maven-source-plugin:2.2.1:test-jar (default) @ helper <<<
[INFO] 
[INFO] --- maven-source-plugin:2.2.1:test-jar (default) @ helper ---
[INFO] No sources in project. Archive not created.
[INFO] 
[INFO] --- maven-jar-plugin:2.4:test-jar (default) @ helper ---
[WARNING] JAR will be empty - no content was marked for inclusion!
[INFO] Building jar: /local/jenkins/jobs/taverna-ui-impl-maintenance/workspace/helper/target/helper-1.6-SNAPSHOT-tests.jar
[INFO] 
[INFO] --- maven-install-plugin:2.4:install (default-install) @ helper ---
[INFO] Installing /local/jenkins/jobs/taverna-ui-impl-maintenance/workspace/helper/target/helper-1.6-SNAPSHOT.jar to /local/jenkins/jobs/taverna-ui-impl-maintenance/workspace/.repository/net/sf/taverna/t2/ui-impl/helper/1.6-SNAPSHOT/helper-1.6-SNAPSHOT.jar
[INFO] Installing /local/jenkins/jobs/taverna-ui-impl-maintenance/workspace/helper/pom.xml to /local/jenkins/jobs/taverna-ui-impl-maintenance/workspace/.repository/net/sf/taverna/t2/ui-impl/helper/1.6-SNAPSHOT/helper-1.6-SNAPSHOT.pom
[INFO] Installing /local/jenkins/jobs/taverna-ui-impl-maintenance/workspace/helper/target/helper-1.6-SNAPSHOT-tests.jar to /local/jenkins/jobs/taverna-ui-impl-maintenance/workspace/.repository/net/sf/taverna/t2/ui-impl/helper/1.6-SNAPSHOT/helper-1.6-SNAPSHOT-tests.jar
[INFO] ------------------------------------------------------------------------
[INFO] Reactor Summary:
[INFO] 
[INFO] Taverna 2 UI implementations ...................... SUCCESS [  4.080 s]
[INFO] Activity Palette Impl ............................. SUCCESS [ 19.051 s]
[INFO] Activity tools .................................... SUCCESS [  1.817 s]
[INFO] Help System (legacy dependency) ................... SUCCESS [  0.908 s]
[INFO] Configuration Management Implementations .......... SUCCESS [  3.650 s]
[INFO] Edits implementation .............................. SUCCESS [  3.181 s]
[INFO] File opening implementation ....................... SUCCESS [  9.295 s]
[INFO] Zaria ............................................. SUCCESS [  2.812 s]
[INFO] Workbench UI implementation ....................... FAILURE [  6.800 s]
[INFO] Contextual Views Implementation ................... SKIPPED
[INFO] HTTP Proxy configuration .......................... SKIPPED
[INFO] Menu generation implementation .................... SKIPPED
[INFO] Raven plugin manager GUI .......................... SKIPPED
[INFO] Data management configuration ..................... SKIPPED
[INFO] Renderers Implementation .......................... SKIPPED
[INFO] Update manager .................................... SKIPPED
[INFO] ------------------------------------------------------------------------
[INFO] BUILD FAILURE
[INFO] ------------------------------------------------------------------------
[INFO] Total time: 01:01 min
[INFO] Finished at: 2014-08-11T14:45:37+00:00
[INFO] Final Memory: 31M/88M
[INFO] ------------------------------------------------------------------------
[ERROR] Failed to execute goal on project workbench-impl: Could not resolve dependencies for project net.sf.taverna.t2.ui-impl:workbench-impl:jar:1.6-SNAPSHOT: The following artifacts could not be resolved: net.sf.taverna.t2.ui-api:common-icons:jar:1.6-SNAPSHOT, net.sf.taverna.t2.ui-api:workbench-api:jar:1.6-SNAPSHOT, net.sf.taverna.t2.ui-api:file-api:jar:1.6-SNAPSHOT, net.sf.taverna.t2.ui-api:edits-api:jar:1.6-SNAPSHOT, net.sf.taverna.t2.ui-api:menu-api:jar:1.6-SNAPSHOT, net.sf.taverna.t2.ui-api:helper-api:jar:1.6-SNAPSHOT, net.sf.taverna.t2.ui-api:configuration-api:jar:1.6-SNAPSHOT: Could not find artifact net.sf.taverna.t2.ui-api:common-icons:jar:1.6-SNAPSHOT -> [Help 1]
[ERROR] 
[ERROR] To see the full stack trace of the errors, re-run Maven with the -e switch.
[ERROR] Re-run Maven using the -X switch to enable full debug logging.
[ERROR] 
[ERROR] For more information about the errors and possible solutions, please read the following articles:
[ERROR] [Help 1] http://cwiki.apache.org/confluence/display/MAVEN/DependencyResolutionException
[ERROR] 
[ERROR] After correcting the problems, you can resume the build with the command
[ERROR]   mvn <goals> -rf :workbench-impl