SuccessConsole Output

[INFO]                                                                         
[INFO] ------------------------------------------------------------------------
[INFO] Building Results and outputs from a workflow run 1.6-SNAPSHOT
[INFO] ------------------------------------------------------------------------
[INFO] Downloading: http://repository.mygrid.org.uk/artifactory/repo/net/sf/taverna/t2/results/results/1.6-SNAPSHOT/maven-metadata.xml
[INFO] Downloaded: http://repository.mygrid.org.uk/artifactory/repo/net/sf/taverna/t2/results/results/1.6-SNAPSHOT/maven-metadata.xml (2 KB at 18.5 KB/sec)
[INFO] Downloading: http://repository.mygrid.org.uk/artifactory/repo/uk/org/mygrid/resources/mimeutil/mime-util/2.1.2-x-SNAPSHOT/maven-metadata.xml
[INFO] Downloaded: http://repository.mygrid.org.uk/artifactory/repo/uk/org/mygrid/resources/mimeutil/mime-util/2.1.2-x-SNAPSHOT/maven-metadata.xml (785 B at 11.6 KB/sec)
[INFO] Downloading: http://repository.mygrid.org.uk/artifactory/repo/net/sf/taverna/t2/ui-api/renderers-api/1.6-SNAPSHOT/maven-metadata.xml
[INFO] Downloaded: http://repository.mygrid.org.uk/artifactory/repo/net/sf/taverna/t2/ui-api/renderers-api/1.6-SNAPSHOT/maven-metadata.xml (2 KB at 14.1 KB/sec)
[INFO] Downloading: http://repository.mygrid.org.uk/artifactory/repo/net/sf/taverna/t2/core/provenanceconnector/1.6-SNAPSHOT/maven-metadata.xml
[INFO] Downloaded: http://repository.mygrid.org.uk/artifactory/repo/net/sf/taverna/t2/core/provenanceconnector/1.6-SNAPSHOT/maven-metadata.xml (2 KB at 19.5 KB/sec)
[INFO] Downloading: http://repository.mygrid.org.uk/artifactory/repo/net/sf/taverna/t2/provenance-client/1.6-SNAPSHOT/maven-metadata.xml
[INFO] Downloaded: http://repository.mygrid.org.uk/artifactory/repo/net/sf/taverna/t2/provenance-client/1.6-SNAPSHOT/maven-metadata.xml (2 KB at 11.3 KB/sec)
[INFO] Downloading: http://repository.mygrid.org.uk/artifactory/repo/net/sf/taverna/t2/core/provenance-mysql/1.6-SNAPSHOT/maven-metadata.xml
[INFO] Downloaded: http://repository.mygrid.org.uk/artifactory/repo/net/sf/taverna/t2/core/provenance-mysql/1.6-SNAPSHOT/maven-metadata.xml (2 KB at 18.0 KB/sec)
[INFO] Downloading: http://repository.mygrid.org.uk/artifactory/repo/net/sf/taverna/t2/core/provenance-derby/1.6-SNAPSHOT/maven-metadata.xml
[INFO] Downloaded: http://repository.mygrid.org.uk/artifactory/repo/net/sf/taverna/t2/core/provenance-derby/1.6-SNAPSHOT/maven-metadata.xml (2 KB at 28.8 KB/sec)
[INFO] Downloading: http://repository.mygrid.org.uk/artifactory/repo/net/sf/taverna/t2/results/results/1.6-SNAPSHOT/results-1.6-20140811.101003-14.jar
[INFO] Downloading: http://repository.mygrid.org.uk/artifactory/repo/uk/org/mygrid/resources/mimeutil/mime-util/2.1.2-x-SNAPSHOT/mime-util-2.1.2-x-20140514.145941-2.jar
[INFO] Downloading: http://repository.mygrid.org.uk/artifactory/repo/net/sf/taverna/t2/ui-api/renderers-api/1.6-SNAPSHOT/renderers-api-1.6-20140819.160627-13.jar
[INFO] Downloading: http://repository.mygrid.org.uk/artifactory/repo/net/sf/taverna/t2/core/provenanceconnector/1.6-SNAPSHOT/provenanceconnector-1.6-20140811.100808-13.jar
[INFO] Downloading: http://repository.mygrid.org.uk/artifactory/repo/net/sf/taverna/t2/provenance-client/1.6-SNAPSHOT/provenance-client-1.6-20140819.162011-17.jar
[INFO] Downloaded: http://repository.mygrid.org.uk/artifactory/repo/net/sf/taverna/t2/provenance-client/1.6-SNAPSHOT/provenance-client-1.6-20140819.162011-17.jar (0 B at 0.0 KB/sec)
[INFO] Downloading: http://repository.mygrid.org.uk/artifactory/repo/net/sf/taverna/t2/core/provenance-mysql/1.6-SNAPSHOT/provenance-mysql-1.6-20140811.101041-13.jar
[INFO] Downloaded: http://repository.mygrid.org.uk/artifactory/repo/uk/org/mygrid/resources/mimeutil/mime-util/2.1.2-x-SNAPSHOT/mime-util-2.1.2-x-20140514.145941-2.jar (0 B at 0.0 KB/sec)
[INFO] Downloading: http://repository.mygrid.org.uk/artifactory/repo/net/sf/taverna/t2/core/provenance-derby/1.6-SNAPSHOT/provenance-derby-1.6-20140819.161855-16.jar
[INFO] Downloaded: http://repository.mygrid.org.uk/artifactory/repo/net/sf/taverna/t2/ui-api/renderers-api/1.6-SNAPSHOT/renderers-api-1.6-20140819.160627-13.jar (0 B at 0.0 KB/sec)
[INFO] Downloaded: http://repository.mygrid.org.uk/artifactory/repo/net/sf/taverna/t2/core/provenanceconnector/1.6-SNAPSHOT/provenanceconnector-1.6-20140811.100808-13.jar (0 B at 0.0 KB/sec)
[INFO] Downloaded: http://repository.mygrid.org.uk/artifactory/repo/net/sf/taverna/t2/results/results/1.6-SNAPSHOT/results-1.6-20140811.101003-14.jar (0 B at 0.0 KB/sec)
[INFO] Downloaded: http://repository.mygrid.org.uk/artifactory/repo/net/sf/taverna/t2/core/provenance-derby/1.6-SNAPSHOT/provenance-derby-1.6-20140819.161855-16.jar (0 B at 0.0 KB/sec)
[INFO] Downloaded: http://repository.mygrid.org.uk/artifactory/repo/net/sf/taverna/t2/core/provenance-mysql/1.6-SNAPSHOT/provenance-mysql-1.6-20140811.101041-13.jar (0 B at 0.0 KB/sec)
[INFO] 
[INFO] --- maven-clean-plugin:2.5:clean (default-clean) @ results-view ---
[INFO] Deleting /var/lib/jenkins/workspace/taverna-ui-components-maintenance/results-view/target
[INFO] 
[INFO] --- maven-resources-plugin:2.6:resources (default-resources) @ results-view ---
[INFO] Using 'UTF-8' encoding to copy filtered resources.
[INFO] Copying 4 resources
[INFO] 
[INFO] --- maven-compiler-plugin:3.1:compile (default-compile) @ results-view ---
[INFO] Changes detected - recompiling the module!
[INFO] Compiling 33 source files to /var/lib/jenkins/workspace/taverna-ui-components-maintenance/results-view/target/classes
[WARNING] /var/lib/jenkins/workspace/taverna-ui-components-maintenance/results-view/src/main/java/net/sf/taverna/t2/workbench/views/results/saveactions/SaveAllResultsAsExcel.java: /var/lib/jenkins/workspace/taverna-ui-components-maintenance/results-view/src/main/java/net/sf/taverna/t2/workbench/views/results/saveactions/SaveAllResultsAsExcel.java uses or overrides a deprecated API.
[WARNING] /var/lib/jenkins/workspace/taverna-ui-components-maintenance/results-view/src/main/java/net/sf/taverna/t2/workbench/views/results/saveactions/SaveAllResultsAsExcel.java: Recompile with -Xlint:deprecation for details.
[WARNING] /var/lib/jenkins/workspace/taverna-ui-components-maintenance/results-view/src/main/java/net/sf/taverna/t2/workbench/views/results/processor/ProcessorResultsComponent.java: Some input files use unchecked or unsafe operations.
[WARNING] /var/lib/jenkins/workspace/taverna-ui-components-maintenance/results-view/src/main/java/net/sf/taverna/t2/workbench/views/results/processor/ProcessorResultsComponent.java: Recompile with -Xlint:unchecked for details.
[INFO] 
[INFO] --- maven-resources-plugin:2.6:testResources (default-testResources) @ results-view ---
[INFO] Using 'UTF-8' encoding to copy filtered resources.
[INFO] skip non existing resourceDirectory /var/lib/jenkins/workspace/taverna-ui-components-maintenance/results-view/src/test/resources
[INFO] 
[INFO] --- maven-compiler-plugin:3.1:testCompile (default-testCompile) @ results-view ---
[INFO] No sources to compile
[INFO] 
[INFO] --- maven-surefire-plugin:2.17:test (default-test) @ results-view ---
[INFO] No tests to run.
[JENKINS] Recording test results
[INFO] 
[INFO] --- maven-jar-plugin:2.4:jar (default-jar) @ results-view ---
[INFO] Building jar: /var/lib/jenkins/workspace/taverna-ui-components-maintenance/results-view/target/results-view-1.6-SNAPSHOT.jar
[INFO] 
[INFO] >>> maven-source-plugin:2.2.1:jar (default) @ results-view >>>
[WARNING] Failed to getClass for org.apache.maven.plugin.source.SourceJarMojo
[INFO] 
[INFO] <<< maven-source-plugin:2.2.1:jar (default) @ results-view <<<
[INFO] 
[INFO] --- maven-source-plugin:2.2.1:jar (default) @ results-view ---
[INFO] Building jar: /var/lib/jenkins/workspace/taverna-ui-components-maintenance/results-view/target/results-view-1.6-SNAPSHOT-sources.jar
[INFO] 
[INFO] >>> maven-source-plugin:2.2.1:test-jar (default) @ results-view >>>
[WARNING] Failed to getClass for org.apache.maven.plugin.source.TestSourceJarMojo
[INFO] 
[INFO] <<< maven-source-plugin:2.2.1:test-jar (default) @ results-view <<<
[INFO] 
[INFO] --- maven-source-plugin:2.2.1:test-jar (default) @ results-view ---
[INFO] No sources in project. Archive not created.
[INFO] 
[INFO] --- maven-jar-plugin:2.4:test-jar (default) @ results-view ---
[WARNING] JAR will be empty - no content was marked for inclusion!
[INFO] Building jar: /var/lib/jenkins/workspace/taverna-ui-components-maintenance/results-view/target/results-view-1.6-SNAPSHOT-tests.jar
[INFO] 
[INFO] --- maven-install-plugin:2.4:install (default-install) @ results-view ---
[INFO] Installing /var/lib/jenkins/workspace/taverna-ui-components-maintenance/results-view/target/results-view-1.6-SNAPSHOT.jar to /var/lib/jenkins/workspace/taverna-ui-components-maintenance/.repository/net/sf/taverna/t2/ui-components/results-view/1.6-SNAPSHOT/results-view-1.6-SNAPSHOT.jar
[INFO] Installing /var/lib/jenkins/workspace/taverna-ui-components-maintenance/results-view/pom.xml to /var/lib/jenkins/workspace/taverna-ui-components-maintenance/.repository/net/sf/taverna/t2/ui-components/results-view/1.6-SNAPSHOT/results-view-1.6-SNAPSHOT.pom
[INFO] Installing /var/lib/jenkins/workspace/taverna-ui-components-maintenance/results-view/target/results-view-1.6-SNAPSHOT-sources.jar to /var/lib/jenkins/workspace/taverna-ui-components-maintenance/.repository/net/sf/taverna/t2/ui-components/results-view/1.6-SNAPSHOT/results-view-1.6-SNAPSHOT-sources.jar
[INFO] Installing /var/lib/jenkins/workspace/taverna-ui-components-maintenance/results-view/target/results-view-1.6-SNAPSHOT-tests.jar to /var/lib/jenkins/workspace/taverna-ui-components-maintenance/.repository/net/sf/taverna/t2/ui-components/results-view/1.6-SNAPSHOT/results-view-1.6-SNAPSHOT-tests.jar
[INFO] ------------------------------------------------------------------------
[INFO] Reactor Summary:
[INFO] 
[INFO] Taverna 2 UI components ........................... SUCCESS [  3.673 s]
[INFO] Design UI ......................................... SUCCESS [  9.320 s]
[INFO] Workflow View ..................................... SUCCESS [  2.909 s]
[INFO] Activity Palette UI Component ..................... SUCCESS [  3.252 s]
[INFO] Menu generation API ............................... SUCCESS [  2.779 s]
[INFO] Contextual views .................................. SUCCESS [  2.134 s]
[INFO] Credential Manager UI ............................. SUCCESS [  3.094 s]
[INFO] Data management configuration UI components ....... SUCCESS [  1.974 s]
[INFO] Graph Model ....................................... SUCCESS [ 25.841 s]
[INFO] Results Perspective ............................... SUCCESS [  1.762 s]
[INFO] Graph View ........................................ SUCCESS [  2.749 s]
[INFO] Results and outputs from a workflow run ........... SUCCESS [  5.712 s]
[INFO] Monitor View ...................................... SUCCESS [  2.242 s]
[INFO] Design perspective ................................ SUCCESS [  2.049 s]
[INFO] Reporting view .................................... SUCCESS [  3.450 s]
[INFO] T2 reference manager user interface ............... SUCCESS [  5.737 s]
[INFO] Run UI ............................................ FAILURE [ 37.490 s]
[INFO] Workflow Explorer ................................. SKIPPED
[INFO] ------------------------------------------------------------------------
[INFO] BUILD FAILURE
[INFO] ------------------------------------------------------------------------
[INFO] Total time: 02:31 min
[INFO] Finished at: 2014-08-19T17:36:57+00:00
[INFO] Final Memory: 49M/259M
[INFO] ------------------------------------------------------------------------
[ERROR] Failed to execute goal on project run-ui: Could not resolve dependencies for project net.sf.taverna.t2.ui-components:run-ui:jar:1.6-SNAPSHOT: Could not find artifact net.sf.taverna.t2.ui-api:report-api:jar:1.6-SNAPSHOT -> [Help 1]
[ERROR] 
[ERROR] To see the full stack trace of the errors, re-run Maven with the -e switch.
[ERROR] Re-run Maven using the -X switch to enable full debug logging.
[ERROR] 
[ERROR] For more information about the errors and possible solutions, please read the following articles:
[ERROR] [Help 1] http://cwiki.apache.org/confluence/display/MAVEN/DependencyResolutionException
[ERROR] 
[ERROR] After correcting the problems, you can resume the build with the command
[ERROR]   mvn <goals> -rf :run-ui