FailedConsole Output

Skipping 179 KB.. Full Log
tory/repo/org/apache/derby/derbyclient/10.6.1.0/derbyclient-10.6.1.0.jar (514 KB at 99.4 KB/sec)
[INFO] Downloaded: http://repository.mygrid.org.uk/artifactory/repo/org/apache/derby/derby/10.6.1.0/derby-10.6.1.0.jar (2563 KB at 536.4 KB/sec)
[INFO] Downloading: http://repository.mygrid.org.uk/artifactory/repo/commons-pool/commons-pool/1.5.4/commons-pool-1.5.4.jar
[INFO] Downloading: http://repository.mygrid.org.uk/artifactory/repo/org/springframework/spring-aop/2.5.4/spring-aop-2.5.4.jar
[INFO] Downloaded: http://repository.mygrid.org.uk/artifactory/repo/org/apache/derby/derbynet/10.6.1.0/derbynet-10.6.1.0.jar (231 KB at 42.9 KB/sec)
[INFO] Downloading: http://repository.mygrid.org.uk/artifactory/repo/org/aspectj/aspectjrt/1.6.9/aspectjrt-1.6.9.jar
[INFO] Downloaded: http://repository.mygrid.org.uk/artifactory/repo/simple-jndi/simple-jndi/0.11.1/simple-jndi-0.11.1.jar (41 KB at 7.5 KB/sec)
[INFO] Downloading: http://repository.mygrid.org.uk/artifactory/repo/org/aspectj/aspectjweaver/1.6.9/aspectjweaver-1.6.9.jar
[INFO] Downloaded: http://repository.mygrid.org.uk/artifactory/repo/commons-dbcp/commons-dbcp/1.4/commons-dbcp-1.4.jar (157 KB at 25.9 KB/sec)
[INFO] Downloaded: http://repository.mygrid.org.uk/artifactory/repo/org/aspectj/aspectjrt/1.6.9/aspectjrt-1.6.9.jar (114 KB at 59.9 KB/sec)
[INFO] Downloaded: http://repository.mygrid.org.uk/artifactory/repo/org/springframework/spring-aop/2.5.4/spring-aop-2.5.4.jar (319 KB at 117.7 KB/sec)
[INFO] Downloaded: http://repository.mygrid.org.uk/artifactory/repo/commons-pool/commons-pool/1.5.4/commons-pool-1.5.4.jar (94 KB at 32.8 KB/sec)
[INFO] Downloaded: http://repository.mygrid.org.uk/artifactory/repo/org/aspectj/aspectjweaver/1.6.9/aspectjweaver-1.6.9.jar (1625 KB at 655.9 KB/sec)
[INFO] 
[INFO] --- maven-clean-plugin:2.5:clean (default-clean) @ data-management-config-ui ---
[INFO] Deleting /local/jenkins/jobs/taverna-ui-components-maintenance/workspace/data-management-config-ui/target
[INFO] 
[INFO] --- maven-resources-plugin:2.6:resources (default-resources) @ data-management-config-ui ---
[INFO] Using 'UTF-8' encoding to copy filtered resources.
[INFO] Copying 1 resource
[INFO] 
[INFO] --- maven-compiler-plugin:3.1:compile (default-compile) @ data-management-config-ui ---
[INFO] Changes detected - recompiling the module!
[INFO] Compiling 2 source files to /local/jenkins/jobs/taverna-ui-components-maintenance/workspace/data-management-config-ui/target/classes
[INFO] 
[INFO] --- maven-resources-plugin:2.6:testResources (default-testResources) @ data-management-config-ui ---
[INFO] Using 'UTF-8' encoding to copy filtered resources.
[INFO] skip non existing resourceDirectory /local/jenkins/jobs/taverna-ui-components-maintenance/workspace/data-management-config-ui/src/test/resources
[INFO] 
[INFO] --- maven-compiler-plugin:3.1:testCompile (default-testCompile) @ data-management-config-ui ---
[INFO] No sources to compile
[INFO] 
[INFO] --- maven-surefire-plugin:2.17:test (default-test) @ data-management-config-ui ---
[INFO] No tests to run.
[JENKINS] Recording test results
[INFO] 
[INFO] --- maven-jar-plugin:2.4:jar (default-jar) @ data-management-config-ui ---
[INFO] Building jar: /local/jenkins/jobs/taverna-ui-components-maintenance/workspace/data-management-config-ui/target/data-management-config-ui-1.6-SNAPSHOT.jar
[INFO] 
[INFO] >>> maven-source-plugin:2.2.1:jar (default) @ data-management-config-ui >>>
[WARNING] Failed to getClass for org.apache.maven.plugin.source.SourceJarMojo
[INFO] 
[INFO] <<< maven-source-plugin:2.2.1:jar (default) @ data-management-config-ui <<<
[INFO] 
[INFO] --- maven-source-plugin:2.2.1:jar (default) @ data-management-config-ui ---
[INFO] Building jar: /local/jenkins/jobs/taverna-ui-components-maintenance/workspace/data-management-config-ui/target/data-management-config-ui-1.6-SNAPSHOT-sources.jar
[INFO] 
[INFO] >>> maven-source-plugin:2.2.1:test-jar (default) @ data-management-config-ui >>>
[WARNING] Failed to getClass for org.apache.maven.plugin.source.TestSourceJarMojo
[INFO] 
[INFO] <<< maven-source-plugin:2.2.1:test-jar (default) @ data-management-config-ui <<<
[INFO] 
[INFO] --- maven-source-plugin:2.2.1:test-jar (default) @ data-management-config-ui ---
[INFO] No sources in project. Archive not created.
[INFO] 
[INFO] --- maven-jar-plugin:2.4:test-jar (default) @ data-management-config-ui ---
[WARNING] JAR will be empty - no content was marked for inclusion!
[INFO] Building jar: /local/jenkins/jobs/taverna-ui-components-maintenance/workspace/data-management-config-ui/target/data-management-config-ui-1.6-SNAPSHOT-tests.jar
[INFO] 
[INFO] --- maven-install-plugin:2.4:install (default-install) @ data-management-config-ui ---
[INFO] Installing /local/jenkins/jobs/taverna-ui-components-maintenance/workspace/data-management-config-ui/target/data-management-config-ui-1.6-SNAPSHOT.jar to /local/jenkins/jobs/taverna-ui-components-maintenance/workspace/.repository/net/sf/taverna/t2/ui-components/data-management-config-ui/1.6-SNAPSHOT/data-management-config-ui-1.6-SNAPSHOT.jar
[INFO] Installing /local/jenkins/jobs/taverna-ui-components-maintenance/workspace/data-management-config-ui/pom.xml to /local/jenkins/jobs/taverna-ui-components-maintenance/workspace/.repository/net/sf/taverna/t2/ui-components/data-management-config-ui/1.6-SNAPSHOT/data-management-config-ui-1.6-SNAPSHOT.pom
[INFO] Installing /local/jenkins/jobs/taverna-ui-components-maintenance/workspace/data-management-config-ui/target/data-management-config-ui-1.6-SNAPSHOT-sources.jar to /local/jenkins/jobs/taverna-ui-components-maintenance/workspace/.repository/net/sf/taverna/t2/ui-components/data-management-config-ui/1.6-SNAPSHOT/data-management-config-ui-1.6-SNAPSHOT-sources.jar
[INFO] Installing /local/jenkins/jobs/taverna-ui-components-maintenance/workspace/data-management-config-ui/target/data-management-config-ui-1.6-SNAPSHOT-tests.jar to /local/jenkins/jobs/taverna-ui-components-maintenance/workspace/.repository/net/sf/taverna/t2/ui-components/data-management-config-ui/1.6-SNAPSHOT/data-management-config-ui-1.6-SNAPSHOT-tests.jar
[INFO]                                                                         
[INFO] ------------------------------------------------------------------------
[INFO] Building Graph Model 1.6-SNAPSHOT
[INFO] ------------------------------------------------------------------------
[INFO] Downloading: http://repository.mygrid.org.uk/artifactory/repo/org/codehaus/mojo/javacc-maven-plugin/2.6/javacc-maven-plugin-2.6.pom
[INFO] Downloaded: http://repository.mygrid.org.uk/artifactory/repo/org/codehaus/mojo/javacc-maven-plugin/2.6/javacc-maven-plugin-2.6.pom (7 KB at 3.0 KB/sec)
[INFO] Downloading: http://repository.mygrid.org.uk/artifactory/repo/org/codehaus/mojo/javacc-maven-plugin/2.6/javacc-maven-plugin-2.6.pom
[INFO] Downloaded: http://repository.mygrid.org.uk/artifactory/repo/org/codehaus/mojo/javacc-maven-plugin/2.6/javacc-maven-plugin-2.6.pom (7 KB at 10.0 KB/sec)
[INFO] Downloading: http://repository.mygrid.org.uk/artifactory/repo/org/codehaus/mojo/mojo-parent/22/mojo-parent-22.pom
[INFO] Downloaded: http://repository.mygrid.org.uk/artifactory/repo/org/codehaus/mojo/mojo-parent/22/mojo-parent-22.pom (19 KB at 9.0 KB/sec)
[INFO] Downloading: http://repository.mygrid.org.uk/artifactory/repo/org/codehaus/mojo/javacc-maven-plugin/2.6/javacc-maven-plugin-2.6.jar
[INFO] Downloaded: http://repository.mygrid.org.uk/artifactory/repo/org/codehaus/mojo/javacc-maven-plugin/2.6/javacc-maven-plugin-2.6.jar (73 KB at 62.4 KB/sec)
[INFO] Downloading: http://repository.mygrid.org.uk/artifactory/repo/net/sf/taverna/t2/activities/activity-test-utils/1.6-SNAPSHOT/maven-metadata.xml
[INFO] Downloaded: http://repository.mygrid.org.uk/artifactory/repo/net/sf/taverna/t2/activities/activity-test-utils/1.6-SNAPSHOT/maven-metadata.xml (2 KB at 1.5 KB/sec)
[INFO] Downloading: http://repository.mygrid.org.uk/artifactory/repo/net/sf/taverna/t2/activities/activity-test-utils/1.6-SNAPSHOT/activity-test-utils-1.6-20140612.105641-10.pom
[INFO] Downloaded: http://repository.mygrid.org.uk/artifactory/repo/net/sf/taverna/t2/activities/activity-test-utils/1.6-SNAPSHOT/activity-test-utils-1.6-20140612.105641-10.pom (3 KB at 2.0 KB/sec)
[INFO] Downloading: http://repository.mygrid.org.uk/artifactory/repo/net/sf/taverna/t2/core/reference-core-extensions/1.6-SNAPSHOT/maven-metadata.xml
[INFO] Downloaded: http://repository.mygrid.org.uk/artifactory/repo/net/sf/taverna/t2/core/reference-core-extensions/1.6-SNAPSHOT/maven-metadata.xml (2 KB at 0.3 KB/sec)
[INFO] Downloading: http://repository.mygrid.org.uk/artifactory/repo/net/sf/taverna/t2/core/reference-core-extensions/1.6-SNAPSHOT/reference-core-extensions-1.6-20140612.105547-10.pom
[INFO] Downloaded: http://repository.mygrid.org.uk/artifactory/repo/net/sf/taverna/t2/core/reference-core-extensions/1.6-SNAPSHOT/reference-core-extensions-1.6-20140612.105547-10.pom (3 KB at 3.0 KB/sec)
[INFO] Downloading: http://repository.mygrid.org.uk/artifactory/repo/org/apache/xmlgraphics/batik-svg-dom/1.7/batik-svg-dom-1.7.pom
[INFO] Downloaded: http://repository.mygrid.org.uk/artifactory/repo/org/apache/xmlgraphics/batik-svg-dom/1.7/batik-svg-dom-1.7.pom (5 KB at 4.0 KB/sec)
[INFO] Downloading: http://repository.mygrid.org.uk/artifactory/repo/org/apache/xmlgraphics/batik-svg-dom/1.7/batik-svg-dom-1.7.pom
[INFO] Downloaded: http://repository.mygrid.org.uk/artifactory/repo/org/apache/xmlgraphics/batik-svg-dom/1.7/batik-svg-dom-1.7.pom (5 KB at 1.8 KB/sec)
[INFO] Downloading: http://repository.mygrid.org.uk/artifactory/repo/org/apache/xmlgraphics/batik-svg-dom/1.7/batik-svg-dom-1.7.pom
[INFO] Downloaded: http://repository.mygrid.org.uk/artifactory/repo/org/apache/xmlgraphics/batik-svg-dom/1.7/batik-svg-dom-1.7.pom (5 KB at 4.3 KB/sec)
[INFO] Downloading: http://repository.mygrid.org.uk/artifactory/repo/org/apache/xmlgraphics/batik-svg-dom/1.7/batik-svg-dom-1.7.pom
[INFO] Downloaded: http://repository.mygrid.org.uk/artifactory/repo/org/apache/xmlgraphics/batik-svg-dom/1.7/batik-svg-dom-1.7.pom (5 KB at 1.6 KB/sec)
[INFO] Downloading: http://repository.mygrid.org.uk/artifactory/repo/org/apache/xmlgraphics/batik-svg-dom/1.7/batik-svg-dom-1.7.pom
[INFO] Downloaded: http://repository.mygrid.org.uk/artifactory/repo/org/apache/xmlgraphics/batik-svg-dom/1.7/batik-svg-dom-1.7.pom (5 KB at 4.0 KB/sec)
[INFO] Downloading: http://repository.mygrid.org.uk/artifactory/repo/org/apache/xmlgraphics/batik-svg-dom/1.7/batik-svg-dom-1.7.pom
[INFO] Downloaded: http://repository.mygrid.org.uk/artifactory/repo/org/apache/xmlgraphics/batik-svg-dom/1.7/batik-svg-dom-1.7.pom (5 KB at 7.6 KB/sec)
[INFO] Downloading: http://repository.mygrid.org.uk/artifactory/repo/org/apache/xmlgraphics/batik-svg-dom/1.7/batik-svg-dom-1.7.pom
[INFO] Downloaded: http://repository.mygrid.org.uk/artifactory/repo/org/apache/xmlgraphics/batik-svg-dom/1.7/batik-svg-dom-1.7.pom (5 KB at 95.7 KB/sec)
[INFO] Downloading: http://repository.mygrid.org.uk/artifactory/repo/org/apache/xmlgraphics/batik-anim/1.7/batik-anim-1.7.pom
[INFO] Downloaded: http://repository.mygrid.org.uk/artifactory/repo/org/apache/xmlgraphics/batik-anim/1.7/batik-anim-1.7.pom (5 KB at 3.7 KB/sec)
[INFO] Downloading: http://repository.mygrid.org.uk/artifactory/repo/org/apache/xmlgraphics/batik-awt-util/1.7/batik-awt-util-1.7.pom
[INFO] Downloaded: http://repository.mygrid.org.uk/artifactory/repo/org/apache/xmlgraphics/batik-awt-util/1.7/batik-awt-util-1.7.pom (4 KB at 1.5 KB/sec)
[INFO] Downloading: http://repository.mygrid.org.uk/artifactory/repo/org/apache/xmlgraphics/batik-util/1.7/batik-util-1.7.pom
[INFO] Downloaded: http://repository.mygrid.org.uk/artifactory/repo/org/apache/xmlgraphics/batik-util/1.7/batik-util-1.7.pom (3 KB at 2.5 KB/sec)
[INFO] Downloading: http://repository.mygrid.org.uk/artifactory/repo/org/apache/xmlgraphics/batik-dom/1.7/batik-dom-1.7.pom
[INFO] Downloaded: http://repository.mygrid.org.uk/artifactory/repo/org/apache/xmlgraphics/batik-dom/1.7/batik-dom-1.7.pom (4 KB at 1.4 KB/sec)
[INFO] Downloading: http://repository.mygrid.org.uk/artifactory/repo/org/apache/xmlgraphics/batik-css/1.7/batik-css-1.7.pom
[INFO] Downloaded: http://repository.mygrid.org.uk/artifactory/repo/org/apache/xmlgraphics/batik-css/1.7/batik-css-1.7.pom (4 KB at 3.6 KB/sec)
[INFO] Downloading: http://repository.mygrid.org.uk/artifactory/repo/org/apache/xmlgraphics/batik-ext/1.7/batik-ext-1.7.pom
[INFO] Downloaded: http://repository.mygrid.org.uk/artifactory/repo/org/apache/xmlgraphics/batik-ext/1.7/batik-ext-1.7.pom (4 KB at 8.0 KB/sec)
[INFO] Downloading: http://repository.mygrid.org.uk/artifactory/repo/xml-apis/xml-apis/1.3.04/xml-apis-1.3.04.pom
[INFO] Downloaded: http://repository.mygrid.org.uk/artifactory/repo/xml-apis/xml-apis/1.3.04/xml-apis-1.3.04.pom (2 KB at 4.4 KB/sec)
[INFO] Downloading: http://repository.mygrid.org.uk/artifactory/repo/xml-apis/xml-apis-ext/1.3.04/xml-apis-ext-1.3.04.pom
[INFO] Downloaded: http://repository.mygrid.org.uk/artifactory/repo/xml-apis/xml-apis-ext/1.3.04/xml-apis-ext-1.3.04.pom (2 KB at 1.3 KB/sec)
[INFO] Downloading: http://repository.mygrid.org.uk/artifactory/repo/org/apache/xmlgraphics/batik-xml/1.7/batik-xml-1.7.pom
[INFO] Downloaded: http://repository.mygrid.org.uk/artifactory/repo/org/apache/xmlgraphics/batik-xml/1.7/batik-xml-1.7.pom (4 KB at 6.9 KB/sec)
[INFO] Downloading: http://repository.mygrid.org.uk/artifactory/repo/xalan/xalan/2.6.0/xalan-2.6.0.pom
[INFO] Downloaded: http://repository.mygrid.org.uk/artifactory/repo/xalan/xalan/2.6.0/xalan-2.6.0.pom (491 B at 2.7 KB/sec)
[INFO] Downloading: http://repository.mygrid.org.uk/artifactory/repo/xml-apis/xml-apis/2.0.2/xml-apis-2.0.2.pom
[INFO] Downloaded: http://repository.mygrid.org.uk/artifactory/repo/xml-apis/xml-apis/2.0.2/xml-apis-2.0.2.pom (346 B at 1.4 KB/sec)
[INFO] Downloading: http://repository.mygrid.org.uk/artifactory/repo/xml-apis/xml-apis/1.0.b2/xml-apis-1.0.b2.pom
[INFO] Downloaded: http://repository.mygrid.org.uk/artifactory/repo/xml-apis/xml-apis/1.0.b2/xml-apis-1.0.b2.pom (3 KB at 5.1 KB/sec)
[INFO] Downloading: http://repository.mygrid.org.uk/artifactory/repo/org/apache/xmlgraphics/batik-parser/1.7/batik-parser-1.7.pom
[INFO] Downloaded: http://repository.mygrid.org.uk/artifactory/repo/org/apache/xmlgraphics/batik-parser/1.7/batik-parser-1.7.pom (4 KB at 9.6 KB/sec)
[INFO] Downloading: http://repository.mygrid.org.uk/artifactory/repo/org/apache/xmlgraphics/batik-swing/1.7/batik-swing-1.7.pom
[INFO] Downloaded: http://repository.mygrid.org.uk/artifactory/repo/org/apache/xmlgraphics/batik-swing/1.7/batik-swing-1.7.pom (5 KB at 27.1 KB/sec)
[INFO] Downloading: http://repository.mygrid.org.uk/artifactory/repo/org/apache/xmlgraphics/batik-bridge/1.7/batik-bridge-1.7.pom
[INFO] Downloaded: http://repository.mygrid.org.uk/artifactory/repo/org/apache/xmlgraphics/batik-bridge/1.7/batik-bridge-1.7.pom (6 KB at 5.4 KB/sec)
[INFO] Downloading: http://repository.mygrid.org.uk/artifactory/repo/org/apache/xmlgraphics/batik-gvt/1.7/batik-gvt-1.7.pom
[INFO] Downloaded: http://repository.mygrid.org.uk/artifactory/repo/org/apache/xmlgraphics/batik-gvt/1.7/batik-gvt-1.7.pom (4 KB at 2.3 KB/sec)
[INFO] Downloading: http://repository.mygrid.org.uk/artifactory/repo/org/apache/xmlgraphics/batik-script/1.7/batik-script-1.7.pom
[INFO] Downloaded: http://repository.mygrid.org.uk/artifactory/repo/org/apache/xmlgraphics/batik-script/1.7/batik-script-1.7.pom (5 KB at 2.9 KB/sec)
[INFO] Downloading: http://repository.mygrid.org.uk/artifactory/repo/org/apache/xmlgraphics/batik-js/1.7/batik-js-1.7.pom
[INFO] Downloaded: http://repository.mygrid.org.uk/artifactory/repo/org/apache/xmlgraphics/batik-js/1.7/batik-js-1.7.pom (4 KB at 6.5 KB/sec)
[INFO] Downloading: http://repository.mygrid.org.uk/artifactory/repo/org/apache/xmlgraphics/batik-gui-util/1.7/batik-gui-util-1.7.pom
[INFO] Downloaded: http://repository.mygrid.org.uk/artifactory/repo/org/apache/xmlgraphics/batik-gui-util/1.7/batik-gui-util-1.7.pom (4 KB at 1.5 KB/sec)
[INFO] Downloading: http://repository.mygrid.org.uk/artifactory/repo/org/apache/xmlgraphics/batik-transcoder/1.7/batik-transcoder-1.7.pom
[INFO] Downloaded: http://repository.mygrid.org.uk/artifactory/repo/org/apache/xmlgraphics/batik-transcoder/1.7/batik-transcoder-1.7.pom (6 KB at 0.8 KB/sec)
[INFO] Downloading: http://repository.mygrid.org.uk/artifactory/repo/org/apache/xmlgraphics/fop/0.94/fop-0.94.pom
[INFO] Downloaded: http://repository.mygrid.org.uk/artifactory/repo/org/apache/xmlgraphics/fop/0.94/fop-0.94.pom (6 KB at 8.5 KB/sec)
[INFO] Downloading: http://repository.mygrid.org.uk/artifactory/repo/org/apache/xmlgraphics/xmlgraphics-commons/1.2/xmlgraphics-commons-1.2.pom
[INFO] Downloaded: http://repository.mygrid.org.uk/artifactory/repo/org/apache/xmlgraphics/xmlgraphics-commons/1.2/xmlgraphics-commons-1.2.pom (4 KB at 9.6 KB/sec)
[INFO] Downloading: http://repository.mygrid.org.uk/artifactory/repo/org/apache/avalon/framework/avalon-framework-api/4.3.1/avalon-framework-api-4.3.1.pom
[INFO] Downloaded: http://repository.mygrid.org.uk/artifactory/repo/org/apache/avalon/framework/avalon-framework-api/4.3.1/avalon-framework-api-4.3.1.pom (3 KB at 7.0 KB/sec)
[INFO] Downloading: http://repository.mygrid.org.uk/artifactory/repo/org/apache/avalon/avalon-framework/1/avalon-framework-1.pom
[INFO] Downloaded: http://repository.mygrid.org.uk/artifactory/repo/org/apache/avalon/avalon-framework/1/avalon-framework-1.pom (2 KB at 13.7 KB/sec)
[INFO] Downloading: http://repository.mygrid.org.uk/artifactory/repo/org/apache/excalibur/excalibur/1/excalibur-1.pom
[INFO] Downloaded: http://repository.mygrid.org.uk/artifactory/repo/org/apache/excalibur/excalibur/1/excalibur-1.pom (8 KB at 32.2 KB/sec)
[INFO] Downloading: http://repository.mygrid.org.uk/artifactory/repo/org/apache/avalon/framework/avalon-framework-impl/4.3.1/avalon-framework-impl-4.3.1.pom
[INFO] Downloaded: http://repository.mygrid.org.uk/artifactory/repo/org/apache/avalon/framework/avalon-framework-impl/4.3.1/avalon-framework-impl-4.3.1.pom (3 KB at 9.7 KB/sec)
[INFO] Downloading: http://repository.mygrid.org.uk/artifactory/repo/org/apache/xmlgraphics/batik-svggen/1.7/batik-svggen-1.7.pom
[INFO] Downloaded: http://repository.mygrid.org.uk/artifactory/repo/org/apache/xmlgraphics/batik-svggen/1.7/batik-svggen-1.7.pom (4 KB at 6.9 KB/sec)
[INFO] Downloading: http://repository.mygrid.org.uk/artifactory/repo/net/sf/taverna/t2/activities/activity-test-utils/1.6-SNAPSHOT/maven-metadata.xml
[INFO] Downloading: http://repository.mygrid.org.uk/artifactory/repo/net/sf/taverna/t2/activities/activity-test-utils/1.6-SNAPSHOT/maven-metadata.xml
[INFO] Downloading: http://repository.mygrid.org.uk/artifactory/repo/net/sf/taverna/t2/activities/activity-test-utils/1.6-SNAPSHOT/maven-metadata.xml
[INFO] Downloading: http://repository.mygrid.org.uk/artifactory/repo/net/sf/taverna/t2/activities/activity-test-utils/1.6-SNAPSHOT/maven-metadata.xml
[INFO] Downloaded: http://repository.mygrid.org.uk/artifactory/repo/net/sf/taverna/t2/activities/activity-test-utils/1.6-SNAPSHOT/maven-metadata.xml (2 KB at 8.9 KB/sec)
[INFO] Downloaded: http://repository.mygrid.org.uk/artifactory/repo/net/sf/taverna/t2/activities/activity-test-utils/1.6-SNAPSHOT/maven-metadata.xml (2 KB at 7.5 KB/sec)
[INFO] Downloaded: http://repository.mygrid.org.uk/artifactory/repo/net/sf/taverna/t2/activities/activity-test-utils/1.6-SNAPSHOT/maven-metadata.xml (2 KB at 8.4 KB/sec)
[INFO] Downloading: http://repository.mygrid.org.uk/artifactory/repo/net/sf/taverna/t2/activities/activity-test-utils/1.6-SNAPSHOT/maven-metadata.xml
[INFO] Downloading: http://repository.mygrid.org.uk/artifactory/repo/net/sf/taverna/t2/activities/activity-test-utils/1.6-SNAPSHOT/maven-metadata.xml
[INFO] Downloading: http://repository.mygrid.org.uk/artifactory/repo/net/sf/taverna/t2/activities/activity-test-utils/1.6-SNAPSHOT/maven-metadata.xml
[INFO] Downloaded: http://repository.mygrid.org.uk/artifactory/repo/net/sf/taverna/t2/activities/activity-test-utils/1.6-SNAPSHOT/maven-metadata.xml (2 KB at 5.8 KB/sec)
[INFO] Downloaded: http://repository.mygrid.org.uk/artifactory/repo/net/sf/taverna/t2/activities/activity-test-utils/1.6-SNAPSHOT/maven-metadata.xml (2 KB at 9.5 KB/sec)
[INFO] Downloaded: http://repository.mygrid.org.uk/artifactory/repo/net/sf/taverna/t2/activities/activity-test-utils/1.6-SNAPSHOT/maven-metadata.xml (2 KB at 9.5 KB/sec)
[INFO] Downloaded: http://repository.mygrid.org.uk/artifactory/repo/net/sf/taverna/t2/activities/activity-test-utils/1.6-SNAPSHOT/maven-metadata.xml (2 KB at 9.1 KB/sec)
[INFO] Downloading: http://repository.mygrid.org.uk/artifactory/repo/net/sf/taverna/t2/core/reference-core-extensions/1.6-SNAPSHOT/maven-metadata.xml
[INFO] Downloading: http://repository.mygrid.org.uk/artifactory/repo/net/sf/taverna/t2/core/reference-core-extensions/1.6-SNAPSHOT/maven-metadata.xml
[INFO] Downloading: http://repository.mygrid.org.uk/artifactory/repo/net/sf/taverna/t2/core/reference-core-extensions/1.6-SNAPSHOT/maven-metadata.xml
[INFO] Downloading: http://repository.mygrid.org.uk/artifactory/repo/net/sf/taverna/t2/core/reference-core-extensions/1.6-SNAPSHOT/maven-metadata.xml
[INFO] Downloaded: http://repository.mygrid.org.uk/artifactory/repo/net/sf/taverna/t2/core/reference-core-extensions/1.6-SNAPSHOT/maven-metadata.xml (2 KB at 5.3 KB/sec)
[INFO] Downloaded: http://repository.mygrid.org.uk/artifactory/repo/net/sf/taverna/t2/core/reference-core-extensions/1.6-SNAPSHOT/maven-metadata.xml (2 KB at 5.4 KB/sec)
[INFO] Downloaded: http://repository.mygrid.org.uk/artifactory/repo/net/sf/taverna/t2/core/reference-core-extensions/1.6-SNAPSHOT/maven-metadata.xml (2 KB at 5.2 KB/sec)
[INFO] Downloading: http://repository.mygrid.org.uk/artifactory/repo/net/sf/taverna/t2/core/reference-core-extensions/1.6-SNAPSHOT/maven-metadata.xml
[INFO] Downloading: http://repository.mygrid.org.uk/artifactory/repo/net/sf/taverna/t2/core/reference-core-extensions/1.6-SNAPSHOT/maven-metadata.xml
[INFO] Downloading: http://repository.mygrid.org.uk/artifactory/repo/net/sf/taverna/t2/core/reference-core-extensions/1.6-SNAPSHOT/maven-metadata.xml
[INFO] Downloaded: http://repository.mygrid.org.uk/artifactory/repo/net/sf/taverna/t2/core/reference-core-extensions/1.6-SNAPSHOT/maven-metadata.xml (2 KB at 7.8 KB/sec)
[INFO] Downloaded: http://repository.mygrid.org.uk/artifactory/repo/net/sf/taverna/t2/core/reference-core-extensions/1.6-SNAPSHOT/maven-metadata.xml (2 KB at 6.1 KB/sec)
[INFO] Downloaded: http://repository.mygrid.org.uk/artifactory/repo/net/sf/taverna/t2/core/reference-core-extensions/1.6-SNAPSHOT/maven-metadata.xml (2 KB at 2.5 KB/sec)
[INFO] Downloaded: http://repository.mygrid.org.uk/artifactory/repo/net/sf/taverna/t2/core/reference-core-extensions/1.6-SNAPSHOT/maven-metadata.xml (2 KB at 4.1 KB/sec)
[INFO] Downloading: http://repository.mygrid.org.uk/artifactory/repo/net/sf/taverna/t2/activities/activity-test-utils/1.6-SNAPSHOT/activity-test-utils-1.6-20140612.105641-10.jar
[INFO] Downloading: http://repository.mygrid.org.uk/artifactory/repo/net/sf/taverna/t2/core/reference-core-extensions/1.6-SNAPSHOT/reference-core-extensions-1.6-20140612.105547-10.jar
[INFO] Downloading: http://repository.mygrid.org.uk/artifactory/repo/org/apache/xmlgraphics/batik-svg-dom/1.7/batik-svg-dom-1.7.jar
[INFO] Downloading: http://repository.mygrid.org.uk/artifactory/repo/org/apache/xmlgraphics/batik-anim/1.7/batik-anim-1.7.jar
[INFO] Downloading: http://repository.mygrid.org.uk/artifactory/repo/org/apache/xmlgraphics/batik-awt-util/1.7/batik-awt-util-1.7.jar
[INFO] Downloaded: http://repository.mygrid.org.uk/artifactory/repo/org/apache/xmlgraphics/batik-awt-util/1.7/batik-awt-util-1.7.jar (393 KB at 1249.8 KB/sec)
[INFO] Downloading: http://repository.mygrid.org.uk/artifactory/repo/org/apache/xmlgraphics/batik-css/1.7/batik-css-1.7.jar
[INFO] Downloaded: http://repository.mygrid.org.uk/artifactory/repo/org/apache/xmlgraphics/batik-svg-dom/1.7/batik-svg-dom-1.7.jar (588 KB at 1817.4 KB/sec)
[INFO] Downloading: http://repository.mygrid.org.uk/artifactory/repo/org/apache/xmlgraphics/batik-dom/1.7/batik-dom-1.7.jar
[INFO] Downloaded: http://repository.mygrid.org.uk/artifactory/repo/org/apache/xmlgraphics/batik-anim/1.7/batik-anim-1.7.jar (94 KB at 255.7 KB/sec)
[INFO] Downloading: http://repository.mygrid.org.uk/artifactory/repo/xalan/xalan/2.6.0/xalan-2.6.0.jar
[INFO] Downloaded: http://repository.mygrid.org.uk/artifactory/repo/net/sf/taverna/t2/activities/activity-test-utils/1.6-SNAPSHOT/activity-test-utils-1.6-20140612.105641-10.jar (14 KB at 26.8 KB/sec)
[INFO] Downloading: http://repository.mygrid.org.uk/artifactory/repo/org/apache/xmlgraphics/batik-ext/1.7/batik-ext-1.7.jar
[INFO] Downloaded: http://repository.mygrid.org.uk/artifactory/repo/org/apache/xmlgraphics/batik-dom/1.7/batik-dom-1.7.jar (170 KB at 303.2 KB/sec)
[INFO] Downloading: http://repository.mygrid.org.uk/artifactory/repo/org/apache/xmlgraphics/batik-parser/1.7/batik-parser-1.7.jar
[INFO] Downloaded: http://repository.mygrid.org.uk/artifactory/repo/xalan/xalan/2.6.0/xalan-2.6.0.jar (3076 KB at 5463.3 KB/sec)
[INFO] Downloading: http://repository.mygrid.org.uk/artifactory/repo/xml-apis/xml-apis/1.3.04/xml-apis-1.3.04.jar
[INFO] Downloaded: http://repository.mygrid.org.uk/artifactory/repo/org/apache/xmlgraphics/batik-css/1.7/batik-css-1.7.jar (304 KB at 469.3 KB/sec)
[INFO] Downloading: http://repository.mygrid.org.uk/artifactory/repo/xml-apis/xml-apis-ext/1.3.04/xml-apis-ext-1.3.04.jar
[INFO] Downloaded: http://repository.mygrid.org.uk/artifactory/repo/net/sf/taverna/t2/core/reference-core-extensions/1.6-SNAPSHOT/reference-core-extensions-1.6-20140612.105547-10.jar (33 KB at 32.0 KB/sec)
[INFO] Downloading: http://repository.mygrid.org.uk/artifactory/repo/org/apache/xmlgraphics/batik-swing/1.7/batik-swing-1.7.jar
[INFO] Downloaded: http://repository.mygrid.org.uk/artifactory/repo/org/apache/xmlgraphics/batik-ext/1.7/batik-ext-1.7.jar (11 KB at 14.3 KB/sec)
[INFO] Downloading: http://repository.mygrid.org.uk/artifactory/repo/org/apache/xmlgraphics/batik-bridge/1.7/batik-bridge-1.7.jar
[INFO] Downloaded: http://repository.mygrid.org.uk/artifactory/repo/org/apache/xmlgraphics/batik-bridge/1.7/batik-bridge-1.7.jar (546 KB at 1743.7 KB/sec)
[INFO] Downloading: http://repository.mygrid.org.uk/artifactory/repo/org/apache/xmlgraphics/batik-script/1.7/batik-script-1.7.jar
[INFO] Downloaded: http://repository.mygrid.org.uk/artifactory/repo/xml-apis/xml-apis/1.3.04/xml-apis-1.3.04.jar (190 KB at 310.6 KB/sec)
[INFO] Downloading: http://repository.mygrid.org.uk/artifactory/repo/org/apache/xmlgraphics/batik-js/1.7/batik-js-1.7.jar
[INFO] Downloaded: http://repository.mygrid.org.uk/artifactory/repo/org/apache/xmlgraphics/batik-parser/1.7/batik-parser-1.7.jar (72 KB at 108.2 KB/sec)
[INFO] Downloading: http://repository.mygrid.org.uk/artifactory/repo/org/apache/xmlgraphics/batik-gui-util/1.7/batik-gui-util-1.7.jar
[INFO] Downloaded: http://repository.mygrid.org.uk/artifactory/repo/xml-apis/xml-apis-ext/1.3.04/xml-apis-ext-1.3.04.jar (84 KB at 144.8 KB/sec)
[INFO] Downloading: http://repository.mygrid.org.uk/artifactory/repo/org/apache/xmlgraphics/batik-gvt/1.7/batik-gvt-1.7.jar
[INFO] Downloaded: http://repository.mygrid.org.uk/artifactory/repo/org/apache/xmlgraphics/batik-swing/1.7/batik-swing-1.7.jar (182 KB at 329.7 KB/sec)
[INFO] Downloading: http://repository.mygrid.org.uk/artifactory/repo/org/apache/xmlgraphics/batik-util/1.7/batik-util-1.7.jar
[INFO] Downloaded: http://repository.mygrid.org.uk/artifactory/repo/org/apache/xmlgraphics/batik-script/1.7/batik-script-1.7.jar (60 KB at 330.6 KB/sec)
[INFO] Downloading: http://repository.mygrid.org.uk/artifactory/repo/org/apache/xmlgraphics/batik-transcoder/1.7/batik-transcoder-1.7.jar
[INFO] Downloaded: http://repository.mygrid.org.uk/artifactory/repo/org/apache/xmlgraphics/batik-gui-util/1.7/batik-gui-util-1.7.jar (166 KB at 906.3 KB/sec)
[INFO] Downloading: http://repository.mygrid.org.uk/artifactory/repo/org/apache/xmlgraphics/fop/0.94/fop-0.94.jar
[INFO] Downloaded: http://repository.mygrid.org.uk/artifactory/repo/org/apache/xmlgraphics/batik-gvt/1.7/batik-gvt-1.7.jar (238 KB at 992.4 KB/sec)
[INFO] Downloading: http://repository.mygrid.org.uk/artifactory/repo/org/apache/xmlgraphics/xmlgraphics-commons/1.2/xmlgraphics-commons-1.2.jar
[INFO] Downloaded: http://repository.mygrid.org.uk/artifactory/repo/org/apache/xmlgraphics/batik-transcoder/1.7/batik-transcoder-1.7.jar (120 KB at 551.6 KB/sec)
[INFO] Downloading: http://repository.mygrid.org.uk/artifactory/repo/org/apache/avalon/framework/avalon-framework-api/4.3.1/avalon-framework-api-4.3.1.jar
[INFO] Downloaded: http://repository.mygrid.org.uk/artifactory/repo/org/apache/xmlgraphics/batik-js/1.7/batik-js-1.7.jar (493 KB at 1293.7 KB/sec)
[INFO] Downloading: http://repository.mygrid.org.uk/artifactory/repo/org/apache/avalon/framework/avalon-framework-impl/4.3.1/avalon-framework-impl-4.3.1.jar
[INFO] Downloaded: http://repository.mygrid.org.uk/artifactory/repo/org/apache/xmlgraphics/batik-util/1.7/batik-util-1.7.jar (126 KB at 92.2 KB/sec)
[INFO] Downloading: http://repository.mygrid.org.uk/artifactory/repo/org/apache/xmlgraphics/batik-svggen/1.7/batik-svggen-1.7.jar
[INFO] Downloaded: http://repository.mygrid.org.uk/artifactory/repo/org/apache/xmlgraphics/xmlgraphics-commons/1.2/xmlgraphics-commons-1.2.jar (336 KB at 290.0 KB/sec)
[INFO] Downloading: http://repository.mygrid.org.uk/artifactory/repo/org/apache/xmlgraphics/batik-xml/1.7/batik-xml-1.7.jar
[INFO] Downloaded: http://repository.mygrid.org.uk/artifactory/repo/org/apache/xmlgraphics/fop/0.94/fop-0.94.jar (2039 KB at 1462.2 KB/sec)
[INFO] Downloaded: http://repository.mygrid.org.uk/artifactory/repo/org/apache/xmlgraphics/batik-xml/1.7/batik-xml-1.7.jar (31 KB at 148.4 KB/sec)
[INFO] Downloaded: http://repository.mygrid.org.uk/artifactory/repo/org/apache/avalon/framework/avalon-framework-api/4.3.1/avalon-framework-api-4.3.1.jar (33 KB at 25.4 KB/sec)
[INFO] Downloaded: http://repository.mygrid.org.uk/artifactory/repo/org/apache/avalon/framework/avalon-framework-impl/4.3.1/avalon-framework-impl-4.3.1.jar (60 KB at 42.4 KB/sec)
[INFO] Downloaded: http://repository.mygrid.org.uk/artifactory/repo/org/apache/xmlgraphics/batik-svggen/1.7/batik-svggen-1.7.jar (211 KB at 381.5 KB/sec)
[INFO] 
[INFO] --- maven-clean-plugin:2.5:clean (default-clean) @ graph-model ---
[INFO] Deleting /local/jenkins/jobs/taverna-ui-components-maintenance/workspace/graph-model/target
[INFO] 
[INFO] --- javacc-maven-plugin:2.6:jjtree-javacc (javacc) @ graph-model ---
[INFO] Downloading: http://repository.mygrid.org.uk/artifactory/repo/org/apache/maven/maven-plugin-api/2.0.4/maven-plugin-api-2.0.4.pom
[INFO] Downloaded: http://repository.mygrid.org.uk/artifactory/repo/org/apache/maven/maven-plugin-api/2.0.4/maven-plugin-api-2.0.4.pom (643 B at 1.9 KB/sec)
[INFO] Downloading: http://repository.mygrid.org.uk/artifactory/repo/org/apache/maven/maven/2.0.4/maven-2.0.4.pom
[INFO] Downloaded: http://repository.mygrid.org.uk/artifactory/repo/org/apache/maven/maven/2.0.4/maven-2.0.4.pom (12 KB at 35.0 KB/sec)
[INFO] Downloading: http://repository.mygrid.org.uk/artifactory/repo/org/apache/maven/maven-project/2.0.4/maven-project-2.0.4.pom
[INFO] Downloaded: http://repository.mygrid.org.uk/artifactory/repo/org/apache/maven/maven-project/2.0.4/maven-project-2.0.4.pom (2 KB at 4.8 KB/sec)
[INFO] Downloading: http://repository.mygrid.org.uk/artifactory/repo/org/apache/maven/maven-settings/2.0.4/maven-settings-2.0.4.pom
[INFO] Downloaded: http://repository.mygrid.org.uk/artifactory/repo/org/apache/maven/maven-settings/2.0.4/maven-settings-2.0.4.pom (2 KB at 9.3 KB/sec)
[INFO] Downloading: http://repository.mygrid.org.uk/artifactory/repo/org/apache/maven/maven-settings/2.0.4/maven-settings-2.0.4.pom
[INFO] Downloaded: http://repository.mygrid.org.uk/artifactory/repo/org/apache/maven/maven-settings/2.0.4/maven-settings-2.0.4.pom (2 KB at 93.4 KB/sec)
[INFO] Downloading: http://repository.mygrid.org.uk/artifactory/repo/org/apache/maven/maven-model/2.0.4/maven-model-2.0.4.pom
[INFO] Downloaded: http://repository.mygrid.org.uk/artifactory/repo/org/apache/maven/maven-model/2.0.4/maven-model-2.0.4.pom (3 KB at 21.2 KB/sec)
[INFO] Downloading: http://repository.mygrid.org.uk/artifactory/repo/org/codehaus/plexus/plexus-utils/1.1/plexus-utils-1.1.pom
[INFO] Downloaded: http://repository.mygrid.org.uk/artifactory/repo/org/codehaus/plexus/plexus-utils/1.1/plexus-utils-1.1.pom (767 B at 7.3 KB/sec)
[INFO] Downloading: http://repository.mygrid.org.uk/artifactory/repo/org/codehaus/plexus/plexus-container-default/1.0-alpha-9/plexus-container-default-1.0-alpha-9.pom
[INFO] Downloaded: http://repository.mygrid.org.uk/artifactory/repo/org/codehaus/plexus/plexus-container-default/1.0-alpha-9/plexus-container-default-1.0-alpha-9.pom (2 KB at 29.4 KB/sec)
[INFO] Downloading: http://repository.mygrid.org.uk/artifactory/repo/org/apache/maven/maven-profile/2.0.4/maven-profile-2.0.4.pom
[INFO] Downloaded: http://repository.mygrid.org.uk/artifactory/repo/org/apache/maven/maven-profile/2.0.4/maven-profile-2.0.4.pom (2 KB at 9.6 KB/sec)
[INFO] Downloading: http://repository.mygrid.org.uk/artifactory/repo/org/apache/maven/maven-artifact-manager/2.0.4/maven-artifact-manager-2.0.4.pom
[INFO] Downloaded: http://repository.mygrid.org.uk/artifactory/repo/org/apache/maven/maven-artifact-manager/2.0.4/maven-artifact-manager-2.0.4.pom (2 KB at 6.4 KB/sec)
[INFO] Downloading: http://repository.mygrid.org.uk/artifactory/repo/org/apache/maven/maven-repository-metadata/2.0.4/maven-repository-metadata-2.0.4.pom
[INFO] Downloaded: http://repository.mygrid.org.uk/artifactory/repo/org/apache/maven/maven-repository-metadata/2.0.4/maven-repository-metadata-2.0.4.pom (2 KB at 8.3 KB/sec)
[INFO] Downloading: http://repository.mygrid.org.uk/artifactory/repo/org/apache/maven/maven-artifact/2.0.4/maven-artifact-2.0.4.pom
[INFO] Downloaded: http://repository.mygrid.org.uk/artifactory/repo/org/apache/maven/maven-artifact/2.0.4/maven-artifact-2.0.4.pom (765 B at 1.0 KB/sec)
[INFO] Downloading: http://repository.mygrid.org.uk/artifactory/repo/net/java/dev/javacc/javacc/5.0/javacc-5.0.pom
[INFO] Downloaded: http://repository.mygrid.org.uk/artifactory/repo/net/java/dev/javacc/javacc/5.0/javacc-5.0.pom (3 KB at 7.8 KB/sec)
[INFO] Downloading: http://repository.mygrid.org.uk/artifactory/repo/org/codehaus/plexus/plexus-utils/1.5.6/plexus-utils-1.5.6.pom
[INFO] Downloaded: http://repository.mygrid.org.uk/artifactory/repo/org/codehaus/plexus/plexus-utils/1.5.6/plexus-utils-1.5.6.pom (6 KB at 58.8 KB/sec)
[INFO] Downloading: http://repository.mygrid.org.uk/artifactory/repo/org/codehaus/plexus/plexus/1.0.12/plexus-1.0.12.pom
[INFO] Downloaded: http://repository.mygrid.org.uk/artifactory/repo/org/codehaus/plexus/plexus/1.0.12/plexus-1.0.12.pom (10 KB at 108.8 KB/sec)
[INFO] Downloading: http://repository.mygrid.org.uk/artifactory/repo/edu/ucla/cs/compilers/jtb/1.3.2/jtb-1.3.2.pom
[INFO] Downloaded: http://repository.mygrid.org.uk/artifactory/repo/edu/ucla/cs/compilers/jtb/1.3.2/jtb-1.3.2.pom (2 KB at 15.6 KB/sec)
[INFO] Downloading: http://repository.mygrid.org.uk/artifactory/repo/org/apache/maven/reporting/maven-reporting-api/2.0.4/maven-reporting-api-2.0.4.pom
[INFO] Downloaded: http://repository.mygrid.org.uk/artifactory/repo/org/apache/maven/reporting/maven-reporting-api/2.0.4/maven-reporting-api-2.0.4.pom (902 B at 4.6 KB/sec)
[INFO] Downloading: http://repository.mygrid.org.uk/artifactory/repo/org/apache/maven/reporting/maven-reporting/2.0.4/maven-reporting-2.0.4.pom
[INFO] Downloaded: http://repository.mygrid.org.uk/artifactory/repo/org/apache/maven/reporting/maven-reporting/2.0.4/maven-reporting-2.0.4.pom (700 B at 5.3 KB/sec)
[INFO] Downloading: http://repository.mygrid.org.uk/artifactory/repo/org/apache/maven/reporting/maven-reporting-impl/2.0.4/maven-reporting-impl-2.0.4.pom
[INFO] Downloaded: http://repository.mygrid.org.uk/artifactory/repo/org/apache/maven/reporting/maven-reporting-impl/2.0.4/maven-reporting-impl-2.0.4.pom (2 KB at 13.7 KB/sec)
[INFO] Downloading: http://repository.mygrid.org.uk/artifactory/repo/commons-validator/commons-validator/1.2.0/commons-validator-1.2.0.pom
[INFO] Downloaded: http://repository.mygrid.org.uk/artifactory/repo/commons-validator/commons-validator/1.2.0/commons-validator-1.2.0.pom (9 KB at 34.8 KB/sec)
[INFO] Downloading: http://repository.mygrid.org.uk/artifactory/repo/commons-validator/commons-validator/1.2.0/commons-validator-1.2.0.pom
[INFO] Downloaded: http://repository.mygrid.org.uk/artifactory/repo/commons-validator/commons-validator/1.2.0/commons-validator-1.2.0.pom (9 KB at 147.9 KB/sec)
[INFO] Downloading: http://repository.mygrid.org.uk/artifactory/repo/commons-beanutils/commons-beanutils/1.7.0/commons-beanutils-1.7.0.pom
[INFO] Downloaded: http://repository.mygrid.org.uk/artifactory/repo/commons-beanutils/commons-beanutils/1.7.0/commons-beanutils-1.7.0.pom (357 B at 0.6 KB/sec)
[INFO] Downloading: http://repository.mygrid.org.uk/artifactory/repo/commons-logging/commons-logging/1.0.3/commons-logging-1.0.3.pom
[INFO] Downloaded: http://repository.mygrid.org.uk/artifactory/repo/commons-logging/commons-logging/1.0.3/commons-logging-1.0.3.pom (866 B at 6.1 KB/sec)
[INFO] Downloading: http://repository.mygrid.org.uk/artifactory/repo/commons-digester/commons-digester/1.6/commons-digester-1.6.pom
[INFO] Downloaded: http://repository.mygrid.org.uk/artifactory/repo/commons-digester/commons-digester/1.6/commons-digester-1.6.pom (974 B at 2.5 KB/sec)
[INFO] Downloading: http://repository.mygrid.org.uk/artifactory/repo/commons-beanutils/commons-beanutils/1.6/commons-beanutils-1.6.pom
[INFO] Downloaded: http://repository.mygrid.org.uk/artifactory/repo/commons-beanutils/commons-beanutils/1.6/commons-beanutils-1.6.pom (3 KB at 9.6 KB/sec)
[INFO] Downloading: http://repository.mygrid.org.uk/artifactory/repo/commons-logging/commons-logging/1.0/commons-logging-1.0.pom
[INFO] Downloaded: http://repository.mygrid.org.uk/artifactory/repo/commons-logging/commons-logging/1.0/commons-logging-1.0.pom (163 B at 1.6 KB/sec)
[INFO] Downloading: http://repository.mygrid.org.uk/artifactory/repo/commons-collections/commons-collections/2.0/commons-collections-2.0.pom
[INFO] Downloaded: http://repository.mygrid.org.uk/artifactory/repo/commons-collections/commons-collections/2.0/commons-collections-2.0.pom (171 B at 1.1 KB/sec)
[INFO] Downloading: http://repository.mygrid.org.uk/artifactory/repo/commons-collections/commons-collections/2.1/commons-collections-2.1.pom
[INFO] Downloaded: http://repository.mygrid.org.uk/artifactory/repo/commons-collections/commons-collections/2.1/commons-collections-2.1.pom (4 KB at 12.6 KB/sec)
[INFO] Downloading: http://repository.mygrid.org.uk/artifactory/repo/oro/oro/2.0.8/oro-2.0.8.pom
[INFO] Downloaded: http://repository.mygrid.org.uk/artifactory/repo/oro/oro/2.0.8/oro-2.0.8.pom (140 B at 0.8 KB/sec)
[INFO] Downloading: http://repository.mygrid.org.uk/artifactory/repo/org/apache/maven/doxia/doxia-core/1.0-alpha-7/doxia-core-1.0-alpha-7.pom
[INFO] Downloaded: http://repository.mygrid.org.uk/artifactory/repo/org/apache/maven/doxia/doxia-core/1.0-alpha-7/doxia-core-1.0-alpha-7.pom (2 KB at 2.1 KB/sec)
[INFO] Downloading: http://repository.mygrid.org.uk/artifactory/repo/oro/oro/2.0.7/oro-2.0.7.pom
[INFO] Downloaded: http://repository.mygrid.org.uk/artifactory/repo/oro/oro/2.0.7/oro-2.0.7.pom (141 B at 0.7 KB/sec)
[INFO] Downloading: http://repository.mygrid.org.uk/artifactory/repo/org/apache/maven/maven-plugin-api/2.0/maven-plugin-api-2.0.pom
[INFO] Downloaded: http://repository.mygrid.org.uk/artifactory/repo/org/apache/maven/maven-plugin-api/2.0/maven-plugin-api-2.0.pom (601 B at 3.1 KB/sec)
[INFO] Downloading: http://repository.mygrid.org.uk/artifactory/repo/org/apache/maven/maven/2.0/maven-2.0.pom
[INFO] Downloaded: http://repository.mygrid.org.uk/artifactory/repo/org/apache/maven/maven/2.0/maven-2.0.pom (9 KB at 76.5 KB/sec)
[INFO] Downloading: http://repository.mygrid.org.uk/artifactory/repo/org/apache/maven/doxia/doxia-site-renderer/1.0-alpha-7/doxia-site-renderer-1.0-alpha-7.pom
[INFO] Downloaded: http://repository.mygrid.org.uk/artifactory/repo/org/apache/maven/doxia/doxia-site-renderer/1.0-alpha-7/doxia-site-renderer-1.0-alpha-7.pom (2 KB at 7.8 KB/sec)
[INFO] Downloading: http://repository.mygrid.org.uk/artifactory/repo/org/codehaus/plexus/plexus-i18n/1.0-beta-6/plexus-i18n-1.0-beta-6.pom
[INFO] Downloaded: http://repository.mygrid.org.uk/artifactory/repo/org/codehaus/plexus/plexus-i18n/1.0-beta-6/plexus-i18n-1.0-beta-6.pom (771 B at 5.3 KB/sec)
[INFO] Downloading: http://repository.mygrid.org.uk/artifactory/repo/org/codehaus/plexus/plexus-components/1.1.4/plexus-components-1.1.4.pom
[INFO] Downloaded: http://repository.mygrid.org.uk/artifactory/repo/org/codehaus/plexus/plexus-components/1.1.4/plexus-components-1.1.4.pom (3 KB at 15.9 KB/sec)
[INFO] Downloading: http://repository.mygrid.org.uk/artifactory/repo/org/codehaus/plexus/plexus-velocity/1.1.2/plexus-velocity-1.1.2.pom
[INFO] Downloaded: http://repository.mygrid.org.uk/artifactory/repo/org/codehaus/plexus/plexus-velocity/1.1.2/plexus-velocity-1.1.2.pom (8 KB at 18.7 KB/sec)
[INFO] Downloading: http://repository.mygrid.org.uk/artifactory/repo/org/codehaus/plexus/plexus-container-default/1.0-alpha-7/plexus-container-default-1.0-alpha-7.pom
[INFO] Downloaded: http://repository.mygrid.org.uk/artifactory/repo/org/codehaus/plexus/plexus-container-default/1.0-alpha-7/plexus-container-default-1.0-alpha-7.pom (2 KB at 15.9 KB/sec)
[INFO] Downloading: http://repository.mygrid.org.uk/artifactory/repo/plexus/plexus-containers/1.0.2/plexus-containers-1.0.2.pom
[INFO] Downloaded: http://repository.mygrid.org.uk/artifactory/repo/plexus/plexus-containers/1.0.2/plexus-containers-1.0.2.pom (471 B at 1.4 KB/sec)
[INFO] Downloading: http://repository.mygrid.org.uk/artifactory/repo/plexus/plexus-root/1.0.3/plexus-root-1.0.3.pom
[INFO] Downloaded: http://repository.mygrid.org.uk/artifactory/repo/plexus/plexus-root/1.0.3/plexus-root-1.0.3.pom (6 KB at 20.5 KB/sec)
[INFO] Downloading: http://repository.mygrid.org.uk/artifactory/repo/plexus/plexus-utils/1.0.2/plexus-utils-1.0.2.pom
[INFO] Downloaded: http://repository.mygrid.org.uk/artifactory/repo/plexus/plexus-utils/1.0.2/plexus-utils-1.0.2.pom (740 B at 3.1 KB/sec)
[INFO] Downloading: http://repository.mygrid.org.uk/artifactory/repo/commons-logging/commons-logging-api/1.0.4/commons-logging-api-1.0.4.pom
[INFO] Downloaded: http://repository.mygrid.org.uk/artifactory/repo/commons-logging/commons-logging-api/1.0.4/commons-logging-api-1.0.4.pom (168 B at 0.8 KB/sec)
[INFO] Downloading: http://repository.mygrid.org.uk/artifactory/repo/velocity/velocity/1.4/velocity-1.4.pom
[INFO] Downloaded: http://repository.mygrid.org.uk/artifactory/repo/velocity/velocity/1.4/velocity-1.4.pom (3 KB at 7.6 KB/sec)
[INFO] Downloading: http://repository.mygrid.org.uk/artifactory/repo/velocity/velocity-dep/1.4/velocity-dep-1.4.pom
[INFO] Downloaded: http://repository.mygrid.org.uk/artifactory/repo/velocity/velocity-dep/1.4/velocity-dep-1.4.pom (2 KB at 4.2 KB/sec)
[INFO] Downloading: http://repository.mygrid.org.uk/artifactory/repo/org/apache/maven/doxia/doxia-decoration-model/1.0-alpha-7/doxia-decoration-model-1.0-alpha-7.pom
[INFO] Downloaded: http://repository.mygrid.org.uk/artifactory/repo/org/apache/maven/doxia/doxia-decoration-model/1.0-alpha-7/doxia-decoration-model-1.0-alpha-7.pom (2 KB at 3.2 KB/sec)
[INFO] Downloading: http://repository.mygrid.org.uk/artifactory/repo/org/apache/maven/doxia/doxia-sink-api/1.0-alpha-9/doxia-sink-api-1.0-alpha-9.pom
[INFO] Downloaded: http://repository.mygrid.org.uk/artifactory/repo/org/apache/maven/doxia/doxia-sink-api/1.0-alpha-9/doxia-sink-api-1.0-alpha-9.pom (2 KB at 5.3 KB/sec)
[INFO] Downloading: http://repository.mygrid.org.uk/artifactory/repo/org/apache/maven/doxia/doxia/1.0-alpha-9/doxia-1.0-alpha-9.pom
[INFO] Downloaded: http://repository.mygrid.org.uk/artifactory/repo/org/apache/maven/doxia/doxia/1.0-alpha-9/doxia-1.0-alpha-9.pom (9 KB at 16.2 KB/sec)
[INFO] Downloading: http://repository.mygrid.org.uk/artifactory/repo/org/apache/maven/maven-parent/6/maven-parent-6.pom
[INFO] Downloaded: http://repository.mygrid.org.uk/artifactory/repo/org/apache/maven/maven-parent/6/maven-parent-6.pom (20 KB at 147.2 KB/sec)
[INFO] Downloading: http://repository.mygrid.org.uk/artifactory/repo/net/java/dev/javacc/javacc/5.0/javacc-5.0.jar
[INFO] Downloading: http://repository.mygrid.org.uk/artifactory/repo/org/codehaus/plexus/plexus-utils/1.5.6/plexus-utils-1.5.6.jar
[INFO] Downloading: http://repository.mygrid.org.uk/artifactory/repo/edu/ucla/cs/compilers/jtb/1.3.2/jtb-1.3.2.jar
[INFO] Downloading: http://repository.mygrid.org.uk/artifactory/repo/org/apache/maven/reporting/maven-reporting-api/2.0.4/maven-reporting-api-2.0.4.jar
[INFO] Downloading: http://repository.mygrid.org.uk/artifactory/repo/org/apache/maven/reporting/maven-reporting-impl/2.0.4/maven-reporting-impl-2.0.4.jar
[INFO] Downloaded: http://repository.mygrid.org.uk/artifactory/repo/net/java/dev/javacc/javacc/5.0/javacc-5.0.jar (292 KB at 1152.5 KB/sec)
[INFO] Downloading: http://repository.mygrid.org.uk/artifactory/repo/commons-validator/commons-validator/1.2.0/commons-validator-1.2.0.jar
[INFO] Downloaded: http://repository.mygrid.org.uk/artifactory/repo/org/codehaus/plexus/plexus-utils/1.5.6/plexus-utils-1.5.6.jar (245 KB at 840.8 KB/sec)
[INFO] Downloading: http://repository.mygrid.org.uk/artifactory/repo/commons-beanutils/commons-beanutils/1.7.0/commons-beanutils-1.7.0.jar
[INFO] Downloaded: http://repository.mygrid.org.uk/artifactory/repo/edu/ucla/cs/compilers/jtb/1.3.2/jtb-1.3.2.jar (330 KB at 645.5 KB/sec)
[INFO] Downloading: http://repository.mygrid.org.uk/artifactory/repo/commons-digester/commons-digester/1.6/commons-digester-1.6.jar
[INFO] Downloaded: http://repository.mygrid.org.uk/artifactory/repo/org/apache/maven/reporting/maven-reporting-api/2.0.4/maven-reporting-api-2.0.4.jar (5 KB at 9.3 KB/sec)
[INFO] Downloading: http://repository.mygrid.org.uk/artifactory/repo/xml-apis/xml-apis/1.0.b2/xml-apis-1.0.b2.jar
[INFO] Downloaded: http://repository.mygrid.org.uk/artifactory/repo/commons-validator/commons-validator/1.2.0/commons-validator-1.2.0.jar (89 KB at 285.2 KB/sec)
[INFO] Downloading: http://repository.mygrid.org.uk/artifactory/repo/org/apache/maven/doxia/doxia-core/1.0-alpha-7/doxia-core-1.0-alpha-7.jar
[INFO] Downloaded: http://repository.mygrid.org.uk/artifactory/repo/commons-beanutils/commons-beanutils/1.7.0/commons-beanutils-1.7.0.jar (185 KB at 355.0 KB/sec)
[INFO] Downloading: http://repository.mygrid.org.uk/artifactory/repo/oro/oro/2.0.7/oro-2.0.7.jar
[INFO] Downloaded: http://repository.mygrid.org.uk/artifactory/repo/commons-digester/commons-digester/1.6/commons-digester-1.6.jar (165 KB at 387.1 KB/sec)
[INFO] Downloading: http://repository.mygrid.org.uk/artifactory/repo/org/apache/maven/doxia/doxia-sink-api/1.0-alpha-9/doxia-sink-api-1.0-alpha-9.jar
[INFO] Downloaded: http://repository.mygrid.org.uk/artifactory/repo/org/apache/maven/doxia/doxia-core/1.0-alpha-7/doxia-core-1.0-alpha-7.jar (226 KB at 579.1 KB/sec)
[INFO] Downloading: http://repository.mygrid.org.uk/artifactory/repo/org/apache/maven/doxia/doxia-site-renderer/1.0-alpha-7/doxia-site-renderer-1.0-alpha-7.jar
[INFO] Downloaded: http://repository.mygrid.org.uk/artifactory/repo/oro/oro/2.0.7/oro-2.0.7.jar (64 KB at 189.6 KB/sec)
[INFO] Downloading: http://repository.mygrid.org.uk/artifactory/repo/org/codehaus/plexus/plexus-i18n/1.0-beta-6/plexus-i18n-1.0-beta-6.jar
[INFO] Downloaded: http://repository.mygrid.org.uk/artifactory/repo/org/apache/maven/doxia/doxia-sink-api/1.0-alpha-9/doxia-sink-api-1.0-alpha-9.jar (10 KB at 45.2 KB/sec)
[INFO] Downloading: http://repository.mygrid.org.uk/artifactory/repo/org/codehaus/plexus/plexus-velocity/1.1.2/plexus-velocity-1.1.2.jar
[INFO] Downloaded: http://repository.mygrid.org.uk/artifactory/repo/xml-apis/xml-apis/1.0.b2/xml-apis-1.0.b2.jar (107 KB at 142.7 KB/sec)
[INFO] Downloading: http://repository.mygrid.org.uk/artifactory/repo/commons-collections/commons-collections/2.0/commons-collections-2.0.jar
[INFO] Downloaded: http://repository.mygrid.org.uk/artifactory/repo/org/apache/maven/doxia/doxia-site-renderer/1.0-alpha-7/doxia-site-renderer-1.0-alpha-7.jar (13 KB at 36.2 KB/sec)
[INFO] Downloading: http://repository.mygrid.org.uk/artifactory/repo/commons-logging/commons-logging-api/1.0.4/commons-logging-api-1.0.4.jar
[INFO] Downloaded: http://repository.mygrid.org.uk/artifactory/repo/org/codehaus/plexus/plexus-velocity/1.1.2/plexus-velocity-1.1.2.jar (8 KB at 28.6 KB/sec)
[INFO] Downloading: http://repository.mygrid.org.uk/artifactory/repo/velocity/velocity/1.4/velocity-1.4.jar
[INFO] Downloaded: http://repository.mygrid.org.uk/artifactory/repo/org/codehaus/plexus/plexus-i18n/1.0-beta-6/plexus-i18n-1.0-beta-6.jar (12 KB at 31.9 KB/sec)
[INFO] Downloading: http://repository.mygrid.org.uk/artifactory/repo/velocity/velocity-dep/1.4/velocity-dep-1.4.jar
[INFO] Downloaded: http://repository.mygrid.org.uk/artifactory/repo/commons-collections/commons-collections/2.0/commons-collections-2.0.jar (89 KB at 360.7 KB/sec)
[INFO] Downloading: http://repository.mygrid.org.uk/artifactory/repo/org/apache/maven/doxia/doxia-decoration-model/1.0-alpha-7/doxia-decoration-model-1.0-alpha-7.jar
[INFO] Downloaded: http://repository.mygrid.org.uk/artifactory/repo/commons-logging/commons-logging-api/1.0.4/commons-logging-api-1.0.4.jar (26 KB at 77.5 KB/sec)
[INFO] Downloaded: http://repository.mygrid.org.uk/artifactory/repo/velocity/velocity-dep/1.4/velocity-dep-1.4.jar (506 KB at 2647.3 KB/sec)
[INFO] Downloaded: http://repository.mygrid.org.uk/artifactory/repo/velocity/velocity/1.4/velocity-1.4.jar (353 KB at 1203.8 KB/sec)
[INFO] Downloaded: http://repository.mygrid.org.uk/artifactory/repo/org/apache/maven/reporting/maven-reporting-impl/2.0.4/maven-reporting-impl-2.0.4.jar (14 KB at 7.4 KB/sec)
[INFO] Downloaded: http://repository.mygrid.org.uk/artifactory/repo/org/apache/maven/doxia/doxia-decoration-model/1.0-alpha-7/doxia-decoration-model-1.0-alpha-7.jar (38 KB at 66.2 KB/sec)
Java Compiler Compiler Version 5.0 (Tree Builder)
(type "jjtree" with no arguments for help)
Reading from file /local/jenkins/jobs/taverna-ui-components-maintenance/workspace/graph-model/src/main/jjtree/dotparser.jjt . . .
File "Node.java" does not exist.  Will create one.
File "SimpleNode.java" does not exist.  Will create one.
File "ASTParse.java" does not exist.  Will create one.
File "ASTGraph.java" does not exist.  Will create one.
File "ASTStatementList.java" does not exist.  Will create one.
File "ASTStatement.java" does not exist.  Will create one.
File "ASTAttributeStatement.java" does not exist.  Will create one.
File "ASTNodeStatement.java" does not exist.  Will create one.
File "ASTNodeId.java" does not exist.  Will create one.
File "ASTPort.java" does not exist.  Will create one.
File "ASTEdgeStatement.java" does not exist.  Will create one.
File "ASTSubgraph.java" does not exist.  Will create one.
File "ASTEdgeRHS.java" does not exist.  Will create one.
File "ASTAttributeList.java" does not exist.  Will create one.
File "ASTAList.java" does not exist.  Will create one.
File "DOTParserTreeConstants.java" does not exist.  Will create one.
File "DOTParserVisitor.java" does not exist.  Will create one.
File "JJTDOTParserState.java" does not exist.  Will create one.
Annotated grammar generated successfully in /local/jenkins/jobs/taverna-ui-components-maintenance/workspace/graph-model/target/javacc-1402923359214/node/dotparser.jj
Java Compiler Compiler Version 5.0 (Parser Generator)
(type "javacc" with no arguments for help)
Reading from file /local/jenkins/jobs/taverna-ui-components-maintenance/workspace/graph-model/target/javacc-1402923359214/node/dotparser.jj . . .
Note: UNICODE_INPUT option is specified. Please make sure you create the parser/lexer using a Reader with the correct character encoding.
File "TokenMgrError.java" does not exist.  Will create one.
File "ParseException.java" does not exist.  Will create one.
File "Token.java" does not exist.  Will create one.
File "SimpleCharStream.java" does not exist.  Will create one.
Parser generated successfully.
[INFO] Processed 1 grammar
[INFO] 
[INFO] --- maven-resources-plugin:2.6:resources (default-resources) @ graph-model ---
[INFO] Using 'UTF-8' encoding to copy filtered resources.
[INFO] skip non existing resourceDirectory /local/jenkins/jobs/taverna-ui-components-maintenance/workspace/graph-model/src/main/resources
[INFO] 
[INFO] --- maven-compiler-plugin:3.1:compile (default-compile) @ graph-model ---
[INFO] Changes detected - recompiling the module!
[INFO] Compiling 53 source files to /local/jenkins/jobs/taverna-ui-components-maintenance/workspace/graph-model/target/classes
[INFO] 
[INFO] --- maven-resources-plugin:2.6:testResources (default-testResources) @ graph-model ---
[INFO] Using 'UTF-8' encoding to copy filtered resources.
[INFO] Copying 1 resource
[INFO] 
[INFO] --- maven-compiler-plugin:3.1:testCompile (default-testCompile) @ graph-model ---
[INFO] Changes detected - recompiling the module!
[INFO] Compiling 4 source files to /local/jenkins/jobs/taverna-ui-components-maintenance/workspace/graph-model/target/test-classes
[INFO] 
[INFO] --- maven-surefire-plugin:2.17:test (default-test) @ graph-model ---
[INFO] Surefire report directory: /local/jenkins/jobs/taverna-ui-components-maintenance/workspace/graph-model/target/surefire-reports
[INFO] Downloading: http://repository.mygrid.org.uk/artifactory/repo/org/apache/maven/surefire/surefire-junit4/2.17/surefire-junit4-2.17.pom
[INFO] Downloaded: http://repository.mygrid.org.uk/artifactory/repo/org/apache/maven/surefire/surefire-junit4/2.17/surefire-junit4-2.17.pom (3 KB at 26.4 KB/sec)
[INFO] Downloading: http://repository.mygrid.org.uk/artifactory/repo/org/apache/maven/surefire/surefire-junit4/2.17/surefire-junit4-2.17.pom
[INFO] Downloaded: http://repository.mygrid.org.uk/artifactory/repo/org/apache/maven/surefire/surefire-junit4/2.17/surefire-junit4-2.17.pom (3 KB at 121.6 KB/sec)
[INFO] Downloading: http://repository.mygrid.org.uk/artifactory/repo/org/apache/maven/surefire/surefire-providers/2.17/surefire-providers-2.17.pom
[INFO] Downloaded: http://repository.mygrid.org.uk/artifactory/repo/org/apache/maven/surefire/surefire-providers/2.17/surefire-providers-2.17.pom (3 KB at 33.2 KB/sec)
[INFO] Downloading: http://repository.mygrid.org.uk/artifactory/repo/org/apache/maven/surefire/surefire-junit4/2.17/surefire-junit4-2.17.jar
[INFO] Downloaded: http://repository.mygrid.org.uk/artifactory/repo/org/apache/maven/surefire/surefire-junit4/2.17/surefire-junit4-2.17.jar (63 KB at 1121.6 KB/sec)
[INFO] Downloading: http://repository.mygrid.org.uk/artifactory/repo/org/apache/maven/surefire/surefire-junit4/2.17/surefire-junit4-2.17.jar
[INFO] Downloaded: http://repository.mygrid.org.uk/artifactory/repo/org/apache/maven/surefire/surefire-junit4/2.17/surefire-junit4-2.17.jar (63 KB at 1903.3 KB/sec)

-------------------------------------------------------
 T E S T S
-------------------------------------------------------
Running net.sf.taverna.t2.workbench.models.graph.GraphTest
Tests run: 12, Failures: 0, Errors: 0, Skipped: 0, Time elapsed: 0.164 sec - in net.sf.taverna.t2.workbench.models.graph.GraphTest
Running net.sf.taverna.t2.workbench.models.graph.GraphElementTest
Tests run: 12, Failures: 0, Errors: 0, Skipped: 0, Time elapsed: 0.013 sec - in net.sf.taverna.t2.workbench.models.graph.GraphElementTest
Running net.sf.taverna.t2.workbench.models.graph.GraphEdgeTest
Tests run: 10, Failures: 0, Errors: 0, Skipped: 0, Time elapsed: 0.05 sec - in net.sf.taverna.t2.workbench.models.graph.GraphEdgeTest
Running net.sf.taverna.t2.workbench.models.graph.GraphNodeTest
Tests run: 17, Failures: 0, Errors: 0, Skipped: 0, Time elapsed: 0.047 sec - in net.sf.taverna.t2.workbench.models.graph.GraphNodeTest

Results :

Tests run: 51, Failures: 0, Errors: 0, Skipped: 0

[JENKINS] Recording test results
[INFO] 
[INFO] --- maven-jar-plugin:2.4:jar (default-jar) @ graph-model ---
[INFO] Building jar: /local/jenkins/jobs/taverna-ui-components-maintenance/workspace/graph-model/target/graph-model-1.6-SNAPSHOT.jar
[INFO] 
[INFO] >>> maven-source-plugin:2.2.1:jar (default) @ graph-model >>>
[INFO] 
[INFO] --- javacc-maven-plugin:2.6:jjtree-javacc (javacc) @ graph-model ---
[INFO] Skipping - all parsers are up to date
[WARNING] Failed to getClass for org.apache.maven.plugin.source.SourceJarMojo
[INFO] 
[INFO] <<< maven-source-plugin:2.2.1:jar (default) @ graph-model <<<
[INFO] 
[INFO] --- maven-source-plugin:2.2.1:jar (default) @ graph-model ---
[INFO] Building jar: /local/jenkins/jobs/taverna-ui-components-maintenance/workspace/graph-model/target/graph-model-1.6-SNAPSHOT-sources.jar
[INFO] 
[INFO] >>> maven-source-plugin:2.2.1:test-jar (default) @ graph-model >>>
[INFO] 
[INFO] --- javacc-maven-plugin:2.6:jjtree-javacc (javacc) @ graph-model ---
[INFO] Skipping - all parsers are up to date
[WARNING] Failed to getClass for org.apache.maven.plugin.source.TestSourceJarMojo
[INFO] 
[INFO] <<< maven-source-plugin:2.2.1:test-jar (default) @ graph-model <<<
[INFO] 
[INFO] --- maven-source-plugin:2.2.1:test-jar (default) @ graph-model ---
[INFO] Building jar: /local/jenkins/jobs/taverna-ui-components-maintenance/workspace/graph-model/target/graph-model-1.6-SNAPSHOT-test-sources.jar
[INFO] 
[INFO] --- maven-jar-plugin:2.4:test-jar (default) @ graph-model ---
[INFO] Building jar: /local/jenkins/jobs/taverna-ui-components-maintenance/workspace/graph-model/target/graph-model-1.6-SNAPSHOT-tests.jar
[INFO] 
[INFO] --- maven-install-plugin:2.4:install (default-install) @ graph-model ---
[INFO] Installing /local/jenkins/jobs/taverna-ui-components-maintenance/workspace/graph-model/target/graph-model-1.6-SNAPSHOT.jar to /local/jenkins/jobs/taverna-ui-components-maintenance/workspace/.repository/net/sf/taverna/t2/ui-components/graph-model/1.6-SNAPSHOT/graph-model-1.6-SNAPSHOT.jar
[INFO] Installing /local/jenkins/jobs/taverna-ui-components-maintenance/workspace/graph-model/pom.xml to /local/jenkins/jobs/taverna-ui-components-maintenance/workspace/.repository/net/sf/taverna/t2/ui-components/graph-model/1.6-SNAPSHOT/graph-model-1.6-SNAPSHOT.pom
[INFO] Installing /local/jenkins/jobs/taverna-ui-components-maintenance/workspace/graph-model/target/graph-model-1.6-SNAPSHOT-sources.jar to /local/jenkins/jobs/taverna-ui-components-maintenance/workspace/.repository/net/sf/taverna/t2/ui-components/graph-model/1.6-SNAPSHOT/graph-model-1.6-SNAPSHOT-sources.jar
[INFO] Installing /local/jenkins/jobs/taverna-ui-components-maintenance/workspace/graph-model/target/graph-model-1.6-SNAPSHOT-test-sources.jar to /local/jenkins/jobs/taverna-ui-components-maintenance/workspace/.repository/net/sf/taverna/t2/ui-components/graph-model/1.6-SNAPSHOT/graph-model-1.6-SNAPSHOT-test-sources.jar
[INFO] Installing /local/jenkins/jobs/taverna-ui-components-maintenance/workspace/graph-model/target/graph-model-1.6-SNAPSHOT-tests.jar to /local/jenkins/jobs/taverna-ui-components-maintenance/workspace/.repository/net/sf/taverna/t2/ui-components/graph-model/1.6-SNAPSHOT/graph-model-1.6-SNAPSHOT-tests.jar
[INFO]                                                                         
[INFO] ------------------------------------------------------------------------
[INFO] Building Results Perspective 1.6-SNAPSHOT
[INFO] ------------------------------------------------------------------------
[INFO] Downloading: http://repository.mygrid.org.uk/artifactory/repo/net/sf/taverna/t2/ui-api/perspective-core/1.6-SNAPSHOT/maven-metadata.xml
[INFO] Downloaded: http://repository.mygrid.org.uk/artifactory/repo/net/sf/taverna/t2/ui-api/perspective-core/1.6-SNAPSHOT/maven-metadata.xml (2 KB at 12.5 KB/sec)
[INFO] 
[INFO] --- maven-clean-plugin:2.5:clean (default-clean) @ perspective-results ---
[INFO] Deleting /local/jenkins/jobs/taverna-ui-components-maintenance/workspace/perspective-results/target
[INFO] 
[INFO] --- maven-resources-plugin:2.6:resources (default-resources) @ perspective-results ---
[INFO] Using 'UTF-8' encoding to copy filtered resources.
[INFO] Copying 2 resources
[INFO] 
[INFO] --- maven-compiler-plugin:3.1:compile (default-compile) @ perspective-results ---
[INFO] Changes detected - recompiling the module!
[INFO] Compiling 1 source file to /local/jenkins/jobs/taverna-ui-components-maintenance/workspace/perspective-results/target/classes
[INFO] 
[INFO] --- maven-resources-plugin:2.6:testResources (default-testResources) @ perspective-results ---
[INFO] Using 'UTF-8' encoding to copy filtered resources.
[INFO] skip non existing resourceDirectory /local/jenkins/jobs/taverna-ui-components-maintenance/workspace/perspective-results/src/test/resources
[INFO] 
[INFO] --- maven-compiler-plugin:3.1:testCompile (default-testCompile) @ perspective-results ---
[INFO] No sources to compile
[INFO] 
[INFO] --- maven-surefire-plugin:2.17:test (default-test) @ perspective-results ---
[INFO] No tests to run.
[JENKINS] Recording test results
[INFO] 
[INFO] --- maven-jar-plugin:2.4:jar (default-jar) @ perspective-results ---
[INFO] Building jar: /local/jenkins/jobs/taverna-ui-components-maintenance/workspace/perspective-results/target/perspective-results-1.6-SNAPSHOT.jar
[INFO] 
[INFO] >>> maven-source-plugin:2.2.1:jar (default) @ perspective-results >>>
[WARNING] Failed to getClass for org.apache.maven.plugin.source.SourceJarMojo
[INFO] 
[INFO] <<< maven-source-plugin:2.2.1:jar (default) @ perspective-results <<<
[INFO] 
[INFO] --- maven-source-plugin:2.2.1:jar (default) @ perspective-results ---
[INFO] Building jar: /local/jenkins/jobs/taverna-ui-components-maintenance/workspace/perspective-results/target/perspective-results-1.6-SNAPSHOT-sources.jar
[INFO] 
[INFO] >>> maven-source-plugin:2.2.1:test-jar (default) @ perspective-results >>>
[WARNING] Failed to getClass for org.apache.maven.plugin.source.TestSourceJarMojo
[INFO] 
[INFO] <<< maven-source-plugin:2.2.1:test-jar (default) @ perspective-results <<<
[INFO] 
[INFO] --- maven-source-plugin:2.2.1:test-jar (default) @ perspective-results ---
[INFO] No sources in project. Archive not created.
[INFO] 
[INFO] --- maven-jar-plugin:2.4:test-jar (default) @ perspective-results ---
[WARNING] JAR will be empty - no content was marked for inclusion!
[INFO] Building jar: /local/jenkins/jobs/taverna-ui-components-maintenance/workspace/perspective-results/target/perspective-results-1.6-SNAPSHOT-tests.jar
[INFO] 
[INFO] --- maven-install-plugin:2.4:install (default-install) @ perspective-results ---
[INFO] Installing /local/jenkins/jobs/taverna-ui-components-maintenance/workspace/perspective-results/target/perspective-results-1.6-SNAPSHOT.jar to /local/jenkins/jobs/taverna-ui-components-maintenance/workspace/.repository/net/sf/taverna/t2/ui-components/perspective-results/1.6-SNAPSHOT/perspective-results-1.6-SNAPSHOT.jar
[INFO] Installing /local/jenkins/jobs/taverna-ui-components-maintenance/workspace/perspective-results/pom.xml to /local/jenkins/jobs/taverna-ui-components-maintenance/workspace/.repository/net/sf/taverna/t2/ui-components/perspective-results/1.6-SNAPSHOT/perspective-results-1.6-SNAPSHOT.pom
[INFO] Installing /local/jenkins/jobs/taverna-ui-components-maintenance/workspace/perspective-results/target/perspective-results-1.6-SNAPSHOT-sources.jar to /local/jenkins/jobs/taverna-ui-components-maintenance/workspace/.repository/net/sf/taverna/t2/ui-components/perspective-results/1.6-SNAPSHOT/perspective-results-1.6-SNAPSHOT-sources.jar
[INFO] Installing /local/jenkins/jobs/taverna-ui-components-maintenance/workspace/perspective-results/target/perspective-results-1.6-SNAPSHOT-tests.jar to /local/jenkins/jobs/taverna-ui-components-maintenance/workspace/.repository/net/sf/taverna/t2/ui-components/perspective-results/1.6-SNAPSHOT/perspective-results-1.6-SNAPSHOT-tests.jar
[INFO]                                                                         
[INFO] ------------------------------------------------------------------------
[INFO] Building Graph View 1.6-SNAPSHOT
[INFO] ------------------------------------------------------------------------
[INFO] Downloading: http://repository.mygrid.org.uk/artifactory/repo/net/sf/taverna/t2/ui-impl/workbench-impl/1.6-SNAPSHOT/maven-metadata.xml
[INFO] Downloaded: http://repository.mygrid.org.uk/artifactory/repo/net/sf/taverna/t2/ui-impl/workbench-impl/1.6-SNAPSHOT/maven-metadata.xml (2 KB at 30.1 KB/sec)
[INFO] 
[INFO] --- maven-clean-plugin:2.5:clean (default-clean) @ graph-view ---
[INFO] Deleting /local/jenkins/jobs/taverna-ui-components-maintenance/workspace/graph-view/target
[INFO] 
[INFO] --- maven-resources-plugin:2.6:resources (default-resources) @ graph-view ---
[INFO] Using 'UTF-8' encoding to copy filtered resources.
[INFO] Copying 4 resources
[INFO] 
[INFO] --- maven-compiler-plugin:3.1:compile (default-compile) @ graph-view ---
[INFO] Changes detected - recompiling the module!
[INFO] Compiling 41 source files to /local/jenkins/jobs/taverna-ui-components-maintenance/workspace/graph-view/target/classes
[INFO] 
[INFO] --- maven-resources-plugin:2.6:testResources (default-testResources) @ graph-view ---
[INFO] Using 'UTF-8' encoding to copy filtered resources.
[INFO] Copying 2 resources
[INFO] 
[INFO] --- maven-compiler-plugin:3.1:testCompile (default-testCompile) @ graph-view ---
[INFO] No sources to compile
[INFO] 
[INFO] --- maven-surefire-plugin:2.17:test (default-test) @ graph-view ---
[JENKINS] Recording test results
[INFO] 
[INFO] --- maven-jar-plugin:2.4:jar (default-jar) @ graph-view ---
[INFO] Building jar: /local/jenkins/jobs/taverna-ui-components-maintenance/workspace/graph-view/target/graph-view-1.6-SNAPSHOT.jar
[INFO] 
[INFO] >>> maven-source-plugin:2.2.1:jar (default) @ graph-view >>>
[WARNING] Failed to getClass for org.apache.maven.plugin.source.SourceJarMojo
[INFO] 
[INFO] <<< maven-source-plugin:2.2.1:jar (default) @ graph-view <<<
[INFO] 
[INFO] --- maven-source-plugin:2.2.1:jar (default) @ graph-view ---
[INFO] Building jar: /local/jenkins/jobs/taverna-ui-components-maintenance/workspace/graph-view/target/graph-view-1.6-SNAPSHOT-sources.jar
[INFO] 
[INFO] >>> maven-source-plugin:2.2.1:test-jar (default) @ graph-view >>>
[WARNING] Failed to getClass for org.apache.maven.plugin.source.TestSourceJarMojo
[INFO] 
[INFO] <<< maven-source-plugin:2.2.1:test-jar (default) @ graph-view <<<
[INFO] 
[INFO] --- maven-source-plugin:2.2.1:test-jar (default) @ graph-view ---
[INFO] Building jar: /local/jenkins/jobs/taverna-ui-components-maintenance/workspace/graph-view/target/graph-view-1.6-SNAPSHOT-test-sources.jar
[INFO] 
[INFO] --- maven-jar-plugin:2.4:test-jar (default) @ graph-view ---
[INFO] Building jar: /local/jenkins/jobs/taverna-ui-components-maintenance/workspace/graph-view/target/graph-view-1.6-SNAPSHOT-tests.jar
[INFO] 
[INFO] --- maven-install-plugin:2.4:install (default-install) @ graph-view ---
[INFO] Installing /local/jenkins/jobs/taverna-ui-components-maintenance/workspace/graph-view/target/graph-view-1.6-SNAPSHOT.jar to /local/jenkins/jobs/taverna-ui-components-maintenance/workspace/.repository/net/sf/taverna/t2/ui-components/graph-view/1.6-SNAPSHOT/graph-view-1.6-SNAPSHOT.jar
[INFO] Installing /local/jenkins/jobs/taverna-ui-components-maintenance/workspace/graph-view/pom.xml to /local/jenkins/jobs/taverna-ui-components-maintenance/workspace/.repository/net/sf/taverna/t2/ui-components/graph-view/1.6-SNAPSHOT/graph-view-1.6-SNAPSHOT.pom
[INFO] Installing /local/jenkins/jobs/taverna-ui-components-maintenance/workspace/graph-view/target/graph-view-1.6-SNAPSHOT-sources.jar to /local/jenkins/jobs/taverna-ui-components-maintenance/workspace/.repository/net/sf/taverna/t2/ui-components/graph-view/1.6-SNAPSHOT/graph-view-1.6-SNAPSHOT-sources.jar
[INFO] Installing /local/jenkins/jobs/taverna-ui-components-maintenance/workspace/graph-view/target/graph-view-1.6-SNAPSHOT-test-sources.jar to /local/jenkins/jobs/taverna-ui-components-maintenance/workspace/.repository/net/sf/taverna/t2/ui-components/graph-view/1.6-SNAPSHOT/graph-view-1.6-SNAPSHOT-test-sources.jar
[INFO] Installing /local/jenkins/jobs/taverna-ui-components-maintenance/workspace/graph-view/target/graph-view-1.6-SNAPSHOT-tests.jar to /local/jenkins/jobs/taverna-ui-components-maintenance/workspace/.repository/net/sf/taverna/t2/ui-components/graph-view/1.6-SNAPSHOT/graph-view-1.6-SNAPSHOT-tests.jar
[INFO]                                                                         
[INFO] ------------------------------------------------------------------------
[INFO] Building Results and outputs from a workflow run 1.6-SNAPSHOT
[INFO] ------------------------------------------------------------------------
[INFO] Downloading: http://repository.mygrid.org.uk/artifactory/repo/uk/org/mygrid/taverna/baclava/baclava-core/1.7.2.2/baclava-core-1.7.2.2.pom
[INFO] Downloaded: http://repository.mygrid.org.uk/artifactory/repo/uk/org/mygrid/taverna/baclava/baclava-core/1.7.2.2/baclava-core-1.7.2.2.pom (2 KB at 3.6 KB/sec)
[INFO] Downloading: http://repository.mygrid.org.uk/artifactory/repo/uk/org/mygrid/taverna/baclava/baclava-core/1.7.2.2/baclava-core-1.7.2.2.pom
[INFO] Downloaded: http://repository.mygrid.org.uk/artifactory/repo/uk/org/mygrid/taverna/baclava/baclava-core/1.7.2.2/baclava-core-1.7.2.2.pom (2 KB at 22.8 KB/sec)
[INFO] Downloading: http://repository.mygrid.org.uk/artifactory/repo/uk/org/mygrid/taverna/baclava/baclava-core/1.7.2.2/baclava-core-1.7.2.2.pom
[INFO] Downloaded: http://repository.mygrid.org.uk/artifactory/repo/uk/org/mygrid/taverna/baclava/baclava-core/1.7.2.2/baclava-core-1.7.2.2.pom (2 KB at 50.5 KB/sec)
[INFO] Downloading: http://repository.mygrid.org.uk/artifactory/repo/uk/org/mygrid/taverna/baclava/baclava-core/1.7.2.2/baclava-core-1.7.2.2.pom
[INFO] Downloaded: http://repository.mygrid.org.uk/artifactory/repo/uk/org/mygrid/taverna/baclava/baclava-core/1.7.2.2/baclava-core-1.7.2.2.pom (2 KB at 41.5 KB/sec)
[INFO] Downloading: http://repository.mygrid.org.uk/artifactory/repo/uk/org/mygrid/taverna/baclava/baclava-core/1.7.2.2/baclava-core-1.7.2.2.pom
[INFO] Downloaded: http://repository.mygrid.org.uk/artifactory/repo/uk/org/mygrid/taverna/baclava/baclava-core/1.7.2.2/baclava-core-1.7.2.2.pom (2 KB at 17.3 KB/sec)
[INFO] Downloading: http://repository.mygrid.org.uk/artifactory/repo/uk/org/mygrid/taverna/baclava/baclava-core/1.7.2.2/baclava-core-1.7.2.2.pom
[INFO] Downloaded: http://repository.mygrid.org.uk/artifactory/repo/uk/org/mygrid/taverna/baclava/baclava-core/1.7.2.2/baclava-core-1.7.2.2.pom (2 KB at 50.5 KB/sec)
[INFO] Downloading: http://repository.mygrid.org.uk/artifactory/repo/uk/org/mygrid/taverna/baclava/baclava-core/1.7.2.2/baclava-core-1.7.2.2.pom
[INFO] Downloaded: http://repository.mygrid.org.uk/artifactory/repo/uk/org/mygrid/taverna/baclava/baclava-core/1.7.2.2/baclava-core-1.7.2.2.pom (2 KB at 52.8 KB/sec)
[INFO] Downloading: http://repository.mygrid.org.uk/artifactory/repo/uk/org/mygrid/taverna/baclava/1.7.2.2/baclava-1.7.2.2.pom
[INFO] Downloaded: http://repository.mygrid.org.uk/artifactory/repo/uk/org/mygrid/taverna/baclava/1.7.2.2/baclava-1.7.2.2.pom (801 B at 8.1 KB/sec)
[INFO] Downloading: http://repository.mygrid.org.uk/artifactory/repo/uk/org/mygrid/taverna/taverna/1.7.2.2/taverna-1.7.2.2.pom
[INFO] Downloaded: http://repository.mygrid.org.uk/artifactory/repo/uk/org/mygrid/taverna/taverna/1.7.2.2/taverna-1.7.2.2.pom (10 KB at 40.0 KB/sec)
[INFO] Downloading: http://repository.mygrid.org.uk/artifactory/repo/net/sf/taverna/parent/0.1.2009-02-12/parent-0.1.2009-02-12.pom
[INFO] Downloaded: http://repository.mygrid.org.uk/artifactory/repo/net/sf/taverna/parent/0.1.2009-02-12/parent-0.1.2009-02-12.pom (5 KB at 37.2 KB/sec)
[INFO] Downloading: http://repository.mygrid.org.uk/artifactory/repo/net/sf/taverna/parent/0.1.2009-02-12/parent-0.1.2009-02-12.pom
[INFO] Downloaded: http://repository.mygrid.org.uk/artifactory/repo/net/sf/taverna/parent/0.1.2009-02-12/parent-0.1.2009-02-12.pom (5 KB at 186.1 KB/sec)
[INFO] Downloading: http://repository.mygrid.org.uk/artifactory/repo/net/sf/taverna/parent/0.1.2009-02-12/parent-0.1.2009-02-12.pom
[INFO] Downloaded: http://repository.mygrid.org.uk/artifactory/repo/net/sf/taverna/parent/0.1.2009-02-12/parent-0.1.2009-02-12.pom (5 KB at 121.0 KB/sec)
[INFO] Downloading: http://repository.mygrid.org.uk/artifactory/repo/net/sf/taverna/parent/0.1.2009-02-12/parent-0.1.2009-02-12.pom
[INFO] Downloaded: http://repository.mygrid.org.uk/artifactory/repo/net/sf/taverna/parent/0.1.2009-02-12/parent-0.1.2009-02-12.pom (5 KB at 179.3 KB/sec)
[INFO] Downloading: http://repository.mygrid.org.uk/artifactory/repo/uk/org/mygrid/taverna/taverna-core/1.7.2.2/taverna-core-1.7.2.2.pom
[INFO] Downloaded: http://repository.mygrid.org.uk/artifactory/repo/uk/org/mygrid/taverna/taverna-core/1.7.2.2/taverna-core-1.7.2.2.pom (2 KB at 9.9 KB/sec)
[INFO] Downloading: http://repository.mygrid.org.uk/artifactory/repo/uk/org/mygrid/taverna/taverna-core/1.7.2.2/taverna-core-1.7.2.2.pom
[INFO] Downloaded: http://repository.mygrid.org.uk/artifactory/repo/uk/org/mygrid/taverna/taverna-core/1.7.2.2/taverna-core-1.7.2.2.pom (2 KB at 35.6 KB/sec)
[INFO] Downloading: http://repository.mygrid.org.uk/artifactory/repo/uk/org/mygrid/taverna/taverna-core/1.7.2.2/taverna-core-1.7.2.2.pom
[INFO] Downloaded: http://repository.mygrid.org.uk/artifactory/repo/uk/org/mygrid/taverna/taverna-core/1.7.2.2/taverna-core-1.7.2.2.pom (2 KB at 77.9 KB/sec)
[INFO] Downloading: http://repository.mygrid.org.uk/artifactory/repo/uk/org/mygrid/taverna/taverna-core/1.7.2.2/taverna-core-1.7.2.2.pom
[INFO] Downloaded: http://repository.mygrid.org.uk/artifactory/repo/uk/org/mygrid/taverna/taverna-core/1.7.2.2/taverna-core-1.7.2.2.pom (2 KB at 86.1 KB/sec)
[INFO] Downloading: http://repository.mygrid.org.uk/artifactory/repo/jdom/jdom/1.0/jdom-1.0.pom
[INFO] Downloaded: http://repository.mygrid.org.uk/artifactory/repo/jdom/jdom/1.0/jdom-1.0.pom (2 KB at 8.7 KB/sec)
[INFO] Downloading: http://repository.mygrid.org.uk/artifactory/repo/uk/org/mygrid/taverna/raven/raven/1.9/raven-1.9.pom
[INFO] Downloaded: http://repository.mygrid.org.uk/artifactory/repo/uk/org/mygrid/taverna/raven/raven/1.9/raven-1.9.pom (2 KB at 7.8 KB/sec)
[INFO] Downloading: http://repository.mygrid.org.uk/artifactory/repo/net/sf/taverna/raven-parent/1.9/raven-parent-1.9.pom
[INFO] Downloaded: http://repository.mygrid.org.uk/artifactory/repo/net/sf/taverna/raven-parent/1.9/raven-parent-1.9.pom (7 KB at 37.7 KB/sec)
[INFO] Downloading: http://repository.mygrid.org.uk/artifactory/repo/net/sf/taverna/parent/0.1.2008-11-03/parent-0.1.2008-11-03.pom
[INFO] Downloaded: http://repository.mygrid.org.uk/artifactory/repo/net/sf/taverna/parent/0.1.2008-11-03/parent-0.1.2008-11-03.pom (5 KB at 42.4 KB/sec)
[INFO] Downloading: http://repository.mygrid.org.uk/artifactory/repo/uk/org/mygrid/taverna/raven/raven-log4j/1.9/raven-log4j-1.9.pom
[INFO] Downloaded: http://repository.mygrid.org.uk/artifactory/repo/uk/org/mygrid/taverna/raven/raven-log4j/1.9/raven-log4j-1.9.pom (889 B at 5.7 KB/sec)
[INFO] Downloading: http://repository.mygrid.org.uk/artifactory/repo/uk/org/mygrid/taverna/taverna-bootstrap/1.7.2.2/taverna-bootstrap-1.7.2.2.pom
[INFO] Downloaded: http://repository.mygrid.org.uk/artifactory/repo/uk/org/mygrid/taverna/taverna-bootstrap/1.7.2.2/taverna-bootstrap-1.7.2.2.pom (2 KB at 15.4 KB/sec)
[INFO] Downloading: http://repository.mygrid.org.uk/artifactory/repo/net/sf/taverna/t2/results/results/1.6-SNAPSHOT/maven-metadata.xml
[INFO] Downloading: http://repository.mygrid.org.uk/artifactory/repo/net/sf/taverna/t2/results/results/1.6-SNAPSHOT/maven-metadata.xml
[INFO] Downloading: http://repository.mygrid.org.uk/artifactory/repo/net/sf/taverna/t2/results/results/1.6-SNAPSHOT/maven-metadata.xml
[INFO] Downloading: http://repository.mygrid.org.uk/artifactory/repo/net/sf/taverna/t2/results/results/1.6-SNAPSHOT/maven-metadata.xml
[INFO] Downloaded: http://repository.mygrid.org.uk/artifactory/repo/net/sf/taverna/t2/results/results/1.6-SNAPSHOT/maven-metadata.xml (2 KB at 1.2 KB/sec)
[INFO] Downloaded: http://repository.mygrid.org.uk/artifactory/repo/net/sf/taverna/t2/results/results/1.6-SNAPSHOT/maven-metadata.xml (2 KB at 1.2 KB/sec)
[INFO] Downloaded: http://repository.mygrid.org.uk/artifactory/repo/net/sf/taverna/t2/results/results/1.6-SNAPSHOT/maven-metadata.xml (2 KB at 1.2 KB/sec)
[INFO] Downloaded: http://repository.mygrid.org.uk/artifactory/repo/net/sf/taverna/t2/results/results/1.6-SNAPSHOT/maven-metadata.xml (2 KB at 1.2 KB/sec)
[INFO] Downloading: http://repository.mygrid.org.uk/artifactory/repo/net/sf/taverna/t2/results/results/1.6-SNAPSHOT/maven-metadata.xml
[INFO] Downloading: http://repository.mygrid.org.uk/artifactory/repo/net/sf/taverna/t2/results/results/1.6-SNAPSHOT/maven-metadata.xml
[INFO] Downloading: http://repository.mygrid.org.uk/artifactory/repo/net/sf/taverna/t2/results/results/1.6-SNAPSHOT/maven-metadata.xml
[INFO] Downloading: http://repository.mygrid.org.uk/artifactory/repo/net/sf/taverna/t2/results/results/1.6-SNAPSHOT/maven-metadata.xml
[INFO] Downloaded: http://repository.mygrid.org.uk/artifactory/repo/net/sf/taverna/t2/results/results/1.6-SNAPSHOT/maven-metadata.xml (2 KB at 29.8 KB/sec)
[INFO] Downloaded: http://repository.mygrid.org.uk/artifactory/repo/net/sf/taverna/t2/results/results/1.6-SNAPSHOT/maven-metadata.xml (2 KB at 21.1 KB/sec)
[INFO] Downloaded: http://repository.mygrid.org.uk/artifactory/repo/net/sf/taverna/t2/results/results/1.6-SNAPSHOT/maven-metadata.xml (2 KB at 21.9 KB/sec)
[INFO] Downloaded: http://repository.mygrid.org.uk/artifactory/repo/net/sf/taverna/t2/results/results/1.6-SNAPSHOT/maven-metadata.xml (2 KB at 19.4 KB/sec)
[INFO] Downloading: http://repository.mygrid.org.uk/artifactory/repo/net/sf/taverna/t2/results/results/1.6-SNAPSHOT/results-1.6-20140612.105426-11.pom
[INFO] Downloaded: http://repository.mygrid.org.uk/artifactory/repo/net/sf/taverna/t2/results/results/1.6-SNAPSHOT/results-1.6-20140612.105426-11.pom (4 KB at 22.9 KB/sec)
[INFO] Downloading: http://repository.mygrid.org.uk/artifactory/repo/uk/org/mygrid/resources/mimeutil/mime-util/2.1.2-x-SNAPSHOT/maven-metadata.xml
[INFO] Downloading: http://repository.mygrid.org.uk/artifactory/repo/uk/org/mygrid/resources/mimeutil/mime-util/2.1.2-x-SNAPSHOT/maven-metadata.xml
[INFO] Downloading: http://repository.mygrid.org.uk/artifactory/repo/uk/org/mygrid/resources/mimeutil/mime-util/2.1.2-x-SNAPSHOT/maven-metadata.xml
[INFO] Downloading: http://repository.mygrid.org.uk/artifactory/repo/uk/org/mygrid/resources/mimeutil/mime-util/2.1.2-x-SNAPSHOT/maven-metadata.xml
[INFO] Downloaded: http://repository.mygrid.org.uk/artifactory/repo/uk/org/mygrid/resources/mimeutil/mime-util/2.1.2-x-SNAPSHOT/maven-metadata.xml (785 B at 1.2 KB/sec)
[INFO] Downloaded: http://repository.mygrid.org.uk/artifactory/repo/uk/org/mygrid/resources/mimeutil/mime-util/2.1.2-x-SNAPSHOT/maven-metadata.xml (785 B at 1.2 KB/sec)
[INFO] Downloaded: http://repository.mygrid.org.uk/artifactory/repo/uk/org/mygrid/resources/mimeutil/mime-util/2.1.2-x-SNAPSHOT/maven-metadata.xml (785 B at 1.1 KB/sec)
[INFO] Downloaded: http://repository.mygrid.org.uk/artifactory/repo/uk/org/mygrid/resources/mimeutil/mime-util/2.1.2-x-SNAPSHOT/maven-metadata.xml (785 B at 1.1 KB/sec)
[INFO] Downloading: http://repository.mygrid.org.uk/artifactory/repo/uk/org/mygrid/resources/mimeutil/mime-util/2.1.2-x-SNAPSHOT/maven-metadata.xml
[INFO] Downloading: http://repository.mygrid.org.uk/artifactory/repo/uk/org/mygrid/resources/mimeutil/mime-util/2.1.2-x-SNAPSHOT/maven-metadata.xml
[INFO] Downloading: http://repository.mygrid.org.uk/artifactory/repo/uk/org/mygrid/resources/mimeutil/mime-util/2.1.2-x-SNAPSHOT/maven-metadata.xml
[INFO] Downloading: http://repository.mygrid.org.uk/artifactory/repo/uk/org/mygrid/resources/mimeutil/mime-util/2.1.2-x-SNAPSHOT/maven-metadata.xml
[INFO] Downloaded: http://repository.mygrid.org.uk/artifactory/repo/uk/org/mygrid/resources/mimeutil/mime-util/2.1.2-x-SNAPSHOT/maven-metadata.xml (785 B at 17.8 KB/sec)
[INFO] Downloaded: http://repository.mygrid.org.uk/artifactory/repo/uk/org/mygrid/resources/mimeutil/mime-util/2.1.2-x-SNAPSHOT/maven-metadata.xml (785 B at 15.0 KB/sec)
[INFO] Downloaded: http://repository.mygrid.org.uk/artifactory/repo/uk/org/mygrid/resources/mimeutil/mime-util/2.1.2-x-SNAPSHOT/maven-metadata.xml (785 B at 13.7 KB/sec)
[INFO] Downloaded: http://repository.mygrid.org.uk/artifactory/repo/uk/org/mygrid/resources/mimeutil/mime-util/2.1.2-x-SNAPSHOT/maven-metadata.xml (785 B at 16.3 KB/sec)
[INFO] Downloading: http://repository.mygrid.org.uk/artifactory/repo/uk/org/mygrid/resources/mimeutil/mime-util/2.1.2-x-SNAPSHOT/mime-util-2.1.2-x-20140514.145941-2.pom
[INFO] Downloaded: http://repository.mygrid.org.uk/artifactory/repo/uk/org/mygrid/resources/mimeutil/mime-util/2.1.2-x-SNAPSHOT/mime-util-2.1.2-x-20140514.145941-2.pom (9 KB at 46.2 KB/sec)
[INFO] Downloading: http://repository.mygrid.org.uk/artifactory/repo/org/slf4j/slf4j-api/1.6.4/slf4j-api-1.6.4.pom
[INFO] Downloaded: http://repository.mygrid.org.uk/artifactory/repo/org/slf4j/slf4j-api/1.6.4/slf4j-api-1.6.4.pom (3 KB at 30.2 KB/sec)
[INFO] Downloading: http://repository.mygrid.org.uk/artifactory/repo/org/slf4j/slf4j-parent/1.6.4/slf4j-parent-1.6.4.pom
[INFO] Downloaded: http://repository.mygrid.org.uk/artifactory/repo/org/slf4j/slf4j-parent/1.6.4/slf4j-parent-1.6.4.pom (12 KB at 195.4 KB/sec)
[INFO] Downloading: http://repository.mygrid.org.uk/artifactory/repo/org/slf4j/slf4j-log4j12/1.6.4/slf4j-log4j12-1.6.4.pom
[INFO] Downloaded: http://repository.mygrid.org.uk/artifactory/repo/org/slf4j/slf4j-log4j12/1.6.4/slf4j-log4j12-1.6.4.pom (2 KB at 28.3 KB/sec)
[INFO] Downloading: http://repository.mygrid.org.uk/artifactory/repo/uk/org/mygrid/resources/clapper/ocutil/2.5.1/ocutil-2.5.1.pom
[INFO] Downloaded: http://repository.mygrid.org.uk/artifactory/repo/uk/org/mygrid/resources/clapper/ocutil/2.5.1/ocutil-2.5.1.pom (211 B at 1.6 KB/sec)
[INFO] Downloading: http://repository.mygrid.org.uk/artifactory/repo/net/sf/taverna/t2/ui-api/renderers-api/1.6-SNAPSHOT/maven-metadata.xml
[INFO] Downloading: http://repository.mygrid.org.uk/artifactory/repo/net/sf/taverna/t2/ui-api/renderers-api/1.6-SNAPSHOT/maven-metadata.xml
[INFO] Downloading: http://repository.mygrid.org.uk/artifactory/repo/net/sf/taverna/t2/ui-api/renderers-api/1.6-SNAPSHOT/maven-metadata.xml
[INFO] Downloading: http://repository.mygrid.org.uk/artifactory/repo/net/sf/taverna/t2/ui-api/renderers-api/1.6-SNAPSHOT/maven-metadata.xml
[INFO] Downloaded: http://repository.mygrid.org.uk/artifactory/repo/net/sf/taverna/t2/ui-api/renderers-api/1.6-SNAPSHOT/maven-metadata.xml (2 KB at 2.2 KB/sec)
[INFO] Downloaded: http://repository.mygrid.org.uk/artifactory/repo/net/sf/taverna/t2/ui-api/renderers-api/1.6-SNAPSHOT/maven-metadata.xml (2 KB at 2.3 KB/sec)
[INFO] Downloaded: http://repository.mygrid.org.uk/artifactory/repo/net/sf/taverna/t2/ui-api/renderers-api/1.6-SNAPSHOT/maven-metadata.xml (2 KB at 2.2 KB/sec)
[INFO] Downloaded: http://repository.mygrid.org.uk/artifactory/repo/net/sf/taverna/t2/ui-api/renderers-api/1.6-SNAPSHOT/maven-metadata.xml (2 KB at 2.2 KB/sec)
[INFO] Downloading: http://repository.mygrid.org.uk/artifactory/repo/net/sf/taverna/t2/ui-api/renderers-api/1.6-SNAPSHOT/maven-metadata.xml
[INFO] Downloading: http://repository.mygrid.org.uk/artifactory/repo/net/sf/taverna/t2/ui-api/renderers-api/1.6-SNAPSHOT/maven-metadata.xml
[INFO] Downloading: http://repository.mygrid.org.uk/artifactory/repo/net/sf/taverna/t2/ui-api/renderers-api/1.6-SNAPSHOT/maven-metadata.xml
[INFO] Downloading: http://repository.mygrid.org.uk/artifactory/repo/net/sf/taverna/t2/ui-api/renderers-api/1.6-SNAPSHOT/maven-metadata.xml
[INFO] Downloaded: http://repository.mygrid.org.uk/artifactory/repo/net/sf/taverna/t2/ui-api/renderers-api/1.6-SNAPSHOT/maven-metadata.xml (2 KB at 18.5 KB/sec)
[INFO] Downloaded: http://repository.mygrid.org.uk/artifactory/repo/net/sf/taverna/t2/ui-api/renderers-api/1.6-SNAPSHOT/maven-metadata.xml (2 KB at 17.1 KB/sec)
[INFO] Downloaded: http://repository.mygrid.org.uk/artifactory/repo/net/sf/taverna/t2/ui-api/renderers-api/1.6-SNAPSHOT/maven-metadata.xml (2 KB at 16.2 KB/sec)
[INFO] Downloaded: http://repository.mygrid.org.uk/artifactory/repo/net/sf/taverna/t2/ui-api/renderers-api/1.6-SNAPSHOT/maven-metadata.xml (2 KB at 17.1 KB/sec)
[INFO] Downloading: http://repository.mygrid.org.uk/artifactory/repo/net/sf/taverna/t2/ui-api/renderers-api/1.6-SNAPSHOT/renderers-api-1.6-20140612.105426-9.pom
[INFO] Downloaded: http://repository.mygrid.org.uk/artifactory/repo/net/sf/taverna/t2/ui-api/renderers-api/1.6-SNAPSHOT/renderers-api-1.6-20140612.105426-9.pom (949 B at 10.2 KB/sec)
[INFO] Downloading: http://repository.mygrid.org.uk/artifactory/repo/net/sf/taverna/t2/core/provenanceconnector/1.6-SNAPSHOT/maven-metadata.xml
[INFO] Downloading: http://repository.mygrid.org.uk/artifactory/repo/net/sf/taverna/t2/core/provenanceconnector/1.6-SNAPSHOT/maven-metadata.xml
[INFO] Downloading: http://repository.mygrid.org.uk/artifactory/repo/net/sf/taverna/t2/core/provenanceconnector/1.6-SNAPSHOT/maven-metadata.xml
[INFO] Downloading: http://repository.mygrid.org.uk/artifactory/repo/net/sf/taverna/t2/core/provenanceconnector/1.6-SNAPSHOT/maven-metadata.xml
[INFO] Downloaded: http://repository.mygrid.org.uk/artifactory/repo/net/sf/taverna/t2/core/provenanceconnector/1.6-SNAPSHOT/maven-metadata.xml (2 KB at 2.3 KB/sec)
[INFO] Downloaded: http://repository.mygrid.org.uk/artifactory/repo/net/sf/taverna/t2/core/provenanceconnector/1.6-SNAPSHOT/maven-metadata.xml (2 KB at 2.3 KB/sec)
[INFO] Downloaded: http://repository.mygrid.org.uk/artifactory/repo/net/sf/taverna/t2/core/provenanceconnector/1.6-SNAPSHOT/maven-metadata.xml (2 KB at 2.3 KB/sec)
[INFO] Downloaded: http://repository.mygrid.org.uk/artifactory/repo/net/sf/taverna/t2/core/provenanceconnector/1.6-SNAPSHOT/maven-metadata.xml (2 KB at 2.3 KB/sec)
[INFO] Downloading: http://repository.mygrid.org.uk/artifactory/repo/net/sf/taverna/t2/core/provenanceconnector/1.6-SNAPSHOT/maven-metadata.xml
[INFO] Downloading: http://repository.mygrid.org.uk/artifactory/repo/net/sf/taverna/t2/core/provenanceconnector/1.6-SNAPSHOT/maven-metadata.xml
[INFO] Downloading: http://repository.mygrid.org.uk/artifactory/repo/net/sf/taverna/t2/core/provenanceconnector/1.6-SNAPSHOT/maven-metadata.xml
[INFO] Downloading: http://repository.mygrid.org.uk/artifactory/repo/net/sf/taverna/t2/core/provenanceconnector/1.6-SNAPSHOT/maven-metadata.xml
[INFO] Downloaded: http://repository.mygrid.org.uk/artifactory/repo/net/sf/taverna/t2/core/provenanceconnector/1.6-SNAPSHOT/maven-metadata.xml (2 KB at 14.5 KB/sec)
[INFO] Downloaded: http://repository.mygrid.org.uk/artifactory/repo/net/sf/taverna/t2/core/provenanceconnector/1.6-SNAPSHOT/maven-metadata.xml (2 KB at 14.6 KB/sec)
[INFO] Downloaded: http://repository.mygrid.org.uk/artifactory/repo/net/sf/taverna/t2/core/provenanceconnector/1.6-SNAPSHOT/maven-metadata.xml (2 KB at 13.2 KB/sec)
[INFO] Downloaded: http://repository.mygrid.org.uk/artifactory/repo/net/sf/taverna/t2/core/provenanceconnector/1.6-SNAPSHOT/maven-metadata.xml (2 KB at 13.6 KB/sec)
[INFO] Downloading: http://repository.mygrid.org.uk/artifactory/repo/net/sf/taverna/t2/core/provenanceconnector/1.6-SNAPSHOT/provenanceconnector-1.6-20140612.105140-10.pom
[INFO] Downloaded: http://repository.mygrid.org.uk/artifactory/repo/net/sf/taverna/t2/core/provenanceconnector/1.6-SNAPSHOT/provenanceconnector-1.6-20140612.105140-10.pom (5 KB at 49.8 KB/sec)
[INFO] Downloading: http://repository.mygrid.org.uk/artifactory/repo/org/tupeloproject/tupelo-cet/2.6/tupelo-cet-2.6.pom
[INFO] Downloaded: http://repository.mygrid.org.uk/artifactory/repo/org/tupeloproject/tupelo-cet/2.6/tupelo-cet-2.6.pom (3 KB at 41.8 KB/sec)
[INFO] Downloading: http://repository.mygrid.org.uk/artifactory/repo/org/tupeloproject/tupelo-core/2.6/tupelo-core-2.6.pom
[INFO] Downloaded: http://repository.mygrid.org.uk/artifactory/repo/org/tupeloproject/tupelo-core/2.6/tupelo-core-2.6.pom (3 KB at 31.9 KB/sec)
[INFO] Downloading: http://repository.mygrid.org.uk/artifactory/repo/org/tupeloproject/tupelo-all/2.6/tupelo-all-2.6.pom
[INFO] Downloaded: http://repository.mygrid.org.uk/artifactory/repo/org/tupeloproject/tupelo-all/2.6/tupelo-all-2.6.pom (4 KB at 61.0 KB/sec)
[INFO] Downloading: http://repository.mygrid.org.uk/artifactory/repo/org/tupeloproject/tupelo-kernel/2.6/tupelo-kernel-2.6.pom
[INFO] Downloaded: http://repository.mygrid.org.uk/artifactory/repo/org/tupeloproject/tupelo-kernel/2.6/tupelo-kernel-2.6.pom (4 KB at 153.5 KB/sec)
[INFO] Downloading: http://repository.mygrid.org.uk/artifactory/repo/org/tupeloproject/tupelo-kernel/2.6/tupelo-kernel-2.6.pom
[INFO] Downloaded: http://repository.mygrid.org.uk/artifactory/repo/org/tupeloproject/tupelo-kernel/2.6/tupelo-kernel-2.6.pom (4 KB at 181.5 KB/sec)
[INFO] Downloading: http://repository.mygrid.org.uk/artifactory/repo/org/tupeloproject/tupelo-kernel/2.6/tupelo-kernel-2.6.pom
[INFO] Downloaded: http://repository.mygrid.org.uk/artifactory/repo/org/tupeloproject/tupelo-kernel/2.6/tupelo-kernel-2.6.pom (4 KB at 173.6 KB/sec)
[INFO] Downloading: http://repository.mygrid.org.uk/artifactory/repo/org/tupeloproject/tupelo-util/2.6/tupelo-util-2.6.pom
[INFO] Downloaded: http://repository.mygrid.org.uk/artifactory/repo/org/tupeloproject/tupelo-util/2.6/tupelo-util-2.6.pom (3 KB at 41.0 KB/sec)
[INFO] Downloading: http://repository.mygrid.org.uk/artifactory/repo/org/openprovenance/opm-core/1.1.8/opm-core-1.1.8.pom
[INFO] Downloaded: http://repository.mygrid.org.uk/artifactory/repo/org/openprovenance/opm-core/1.1.8/opm-core-1.1.8.pom (18 KB at 166.6 KB/sec)
[INFO] Downloading: http://repository.mygrid.org.uk/artifactory/repo/org/openprovenance/specs/1.1.8/specs-1.1.8.pom
[INFO] Downloaded: http://repository.mygrid.org.uk/artifactory/repo/org/openprovenance/specs/1.1.8/specs-1.1.8.pom (10 KB at 100.9 KB/sec)
[INFO] Downloading: http://repository.mygrid.org.uk/artifactory/repo/javax/xml/bind/jaxb-api/2.1/jaxb-api-2.1.pom
[INFO] Downloaded: http://repository.mygrid.org.uk/artifactory/repo/javax/xml/bind/jaxb-api/2.1/jaxb-api-2.1.pom (486 B at 8.3 KB/sec)
[INFO] Downloading: http://repository.mygrid.org.uk/artifactory/repo/javax/xml/bind/jaxb-api/2.1/jaxb-api-2.1.pom
[INFO] Downloaded: http://repository.mygrid.org.uk/artifactory/repo/javax/xml/bind/jaxb-api/2.1/jaxb-api-2.1.pom (486 B at 17.6 KB/sec)
[INFO] Downloading: http://repository.mygrid.org.uk/artifactory/repo/javax/xml/stream/stax-api/1.0-2/stax-api-1.0-2.pom
[INFO] Downloaded: http://repository.mygrid.org.uk/artifactory/repo/javax/xml/stream/stax-api/1.0-2/stax-api-1.0-2.pom (167 B at 1.7 KB/sec)
[INFO] Downloading: http://repository.mygrid.org.uk/artifactory/repo/javax/activation/activation/1.1/activation-1.1.pom
[INFO] Downloaded: http://repository.mygrid.org.uk/artifactory/repo/javax/activation/activation/1.1/activation-1.1.pom (2 KB at 29.5 KB/sec)
[INFO] Downloading: http://repository.mygrid.org.uk/artifactory/repo/com/sun/xml/bind/jaxb-impl/2.1.12/jaxb-impl-2.1.12.pom
[INFO] Downloaded: http://repository.mygrid.org.uk/artifactory/repo/com/sun/xml/bind/jaxb-impl/2.1.12/jaxb-impl-2.1.12.pom (340 B at 2.9 KB/sec)
[INFO] Downloading: http://repository.mygrid.org.uk/artifactory/repo/org/jvnet/jaxb2_commons/runtime/0.4.1.5/runtime-0.4.1.5.pom
[INFO] Downloaded: http://repository.mygrid.org.uk/artifactory/repo/org/jvnet/jaxb2_commons/runtime/0.4.1.5/runtime-0.4.1.5.pom (2 KB at 15.1 KB/sec)
[INFO] Downloading: http://repository.mygrid.org.uk/artifactory/repo/org/jvnet/jaxb2_commons/project/0.4.1.5/project-0.4.1.5.pom
[INFO] Downloaded: http://repository.mygrid.org.uk/artifactory/repo/org/jvnet/jaxb2_commons/project/0.4.1.5/project-0.4.1.5.pom (9 KB at 114.4 KB/sec)
[INFO] Downloading: http://repository.mygrid.org.uk/artifactory/repo/com/sun/xml/bind/jaxb-impl/2.1.10/jaxb-impl-2.1.10.pom
[INFO] Downloaded: http://repository.mygrid.org.uk/artifactory/repo/com/sun/xml/bind/jaxb-impl/2.1.10/jaxb-impl-2.1.10.pom (340 B at 3.1 KB/sec)
[INFO] Downloading: http://repository.mygrid.org.uk/artifactory/repo/commons-jxpath/commons-jxpath/1.2/commons-jxpath-1.2.pom
[INFO] Downloaded: http://repository.mygrid.org.uk/artifactory/repo/commons-jxpath/commons-jxpath/1.2/commons-jxpath-1.2.pom (5 KB at 76.2 KB/sec)
[INFO] Downloading: http://repository.mygrid.org.uk/artifactory/repo/servletapi/servletapi/2.2/servletapi-2.2.pom
[INFO] Downloaded: http://repository.mygrid.org.uk/artifactory/repo/servletapi/servletapi/2.2/servletapi-2.2.pom (740 B at 13.9 KB/sec)
[INFO] Downloading: http://repository.mygrid.org.uk/artifactory/repo/javax/servlet/servlet-api/2.2/servlet-api-2.2.pom
[INFO] Downloaded: http://repository.mygrid.org.uk/artifactory/repo/javax/servlet/servlet-api/2.2/servlet-api-2.2.pom (156 B at 3.1 KB/sec)
[INFO] Downloading: http://repository.mygrid.org.uk/artifactory/repo/jdom/jdom/b9/jdom-b9.pom
[INFO] Downloaded: http://repository.mygrid.org.uk/artifactory/repo/jdom/jdom/b9/jdom-b9.pom (139 B at 2.6 KB/sec)
[INFO] Downloading: http://repository.mygrid.org.uk/artifactory/repo/commons-beanutils/commons-beanutils/1.4/commons-beanutils-1.4.pom
[INFO] Downloaded: http://repository.mygrid.org.uk/artifactory/repo/commons-beanutils/commons-beanutils/1.4/commons-beanutils-1.4.pom (2 KB at 17.0 KB/sec)
[INFO] Downloading: http://repository.mygrid.org.uk/artifactory/repo/net/sf/taverna/t2/provenance-client/1.6-SNAPSHOT/maven-metadata.xml
[INFO] Downloading: http://repository.mygrid.org.uk/artifactory/repo/net/sf/taverna/t2/provenance-client/1.6-SNAPSHOT/maven-metadata.xml
[INFO] Downloading: http://repository.mygrid.org.uk/artifactory/repo/net/sf/taverna/t2/provenance-client/1.6-SNAPSHOT/maven-metadata.xml
[INFO] Downloading: http://repository.mygrid.org.uk/artifactory/repo/net/sf/taverna/t2/provenance-client/1.6-SNAPSHOT/maven-metadata.xml
[INFO] Downloaded: http://repository.mygrid.org.uk/artifactory/repo/net/sf/taverna/t2/provenance-client/1.6-SNAPSHOT/maven-metadata.xml (2 KB at 2.5 KB/sec)
[INFO] Downloaded: http://repository.mygrid.org.uk/artifactory/repo/net/sf/taverna/t2/provenance-client/1.6-SNAPSHOT/maven-metadata.xml (2 KB at 2.6 KB/sec)
[INFO] Downloaded: http://repository.mygrid.org.uk/artifactory/repo/net/sf/taverna/t2/provenance-client/1.6-SNAPSHOT/maven-metadata.xml (2 KB at 2.6 KB/sec)
[INFO] Downloaded: http://repository.mygrid.org.uk/artifactory/repo/net/sf/taverna/t2/provenance-client/1.6-SNAPSHOT/maven-metadata.xml (2 KB at 2.5 KB/sec)
[INFO] Downloading: http://repository.mygrid.org.uk/artifactory/repo/net/sf/taverna/t2/provenance-client/1.6-SNAPSHOT/maven-metadata.xml
[INFO] Downloading: http://repository.mygrid.org.uk/artifactory/repo/net/sf/taverna/t2/provenance-client/1.6-SNAPSHOT/maven-metadata.xml
[INFO] Downloading: http://repository.mygrid.org.uk/artifactory/repo/net/sf/taverna/t2/provenance-client/1.6-SNAPSHOT/maven-metadata.xml
[INFO] Downloading: http://repository.mygrid.org.uk/artifactory/repo/net/sf/taverna/t2/provenance-client/1.6-SNAPSHOT/maven-metadata.xml
[INFO] Downloaded: http://repository.mygrid.org.uk/artifactory/repo/net/sf/taverna/t2/provenance-client/1.6-SNAPSHOT/maven-metadata.xml (2 KB at 30.7 KB/sec)
[INFO] Downloaded: http://repository.mygrid.org.uk/artifactory/repo/net/sf/taverna/t2/provenance-client/1.6-SNAPSHOT/maven-metadata.xml (2 KB at 26.5 KB/sec)
[INFO] Downloaded: http://repository.mygrid.org.uk/artifactory/repo/net/sf/taverna/t2/provenance-client/1.6-SNAPSHOT/maven-metadata.xml (2 KB at 24.8 KB/sec)
[INFO] Downloaded: http://repository.mygrid.org.uk/artifactory/repo/net/sf/taverna/t2/provenance-client/1.6-SNAPSHOT/maven-metadata.xml (2 KB at 22.8 KB/sec)
[INFO] Downloading: http://repository.mygrid.org.uk/artifactory/repo/net/sf/taverna/t2/provenance-client/1.6-SNAPSHOT/provenance-client-1.6-20140612.134020-14.pom
[INFO] Downloaded: http://repository.mygrid.org.uk/artifactory/repo/net/sf/taverna/t2/provenance-client/1.6-SNAPSHOT/provenance-client-1.6-20140612.134020-14.pom (3 KB at 19.5 KB/sec)
[INFO] Downloading: http://repository.mygrid.org.uk/artifactory/repo/net/sf/taverna/t2/core/provenance-mysql/1.6-SNAPSHOT/maven-metadata.xml
[INFO] Downloading: http://repository.mygrid.org.uk/artifactory/repo/net/sf/taverna/t2/core/provenance-mysql/1.6-SNAPSHOT/maven-metadata.xml
[INFO] Downloading: http://repository.mygrid.org.uk/artifactory/repo/net/sf/taverna/t2/core/provenance-mysql/1.6-SNAPSHOT/maven-metadata.xml
[INFO] Downloading: http://repository.mygrid.org.uk/artifactory/repo/net/sf/taverna/t2/core/provenance-mysql/1.6-SNAPSHOT/maven-metadata.xml
[INFO] Downloaded: http://repository.mygrid.org.uk/artifactory/repo/net/sf/taverna/t2/core/provenance-mysql/1.6-SNAPSHOT/maven-metadata.xml (2 KB at 2.4 KB/sec)
[INFO] Downloaded: http://repository.mygrid.org.uk/artifactory/repo/net/sf/taverna/t2/core/provenance-mysql/1.6-SNAPSHOT/maven-metadata.xml (2 KB at 2.4 KB/sec)
[INFO] Downloaded: http://repository.mygrid.org.uk/artifactory/repo/net/sf/taverna/t2/core/provenance-mysql/1.6-SNAPSHOT/maven-metadata.xml (2 KB at 2.4 KB/sec)
[INFO] Downloaded: http://repository.mygrid.org.uk/artifactory/repo/net/sf/taverna/t2/core/provenance-mysql/1.6-SNAPSHOT/maven-metadata.xml (2 KB at 2.3 KB/sec)
[INFO] Downloading: http://repository.mygrid.org.uk/artifactory/repo/net/sf/taverna/t2/core/provenance-mysql/1.6-SNAPSHOT/maven-metadata.xml
[INFO] Downloading: http://repository.mygrid.org.uk/artifactory/repo/net/sf/taverna/t2/core/provenance-mysql/1.6-SNAPSHOT/maven-metadata.xml
[INFO] Downloading: http://repository.mygrid.org.uk/artifactory/repo/net/sf/taverna/t2/core/provenance-mysql/1.6-SNAPSHOT/maven-metadata.xml
[INFO] Downloading: http://repository.mygrid.org.uk/artifactory/repo/net/sf/taverna/t2/core/provenance-mysql/1.6-SNAPSHOT/maven-metadata.xml
[INFO] Downloaded: http://repository.mygrid.org.uk/artifactory/repo/net/sf/taverna/t2/core/provenance-mysql/1.6-SNAPSHOT/maven-metadata.xml (2 KB at 10.3 KB/sec)
[INFO] Downloaded: http://repository.mygrid.org.uk/artifactory/repo/net/sf/taverna/t2/core/provenance-mysql/1.6-SNAPSHOT/maven-metadata.xml (2 KB at 9.7 KB/sec)
[INFO] Downloaded: http://repository.mygrid.org.uk/artifactory/repo/net/sf/taverna/t2/core/provenance-mysql/1.6-SNAPSHOT/maven-metadata.xml (2 KB at 10.1 KB/sec)
[INFO] Downloaded: http://repository.mygrid.org.uk/artifactory/repo/net/sf/taverna/t2/core/provenance-mysql/1.6-SNAPSHOT/maven-metadata.xml (2 KB at 10.0 KB/sec)
[INFO] Downloading: http://repository.mygrid.org.uk/artifactory/repo/net/sf/taverna/t2/core/provenance-mysql/1.6-SNAPSHOT/provenance-mysql-1.6-20140612.105426-10.pom
[INFO] Downloaded: http://repository.mygrid.org.uk/artifactory/repo/net/sf/taverna/t2/core/provenance-mysql/1.6-SNAPSHOT/provenance-mysql-1.6-20140612.105426-10.pom (3 KB at 17.0 KB/sec)
[INFO] Downloading: http://repository.mygrid.org.uk/artifactory/repo/net/sf/taverna/t2/core/provenance-derby/1.6-SNAPSHOT/maven-metadata.xml
[INFO] Downloading: http://repository.mygrid.org.uk/artifactory/repo/net/sf/taverna/t2/core/provenance-derby/1.6-SNAPSHOT/maven-metadata.xml
[INFO] Downloading: http://repository.mygrid.org.uk/artifactory/repo/net/sf/taverna/t2/core/provenance-derby/1.6-SNAPSHOT/maven-metadata.xml
[INFO] Downloading: http://repository.mygrid.org.uk/artifactory/repo/net/sf/taverna/t2/core/provenance-derby/1.6-SNAPSHOT/maven-metadata.xml
[INFO] Downloaded: http://repository.mygrid.org.uk/artifactory/repo/net/sf/taverna/t2/core/provenance-derby/1.6-SNAPSHOT/maven-metadata.xml (2 KB at 2.6 KB/sec)
[INFO] Downloaded: http://repository.mygrid.org.uk/artifactory/repo/net/sf/taverna/t2/core/provenance-derby/1.6-SNAPSHOT/maven-metadata.xml (2 KB at 2.6 KB/sec)
[INFO] Downloaded: http://repository.mygrid.org.uk/artifactory/repo/net/sf/taverna/t2/core/provenance-derby/1.6-SNAPSHOT/maven-metadata.xml (2 KB at 2.6 KB/sec)
[INFO] Downloaded: http://repository.mygrid.org.uk/artifactory/repo/net/sf/taverna/t2/core/provenance-derby/1.6-SNAPSHOT/maven-metadata.xml (2 KB at 2.6 KB/sec)
[INFO] Downloading: http://repository.mygrid.org.uk/artifactory/repo/net/sf/taverna/t2/core/provenance-derby/1.6-SNAPSHOT/maven-metadata.xml
[INFO] Downloading: http://repository.mygrid.org.uk/artifactory/repo/net/sf/taverna/t2/core/provenance-derby/1.6-SNAPSHOT/maven-metadata.xml
[INFO] Downloading: http://repository.mygrid.org.uk/artifactory/repo/net/sf/taverna/t2/core/provenance-derby/1.6-SNAPSHOT/maven-metadata.xml
[INFO] Downloading: http://repository.mygrid.org.uk/artifactory/repo/net/sf/taverna/t2/core/provenance-derby/1.6-SNAPSHOT/maven-metadata.xml
[INFO] Downloaded: http://repository.mygrid.org.uk/artifactory/repo/net/sf/taverna/t2/core/provenance-derby/1.6-SNAPSHOT/maven-metadata.xml (2 KB at 17.7 KB/sec)
[INFO] Downloaded: http://repository.mygrid.org.uk/artifactory/repo/net/sf/taverna/t2/core/provenance-derby/1.6-SNAPSHOT/maven-metadata.xml (2 KB at 15.7 KB/sec)
[INFO] Downloaded: http://repository.mygrid.org.uk/artifactory/repo/net/sf/taverna/t2/core/provenance-derby/1.6-SNAPSHOT/maven-metadata.xml (2 KB at 14.5 KB/sec)
[INFO] Downloaded: http://repository.mygrid.org.uk/artifactory/repo/net/sf/taverna/t2/core/provenance-derby/1.6-SNAPSHOT/maven-metadata.xml (2 KB at 16.1 KB/sec)
[INFO] Downloading: http://repository.mygrid.org.uk/artifactory/repo/net/sf/taverna/t2/core/provenance-derby/1.6-SNAPSHOT/provenance-derby-1.6-20140612.133827-13.pom
[INFO] Downloaded: http://repository.mygrid.org.uk/artifactory/repo/net/sf/taverna/t2/core/provenance-derby/1.6-SNAPSHOT/provenance-derby-1.6-20140612.133827-13.pom (3 KB at 11.8 KB/sec)
[INFO] Downloading: http://repository.mygrid.org.uk/artifactory/repo/com/hp/hpl/jena/arq/2.8.7/arq-2.8.7.pom
[INFO] Downloaded: http://repository.mygrid.org.uk/artifactory/repo/com/hp/hpl/jena/arq/2.8.7/arq-2.8.7.pom (14 KB at 127.4 KB/sec)
[INFO] Downloading: http://repository.mygrid.org.uk/artifactory/repo/com/hp/hpl/jena/jena/2.6.4/jena-2.6.4.pom
[INFO] Downloaded: http://repository.mygrid.org.uk/artifactory/repo/com/hp/hpl/jena/jena/2.6.4/jena-2.6.4.pom (15 KB at 301.2 KB/sec)
[INFO] Downloading: http://repository.mygrid.org.uk/artifactory/repo/com/hp/hpl/jena/jena/2.6.4/jena-2.6.4.pom
[INFO] Downloaded: http://repository.mygrid.org.uk/artifactory/repo/com/hp/hpl/jena/jena/2.6.4/jena-2.6.4.pom (15 KB at 556.1 KB/sec)
[INFO] Downloading: http://repository.mygrid.org.uk/artifactory/repo/com/hp/hpl/jena/jena/2.6.4/jena-2.6.4.pom
[INFO] Downloaded: http://repository.mygrid.org.uk/artifactory/repo/com/hp/hpl/jena/jena/2.6.4/jena-2.6.4.pom (15 KB at 425.3 KB/sec)
[INFO] Downloading: http://repository.mygrid.org.uk/artifactory/repo/com/hp/hpl/jena/iri/0.8/iri-0.8.pom
[INFO] Downloaded: http://repository.mygrid.org.uk/artifactory/repo/com/hp/hpl/jena/iri/0.8/iri-0.8.pom (6 KB at 65.6 KB/sec)
[INFO] Downloading: http://repository.mygrid.org.uk/artifactory/repo/com/ibm/icu/icu4j/3.4.4/icu4j-3.4.4.pom
[INFO] Downloaded: http://repository.mygrid.org.uk/artifactory/repo/com/ibm/icu/icu4j/3.4.4/icu4j-3.4.4.pom (1009 B at 17.0 KB/sec)
[INFO] Downloading: http://repository.mygrid.org.uk/artifactory/repo/xerces/xercesImpl/2.7.1/xercesImpl-2.7.1.pom
[INFO] Downloaded: http://repository.mygrid.org.uk/artifactory/repo/xerces/xercesImpl/2.7.1/xercesImpl-2.7.1.pom (150 B at 2.2 KB/sec)
[INFO] Downloading: http://repository.mygrid.org.uk/artifactory/repo/org/slf4j/slf4j-api/1.5.8/slf4j-api-1.5.8.pom
[INFO] Downloaded: http://repository.mygrid.org.uk/artifactory/repo/org/slf4j/slf4j-api/1.5.8/slf4j-api-1.5.8.pom (3 KB at 36.9 KB/sec)
[INFO] Downloading: http://repository.mygrid.org.uk/artifactory/repo/org/slf4j/slf4j-parent/1.5.8/slf4j-parent-1.5.8.pom
[INFO] Downloaded: http://repository.mygrid.org.uk/artifactory/repo/org/slf4j/slf4j-parent/1.5.8/slf4j-parent-1.5.8.pom (8 KB at 96.3 KB/sec)
[INFO] Downloading: http://repository.mygrid.org.uk/artifactory/repo/org/slf4j/slf4j-log4j12/1.5.8/slf4j-log4j12-1.5.8.pom
[INFO] Downloaded: http://repository.mygrid.org.uk/artifactory/repo/org/slf4j/slf4j-log4j12/1.5.8/slf4j-log4j12-1.5.8.pom (2 KB at 34.9 KB/sec)
[INFO] Downloading: http://repository.mygrid.org.uk/artifactory/repo/org/codehaus/woodstox/wstx-asl/3.2.9/wstx-asl-3.2.9.pom
[INFO] Downloaded: http://repository.mygrid.org.uk/artifactory/repo/org/codehaus/woodstox/wstx-asl/3.2.9/wstx-asl-3.2.9.pom (2 KB at 14.6 KB/sec)
[INFO] Downloading: http://repository.mygrid.org.uk/artifactory/repo/org/apache/lucene/lucene-core/2.3.1/lucene-core-2.3.1.pom
[INFO] Downloaded: http://repository.mygrid.org.uk/artifactory/repo/org/apache/lucene/lucene-core/2.3.1/lucene-core-2.3.1.pom (2 KB at 18.0 KB/sec)
[INFO] Downloading: http://repository.mygrid.org.uk/artifactory/repo/org/apache/lucene/lucene-parent/2.3.1/lucene-parent-2.3.1.pom
[INFO] Downloaded: http://repository.mygrid.org.uk/artifactory/repo/org/apache/lucene/lucene-parent/2.3.1/lucene-parent-2.3.1.pom (4 KB at 58.2 KB/sec)
[INFO] Downloading: http://repository.mygrid.org.uk/artifactory/repo/commons-net/commons-net/2.0/commons-net-2.0.pom
[INFO] Downloaded: http://repository.mygrid.org.uk/artifactory/repo/commons-net/commons-net/2.0/commons-net-2.0.pom (8 KB at 243.3 KB/sec)
[INFO] Downloading: http://repository.mygrid.org.uk/artifactory/repo/org/apache/poi/poi/3.6/poi-3.6.pom
[INFO] Downloaded: http://repository.mygrid.org.uk/artifactory/repo/org/apache/poi/poi/3.6/poi-3.6.pom (3 KB at 40.5 KB/sec)
[INFO] Downloading: http://repository.mygrid.org.uk/artifactory/repo/commons-logging/commons-logging/1.1/commons-logging-1.1.pom
[INFO] Downloaded: http://repository.mygrid.org.uk/artifactory/repo/commons-logging/commons-logging/1.1/commons-logging-1.1.pom (7 KB at 150.9 KB/sec)
[INFO] Downloading: http://repository.mygrid.org.uk/artifactory/repo/logkit/logkit/1.0.1/logkit-1.0.1.pom
[INFO] Downloaded: http://repository.mygrid.org.uk/artifactory/repo/logkit/logkit/1.0.1/logkit-1.0.1.pom (147 B at 3.5 KB/sec)
[INFO] Downloading: http://repository.mygrid.org.uk/artifactory/repo/avalon-framework/avalon-framework/4.1.3/avalon-framework-4.1.3.pom
[INFO] Downloaded: http://repository.mygrid.org.uk/artifactory/repo/avalon-framework/avalon-framework/4.1.3/avalon-framework-4.1.3.pom (167 B at 6.3 KB/sec)
[INFO] Downloading: http://repository.mygrid.org.uk/artifactory/repo/javax/servlet/servlet-api/2.3/servlet-api-2.3.pom
[INFO] Downloaded: http://repository.mygrid.org.uk/artifactory/repo/javax/servlet/servlet-api/2.3/servlet-api-2.3.pom (156 B at 4.1 KB/sec)
[INFO] Downloading: http://repository.mygrid.org.uk/artifactory/repo/uk/org/mygrid/taverna/baclava/baclava-core/1.7.2.2/baclava-core-1.7.2.2.jar
[INFO] Downloading: http://repository.mygrid.org.uk/artifactory/repo/uk/org/mygrid/taverna/taverna-bootstrap/1.7.2.2/taverna-bootstrap-1.7.2.2.jar
[INFO] Downloading: http://repository.mygrid.org.uk/artifactory/repo/uk/org/mygrid/taverna/raven/raven-log4j/1.9/raven-log4j-1.9.jar
[INFO] Downloading: http://repository.mygrid.org.uk/artifactory/repo/uk/org/mygrid/taverna/raven/raven/1.9/raven-1.9.jar
[INFO] Downloading: http://repository.mygrid.org.uk/artifactory/repo/uk/org/mygrid/taverna/taverna-core/1.7.2.2/taverna-core-1.7.2.2.jar
[INFO] Downloaded: http://repository.mygrid.org.uk/artifactory/repo/uk/org/mygrid/taverna/taverna-core/1.7.2.2/taverna-core-1.7.2.2.jar (125 KB at 972.4 KB/sec)
[INFO] Downloading: http://repository.mygrid.org.uk/artifactory/repo/jdom/jdom/1.0/jdom-1.0.jar
[INFO] Downloaded: http://repository.mygrid.org.uk/artifactory/repo/uk/org/mygrid/taverna/taverna-bootstrap/1.7.2.2/taverna-bootstrap-1.7.2.2.jar (190 KB at 998.0 KB/sec)
[INFO] Downloading: http://repository.mygrid.org.uk/artifactory/repo/net/sf/taverna/t2/results/results/1.6-SNAPSHOT/results-1.6-20140612.105426-11.jar
[INFO] Downloaded: http://repository.mygrid.org.uk/artifactory/repo/uk/org/mygrid/taverna/raven/raven-log4j/1.9/raven-log4j-1.9.jar (4 KB at 18.2 KB/sec)
[INFO] Downloading: http://repository.mygrid.org.uk/artifactory/repo/uk/org/mygrid/resources/mimeutil/mime-util/2.1.2-x-SNAPSHOT/mime-util-2.1.2-x-20140514.145941-2.jar
[INFO] Downloaded: http://repository.mygrid.org.uk/artifactory/repo/uk/org/mygrid/taverna/raven/raven/1.9/raven-1.9.jar (78 KB at 378.3 KB/sec)
[INFO] Downloading: http://repository.mygrid.org.uk/artifactory/repo/org/slf4j/slf4j-api/1.6.4/slf4j-api-1.6.4.jar
[INFO] Downloaded: http://repository.mygrid.org.uk/artifactory/repo/uk/org/mygrid/taverna/baclava/baclava-core/1.7.2.2/baclava-core-1.7.2.2.jar (49 KB at 198.6 KB/sec)
[INFO] Downloading: http://repository.mygrid.org.uk/artifactory/repo/org/slf4j/slf4j-log4j12/1.6.4/slf4j-log4j12-1.6.4.jar
[INFO] Downloaded: http://repository.mygrid.org.uk/artifactory/repo/jdom/jdom/1.0/jdom-1.0.jar (150 KB at 1626.8 KB/sec)
[INFO] Downloading: http://repository.mygrid.org.uk/artifactory/repo/uk/org/mygrid/resources/clapper/ocutil/2.5.1/ocutil-2.5.1.jar
[INFO] Downloaded: http://repository.mygrid.org.uk/artifactory/repo/org/slf4j/slf4j-log4j12/1.6.4/slf4j-log4j12-1.6.4.jar (10 KB at 82.8 KB/sec)
[INFO] Downloaded: http://repository.mygrid.org.uk/artifactory/repo/net/sf/taverna/t2/results/results/1.6-SNAPSHOT/results-1.6-20140612.105426-11.jar (11 KB at 68.2 KB/sec)
[INFO] Downloading: http://repository.mygrid.org.uk/artifactory/repo/net/sf/taverna/t2/ui-api/renderers-api/1.6-SNAPSHOT/renderers-api-1.6-20140612.105426-9.jar
[INFO] Downloading: http://repository.mygrid.org.uk/artifactory/repo/net/sf/taverna/t2/core/provenanceconnector/1.6-SNAPSHOT/provenanceconnector-1.6-20140612.105140-10.jar
[INFO] Downloaded: http://repository.mygrid.org.uk/artifactory/repo/org/slf4j/slf4j-api/1.6.4/slf4j-api-1.6.4.jar (26 KB at 105.2 KB/sec)
[INFO] Downloading: http://repository.mygrid.org.uk/artifactory/repo/org/tupeloproject/tupelo-cet/2.6/tupelo-cet-2.6.jar
[INFO] Downloaded: http://repository.mygrid.org.uk/artifactory/repo/uk/org/mygrid/resources/clapper/ocutil/2.5.1/ocutil-2.5.1.jar (334 KB at 1367.9 KB/sec)
[INFO] Downloading: http://repository.mygrid.org.uk/artifactory/repo/org/tupeloproject/tupelo-kernel/2.6/tupelo-kernel-2.6.jar
[INFO] Downloaded: http://repository.mygrid.org.uk/artifactory/repo/net/sf/taverna/t2/ui-api/renderers-api/1.6-SNAPSHOT/renderers-api-1.6-20140612.105426-9.jar (5 KB at 24.2 KB/sec)
[INFO] Downloading: http://repository.mygrid.org.uk/artifactory/repo/org/tupeloproject/tupelo-util/2.6/tupelo-util-2.6.jar
[INFO] Downloaded: http://repository.mygrid.org.uk/artifactory/repo/uk/org/mygrid/resources/mimeutil/mime-util/2.1.2-x-SNAPSHOT/mime-util-2.1.2-x-20140514.145941-2.jar (120 KB at 338.9 KB/sec)
[INFO] Downloading: http://repository.mygrid.org.uk/artifactory/repo/org/openprovenance/opm-core/1.1.8/opm-core-1.1.8.jar
[INFO] Downloaded: http://repository.mygrid.org.uk/artifactory/repo/net/sf/taverna/t2/core/provenanceconnector/1.6-SNAPSHOT/provenanceconnector-1.6-20140612.105140-10.jar (169 KB at 657.9 KB/sec)
[INFO] Downloading: http://repository.mygrid.org.uk/artifactory/repo/javax/xml/bind/jaxb-api/2.1/jaxb-api-2.1.jar
[INFO] Downloaded: http://repository.mygrid.org.uk/artifactory/repo/org/tupeloproject/tupelo-cet/2.6/tupelo-cet-2.6.jar (101 KB at 688.2 KB/sec)
[INFO] Downloading: http://repository.mygrid.org.uk/artifactory/repo/javax/xml/stream/stax-api/1.0-2/stax-api-1.0-2.jar
[INFO] Downloaded: http://repository.mygrid.org.uk/artifactory/repo/org/tupeloproject/tupelo-util/2.6/tupelo-util-2.6.jar (113 KB at 588.2 KB/sec)
[INFO] Downloading: http://repository.mygrid.org.uk/artifactory/repo/javax/activation/activation/1.1/activation-1.1.jar
[INFO] Downloaded: http://repository.mygrid.org.uk/artifactory/repo/javax/xml/stream/stax-api/1.0-2/stax-api-1.0-2.jar (23 KB at 174.0 KB/sec)
[INFO] Downloading: http://repository.mygrid.org.uk/artifactory/repo/com/sun/xml/bind/jaxb-impl/2.1.12/jaxb-impl-2.1.12.jar
[INFO] Downloaded: http://repository.mygrid.org.uk/artifactory/repo/org/tupeloproject/tupelo-kernel/2.6/tupelo-kernel-2.6.jar (472 KB at 1631.1 KB/sec)
[INFO] Downloading: http://repository.mygrid.org.uk/artifactory/repo/org/jvnet/jaxb2_commons/runtime/0.4.1.5/runtime-0.4.1.5.jar
[INFO] Downloaded: http://repository.mygrid.org.uk/artifactory/repo/javax/xml/bind/jaxb-api/2.1/jaxb-api-2.1.jar (78 KB at 441.4 KB/sec)
[INFO] Downloading: http://repository.mygrid.org.uk/artifactory/repo/commons-jxpath/commons-jxpath/1.2/commons-jxpath-1.2.jar
[INFO] Downloaded: http://repository.mygrid.org.uk/artifactory/repo/javax/activation/activation/1.1/activation-1.1.jar (62 KB at 549.2 KB/sec)
[INFO] Downloading: http://repository.mygrid.org.uk/artifactory/repo/net/sf/taverna/t2/provenance-client/1.6-SNAPSHOT/provenance-client-1.6-20140612.134020-14.jar
[INFO] Downloaded: http://repository.mygrid.org.uk/artifactory/repo/org/openprovenance/opm-core/1.1.8/opm-core-1.1.8.jar (180 KB at 598.3 KB/sec)
[INFO] Downloading: http://repository.mygrid.org.uk/artifactory/repo/net/sf/taverna/t2/core/provenance-mysql/1.6-SNAPSHOT/provenance-mysql-1.6-20140612.105426-10.jar
[INFO] Downloaded: http://repository.mygrid.org.uk/artifactory/repo/commons-jxpath/commons-jxpath/1.2/commons-jxpath-1.2.jar (279 KB at 2359.5 KB/sec)
[INFO] Downloading: http://repository.mygrid.org.uk/artifactory/repo/net/sf/taverna/t2/core/provenance-derby/1.6-SNAPSHOT/provenance-derby-1.6-20140612.133827-13.jar
[INFO] Downloaded: http://repository.mygrid.org.uk/artifactory/repo/org/jvnet/jaxb2_commons/runtime/0.4.1.5/runtime-0.4.1.5.jar (17 KB at 79.7 KB/sec)
[INFO] Downloading: http://repository.mygrid.org.uk/artifactory/repo/com/hp/hpl/jena/arq/2.8.7/arq-2.8.7.jar
[INFO] Downloaded: http://repository.mygrid.org.uk/artifactory/repo/com/sun/xml/bind/jaxb-impl/2.1.12/jaxb-impl-2.1.12.jar (848 KB at 3389.8 KB/sec)
[INFO] Downloading: http://repository.mygrid.org.uk/artifactory/repo/com/hp/hpl/jena/iri/0.8/iri-0.8.jar
[INFO] Downloaded: http://repository.mygrid.org.uk/artifactory/repo/net/sf/taverna/t2/core/provenance-mysql/1.6-SNAPSHOT/provenance-mysql-1.6-20140612.105426-10.jar (39 KB at 243.9 KB/sec)
[INFO] Downloading: http://repository.mygrid.org.uk/artifactory/repo/org/codehaus/woodstox/wstx-asl/3.2.9/wstx-asl-3.2.9.jar
[INFO] Downloaded: http://repository.mygrid.org.uk/artifactory/repo/net/sf/taverna/t2/provenance-client/1.6-SNAPSHOT/provenance-client-1.6-20140612.134020-14.jar (64 KB at 227.9 KB/sec)
[INFO] Downloaded: http://repository.mygrid.org.uk/artifactory/repo/com/hp/hpl/jena/iri/0.8/iri-0.8.jar (149 KB at 1165.6 KB/sec)
[INFO] Downloading: http://repository.mygrid.org.uk/artifactory/repo/org/apache/lucene/lucene-core/2.3.1/lucene-core-2.3.1.jar
[INFO] Downloading: http://repository.mygrid.org.uk/artifactory/repo/com/hp/hpl/jena/jena/2.6.4/jena-2.6.4.jar
[INFO] Downloaded: http://repository.mygrid.org.uk/artifactory/repo/net/sf/taverna/t2/core/provenance-derby/1.6-SNAPSHOT/provenance-derby-1.6-20140612.133827-13.jar (10 KB at 31.8 KB/sec)
[INFO] Downloading: http://repository.mygrid.org.uk/artifactory/repo/com/ibm/icu/icu4j/3.4.4/icu4j-3.4.4.jar
[INFO] Downloaded: http://repository.mygrid.org.uk/artifactory/repo/org/codehaus/woodstox/wstx-asl/3.2.9/wstx-asl-3.2.9.jar (512 KB at 1910.2 KB/sec)
[INFO] Downloading: http://repository.mygrid.org.uk/artifactory/repo/xerces/xercesImpl/2.7.1/xercesImpl-2.7.1.jar
[INFO] Downloaded: http://repository.mygrid.org.uk/artifactory/repo/com/hp/hpl/jena/arq/2.8.7/arq-2.8.7.jar (2166 KB at 5347.4 KB/sec)
[INFO] Downloading: http://repository.mygrid.org.uk/artifactory/repo/commons-net/commons-net/2.0/commons-net-2.0.jar
[INFO] Downloaded: http://repository.mygrid.org.uk/artifactory/repo/org/apache/lucene/lucene-core/2.3.1/lucene-core-2.3.1.jar (650 KB at 2488.4 KB/sec)
[INFO] Downloading: http://repository.mygrid.org.uk/artifactory/repo/org/apache/poi/poi/3.6/poi-3.6.jar
[INFO] Downloaded: http://repository.mygrid.org.uk/artifactory/repo/com/hp/hpl/jena/jena/2.6.4/jena-2.6.4.jar (1860 KB at 5452.0 KB/sec)
[INFO] Downloading: http://repository.mygrid.org.uk/artifactory/repo/commons-logging/commons-logging/1.1/commons-logging-1.1.jar
[INFO] Downloaded: http://repository.mygrid.org.uk/artifactory/repo/commons-logging/commons-logging/1.1/commons-logging-1.1.jar (52 KB at 516.7 KB/sec)
[INFO] Downloading: http://repository.mygrid.org.uk/artifactory/repo/logkit/logkit/1.0.1/logkit-1.0.1.jar
[INFO] Downloaded: http://repository.mygrid.org.uk/artifactory/repo/xerces/xercesImpl/2.7.1/xercesImpl-2.7.1.jar (1176 KB at 4125.1 KB/sec)
[INFO] Downloading: http://repository.mygrid.org.uk/artifactory/repo/avalon-framework/avalon-framework/4.1.3/avalon-framework-4.1.3.jar
[INFO] Downloaded: http://repository.mygrid.org.uk/artifactory/repo/com/ibm/icu/icu4j/3.4.4/icu4j-3.4.4.jar (3158 KB at 8375.7 KB/sec)
[INFO] Downloading: http://repository.mygrid.org.uk/artifactory/repo/javax/servlet/servlet-api/2.3/servlet-api-2.3.jar
[INFO] Downloaded: http://repository.mygrid.org.uk/artifactory/repo/commons-net/commons-net/2.0/commons-net-2.0.jar (193 KB at 776.0 KB/sec)
[INFO] Downloaded: http://repository.mygrid.org.uk/artifactory/repo/avalon-framework/avalon-framework/4.1.3/avalon-framework-4.1.3.jar (63 KB at 709.8 KB/sec)
[INFO] Downloaded: http://repository.mygrid.org.uk/artifactory/repo/org/apache/poi/poi/3.6/poi-3.6.jar (1504 KB at 5506.3 KB/sec)
[INFO] Downloaded: http://repository.mygrid.org.uk/artifactory/repo/logkit/logkit/1.0.1/logkit-1.0.1.jar (71 KB at 602.2 KB/sec)
[INFO] Downloaded: http://repository.mygrid.org.uk/artifactory/repo/javax/servlet/servlet-api/2.3/servlet-api-2.3.jar (77 KB at 668.0 KB/sec)
[INFO] Downloading: http://repository.mygrid.org.uk/artifactory/repo/org/tupeloproject/tupelo-util/2.6/tupelo-util-2.6.jar
[INFO] Downloaded: http://repository.mygrid.org.uk/artifactory/repo/org/tupeloproject/tupelo-util/2.6/tupelo-util-2.6.jar (113 KB at 1783.3 KB/sec)
[INFO] Downloading: http://repository.mygrid.org.uk/artifactory/repo/org/tupeloproject/tupelo-util/2.6/tupelo-util-2.6.jar
[INFO] Downloading: http://repository.mygrid.org.uk/artifactory/repo/com/ibm/icu/icu4j/3.4.4/icu4j-3.4.4.jar
[INFO] Downloading: http://repository.mygrid.org.uk/artifactory/repo/xerces/xercesImpl/2.7.1/xercesImpl-2.7.1.jar
[INFO] Downloaded: http://repository.mygrid.org.uk/artifactory/repo/org/tupeloproject/tupelo-util/2.6/tupelo-util-2.6.jar (113 KB at 1387.0 KB/sec)
[INFO] Downloaded: http://repository.mygrid.org.uk/artifactory/repo/xerces/xercesImpl/2.7.1/xercesImpl-2.7.1.jar (1176 KB at 2517.4 KB/sec)
[INFO] Downloaded: http://repository.mygrid.org.uk/artifactory/repo/com/ibm/icu/icu4j/3.4.4/icu4j-3.4.4.jar (3158 KB at 3473.8 KB/sec)
[INFO] Downloading: http://repository.mygrid.org.uk/artifactory/repo/com/ibm/icu/icu4j/3.4.4/icu4j-3.4.4.jar
[INFO] Downloading: http://repository.mygrid.org.uk/artifactory/repo/xerces/xercesImpl/2.7.1/xercesImpl-2.7.1.jar
[INFO] Downloaded: http://repository.mygrid.org.uk/artifactory/repo/xerces/xercesImpl/2.7.1/xercesImpl-2.7.1.jar (1176 KB at 5248.4 KB/sec)
[INFO] Downloaded: http://repository.mygrid.org.uk/artifactory/repo/com/ibm/icu/icu4j/3.4.4/icu4j-3.4.4.jar (3158 KB at 10596.2 KB/sec)
[INFO] 
[INFO] --- maven-clean-plugin:2.5:clean (default-clean) @ results-view ---
[INFO] Deleting /local/jenkins/jobs/taverna-ui-components-maintenance/workspace/results-view/target
[INFO] 
[INFO] --- maven-resources-plugin:2.6:resources (default-resources) @ results-view ---
[INFO] Using 'UTF-8' encoding to copy filtered resources.
[INFO] Copying 4 resources
[INFO] 
[INFO] --- maven-compiler-plugin:3.1:compile (default-compile) @ results-view ---
[INFO] Changes detected - recompiling the module!
[INFO] Compiling 33 source files to /local/jenkins/jobs/taverna-ui-components-maintenance/workspace/results-view/target/classes
[WARNING] /local/jenkins/jobs/taverna-ui-components-maintenance/workspace/results-view/src/main/java/net/sf/taverna/t2/workbench/views/results/saveactions/SaveAllResultsAsExcel.java: /local/jenkins/jobs/taverna-ui-components-maintenance/workspace/results-view/src/main/java/net/sf/taverna/t2/workbench/views/results/saveactions/SaveAllResultsAsExcel.java uses or overrides a deprecated API.
[WARNING] /local/jenkins/jobs/taverna-ui-components-maintenance/workspace/results-view/src/main/java/net/sf/taverna/t2/workbench/views/results/saveactions/SaveAllResultsAsExcel.java: Recompile with -Xlint:deprecation for details.
[WARNING] /local/jenkins/jobs/taverna-ui-components-maintenance/workspace/results-view/src/main/java/net/sf/taverna/t2/workbench/views/results/workflow/PortResultsViewTab.java: Some input files use unchecked or unsafe operations.
[WARNING] /local/jenkins/jobs/taverna-ui-components-maintenance/workspace/results-view/src/main/java/net/sf/taverna/t2/workbench/views/results/workflow/PortResultsViewTab.java: Recompile with -Xlint:unchecked for details.
[INFO] 
[INFO] --- maven-resources-plugin:2.6:testResources (default-testResources) @ results-view ---
[INFO] Using 'UTF-8' encoding to copy filtered resources.
[INFO] skip non existing resourceDirectory /local/jenkins/jobs/taverna-ui-components-maintenance/workspace/results-view/src/test/resources
[INFO] 
[INFO] --- maven-compiler-plugin:3.1:testCompile (default-testCompile) @ results-view ---
[INFO] No sources to compile
[INFO] 
[INFO] --- maven-surefire-plugin:2.17:test (default-test) @ results-view ---
[INFO] No tests to run.
[JENKINS] Recording test results
[INFO] 
[INFO] --- maven-jar-plugin:2.4:jar (default-jar) @ results-view ---
[INFO] Building jar: /local/jenkins/jobs/taverna-ui-components-maintenance/workspace/results-view/target/results-view-1.6-SNAPSHOT.jar
[INFO] 
[INFO] >>> maven-source-plugin:2.2.1:jar (default) @ results-view >>>
[WARNING] Failed to getClass for org.apache.maven.plugin.source.SourceJarMojo
[INFO] 
[INFO] <<< maven-source-plugin:2.2.1:jar (default) @ results-view <<<
[INFO] 
[INFO] --- maven-source-plugin:2.2.1:jar (default) @ results-view ---
[INFO] Building jar: /local/jenkins/jobs/taverna-ui-components-maintenance/workspace/results-view/target/results-view-1.6-SNAPSHOT-sources.jar
[INFO] 
[INFO] >>> maven-source-plugin:2.2.1:test-jar (default) @ results-view >>>
[WARNING] Failed to getClass for org.apache.maven.plugin.source.TestSourceJarMojo
[INFO] 
[INFO] <<< maven-source-plugin:2.2.1:test-jar (default) @ results-view <<<
[INFO] 
[INFO] --- maven-source-plugin:2.2.1:test-jar (default) @ results-view ---
[INFO] No sources in project. Archive not created.
[INFO] 
[INFO] --- maven-jar-plugin:2.4:test-jar (default) @ results-view ---
[WARNING] JAR will be empty - no content was marked for inclusion!
[INFO] Building jar: /local/jenkins/jobs/taverna-ui-components-maintenance/workspace/results-view/target/results-view-1.6-SNAPSHOT-tests.jar
[INFO] 
[INFO] --- maven-install-plugin:2.4:install (default-install) @ results-view ---
[INFO] Installing /local/jenkins/jobs/taverna-ui-components-maintenance/workspace/results-view/target/results-view-1.6-SNAPSHOT.jar to /local/jenkins/jobs/taverna-ui-components-maintenance/workspace/.repository/net/sf/taverna/t2/ui-components/results-view/1.6-SNAPSHOT/results-view-1.6-SNAPSHOT.jar
[INFO] Installing /local/jenkins/jobs/taverna-ui-components-maintenance/workspace/results-view/pom.xml to /local/jenkins/jobs/taverna-ui-components-maintenance/workspace/.repository/net/sf/taverna/t2/ui-components/results-view/1.6-SNAPSHOT/results-view-1.6-SNAPSHOT.pom
[INFO] Installing /local/jenkins/jobs/taverna-ui-components-maintenance/workspace/results-view/target/results-view-1.6-SNAPSHOT-sources.jar to /local/jenkins/jobs/taverna-ui-components-maintenance/workspace/.repository/net/sf/taverna/t2/ui-components/results-view/1.6-SNAPSHOT/results-view-1.6-SNAPSHOT-sources.jar
[INFO] Installing /local/jenkins/jobs/taverna-ui-components-maintenance/workspace/results-view/target/results-view-1.6-SNAPSHOT-tests.jar to /local/jenkins/jobs/taverna-ui-components-maintenance/workspace/.repository/net/sf/taverna/t2/ui-components/results-view/1.6-SNAPSHOT/results-view-1.6-SNAPSHOT-tests.jar
[INFO]                                                                         
[INFO] ------------------------------------------------------------------------
[INFO] Building Monitor View 1.6-SNAPSHOT
[INFO] ------------------------------------------------------------------------
[INFO] Downloading: http://repository.mygrid.org.uk/artifactory/repo/net/sf/taverna/t2/core/workflowmodel-api/1.6-SNAPSHOT/maven-metadata.xml
[INFO] Downloaded: http://repository.mygrid.org.uk/artifactory/repo/net/sf/taverna/t2/core/workflowmodel-api/1.6-SNAPSHOT/maven-metadata.xml (2 KB at 38.4 KB/sec)
[INFO] ------------------------------------------------------------------------
[INFO] Reactor Summary:
[INFO] 
[INFO] Taverna 2 UI components ........................... SUCCESS [  4.246 s]
[INFO] Design UI ......................................... SUCCESS [ 23.570 s]
[INFO] Workflow View ..................................... SUCCESS [  4.666 s]
[INFO] Activity Palette UI Component ..................... SUCCESS [ 28.111 s]
[INFO] Menu generation API ............................... SUCCESS [  4.664 s]
[INFO] Contextual views .................................. SUCCESS [  2.001 s]
[INFO] Credential Manager UI ............................. SUCCESS [  7.432 s]
[INFO] Data management configuration UI components ....... SUCCESS [01:00 min]
[INFO] Graph Model ....................................... SUCCESS [01:26 min]
[INFO] Results Perspective ............................... SUCCESS [  1.309 s]
[INFO] Graph View ........................................ SUCCESS [  3.452 s]
[INFO] Results and outputs from a workflow run ........... SUCCESS [ 18.414 s]
[INFO] Monitor View ...................................... FAILURE [  0.358 s]
[INFO] Design perspective ................................ SKIPPED
[INFO] Reporting view .................................... SKIPPED
[INFO] T2 reference manager user interface ............... SKIPPED
[INFO] Run UI ............................................ SKIPPED
[INFO] Workflow Explorer ................................. SKIPPED
[INFO] ------------------------------------------------------------------------
[INFO] BUILD FAILURE
[INFO] ------------------------------------------------------------------------
[INFO] Total time: 04:21 min
[INFO] Finished at: 2014-06-16T13:56:44+00:00
[INFO] Final Memory: 45M/113M
[INFO] ------------------------------------------------------------------------
Waiting for Jenkins to finish collecting data
[ERROR] Failed to execute goal on project monitor-view: Could not resolve dependencies for project net.sf.taverna.t2.ui-components:monitor-view:jar:1.6-SNAPSHOT: The following artifacts could not be resolved: net.sf.taverna.t2.results:results:jar:1.6-SNAPSHOT, uk.org.mygrid.resources.mimeutil:mime-util:jar:2.1.2-x-SNAPSHOT, net.sf.taverna.t2.ui-api:renderers-api:jar:1.6-SNAPSHOT, net.sf.taverna.t2:provenance-client:jar:1.6-SNAPSHOT, net.sf.taverna.t2.core:provenance-mysql:jar:1.6-SNAPSHOT, net.sf.taverna.t2.core:provenance-derby:jar:1.6-SNAPSHOT, net.sf.taverna.t2.core:provenanceconnector:jar:1.6-SNAPSHOT, net.sf.taverna.t2.core:reference-impl:jar:1.6-SNAPSHOT, net.sf.taverna.t2.ui-impl:data-management-config:jar:1.6-SNAPSHOT, net.sf.taverna.t2.core:reference-core-extensions:jar:1.6-SNAPSHOT: Could not find artifact net.sf.taverna.t2.results:results:jar:1.6-SNAPSHOT -> [Help 1]
[ERROR] 
[ERROR] To see the full stack trace of the errors, re-run Maven with the -e switch.
[ERROR] Re-run Maven using the -X switch to enable full debug logging.
[ERROR] 
[ERROR] For more information about the errors and possible solutions, please read the following articles:
[ERROR] [Help 1] http://cwiki.apache.org/confluence/display/MAVEN/DependencyResolutionException
[ERROR] 
[ERROR] After correcting the problems, you can resume the build with the command
[ERROR]   mvn <goals> -rf :monitor-view
[JENKINS] Archiving /local/jenkins/jobs/taverna-ui-components-maintenance/workspace/run-ui/pom.xml to net.sf.taverna.t2.ui-components/run-ui/1.6-SNAPSHOT/run-ui-1.6-SNAPSHOT.pom
[JENKINS] Archiving /local/jenkins/jobs/taverna-ui-components-maintenance/workspace/results-view/pom.xml to net.sf.taverna.t2.ui-components/results-view/1.6-SNAPSHOT/results-view-1.6-SNAPSHOT.pom
[JENKINS] Archiving /local/jenkins/jobs/taverna-ui-components-maintenance/workspace/results-view/target/results-view-1.6-SNAPSHOT.jar to net.sf.taverna.t2.ui-components/results-view/1.6-SNAPSHOT/results-view-1.6-SNAPSHOT.jar
[JENKINS] Archiving /local/jenkins/jobs/taverna-ui-components-maintenance/workspace/results-view/target/results-view-1.6-SNAPSHOT-sources.jar to net.sf.taverna.t2.ui-components/results-view/1.6-SNAPSHOT/results-view-1.6-SNAPSHOT-sources.jar
[JENKINS] Archiving /local/jenkins/jobs/taverna-ui-components-maintenance/workspace/results-view/target/results-view-1.6-SNAPSHOT-tests.jar to net.sf.taverna.t2.ui-components/results-view/1.6-SNAPSHOT/results-view-1.6-SNAPSHOT-tests.jar
[JENKINS] Archiving /local/jenkins/jobs/taverna-ui-components-maintenance/workspace/monitor-view/pom.xml to net.sf.taverna.t2.ui-components/monitor-view/1.6-SNAPSHOT/monitor-view-1.6-SNAPSHOT.pom
[JENKINS] Archiving /local/jenkins/jobs/taverna-ui-components-maintenance/workspace/contextual-views/pom.xml to net.sf.taverna.t2.ui-components/contextual-views/1.6-SNAPSHOT/contextual-views-1.6-SNAPSHOT.pom
[JENKINS] Archiving /local/jenkins/jobs/taverna-ui-components-maintenance/workspace/contextual-views/target/contextual-views-1.6-SNAPSHOT.jar to net.sf.taverna.t2.ui-components/contextual-views/1.6-SNAPSHOT/contextual-views-1.6-SNAPSHOT.jar
[JENKINS] Archiving /local/jenkins/jobs/taverna-ui-components-maintenance/workspace/contextual-views/target/contextual-views-1.6-SNAPSHOT-sources.jar to net.sf.taverna.t2.ui-components/contextual-views/1.6-SNAPSHOT/contextual-views-1.6-SNAPSHOT-sources.jar
[JENKINS] Archiving /local/jenkins/jobs/taverna-ui-components-maintenance/workspace/contextual-views/target/contextual-views-1.6-SNAPSHOT-tests.jar to net.sf.taverna.t2.ui-components/contextual-views/1.6-SNAPSHOT/contextual-views-1.6-SNAPSHOT-tests.jar
[JENKINS] Archiving /local/jenkins/jobs/taverna-ui-components-maintenance/workspace/perspective-design/pom.xml to net.sf.taverna.t2.ui-components/perspective-design/1.6-SNAPSHOT/perspective-design-1.6-SNAPSHOT.pom
[JENKINS] Archiving /local/jenkins/jobs/taverna-ui-components-maintenance/workspace/graph-view/pom.xml to net.sf.taverna.t2.ui-components/graph-view/1.6-SNAPSHOT/graph-view-1.6-SNAPSHOT.pom
[JENKINS] Archiving /local/jenkins/jobs/taverna-ui-components-maintenance/workspace/graph-view/target/graph-view-1.6-SNAPSHOT.jar to net.sf.taverna.t2.ui-components/graph-view/1.6-SNAPSHOT/graph-view-1.6-SNAPSHOT.jar
[JENKINS] Archiving /local/jenkins/jobs/taverna-ui-components-maintenance/workspace/graph-view/target/graph-view-1.6-SNAPSHOT-sources.jar to net.sf.taverna.t2.ui-components/graph-view/1.6-SNAPSHOT/graph-view-1.6-SNAPSHOT-sources.jar
[JENKINS] Archiving /local/jenkins/jobs/taverna-ui-components-maintenance/workspace/graph-view/target/graph-view-1.6-SNAPSHOT-test-sources.jar to net.sf.taverna.t2.ui-components/graph-view/1.6-SNAPSHOT/graph-view-1.6-SNAPSHOT-test-sources.jar
[JENKINS] Archiving /local/jenkins/jobs/taverna-ui-components-maintenance/workspace/graph-view/target/graph-view-1.6-SNAPSHOT-tests.jar to net.sf.taverna.t2.ui-components/graph-view/1.6-SNAPSHOT/graph-view-1.6-SNAPSHOT-tests.jar
[JENKINS] Archiving /local/jenkins/jobs/taverna-ui-components-maintenance/workspace/workflow-view/pom.xml to net.sf.taverna.t2.ui-components/workflow-view/1.6-SNAPSHOT/workflow-view-1.6-SNAPSHOT.pom
[JENKINS] Archiving /local/jenkins/jobs/taverna-ui-components-maintenance/workspace/workflow-view/target/workflow-view-1.6-SNAPSHOT.jar to net.sf.taverna.t2.ui-components/workflow-view/1.6-SNAPSHOT/workflow-view-1.6-SNAPSHOT.jar
[JENKINS] Archiving /local/jenkins/jobs/taverna-ui-components-maintenance/workspace/workflow-view/target/workflow-view-1.6-SNAPSHOT-sources.jar to net.sf.taverna.t2.ui-components/workflow-view/1.6-SNAPSHOT/workflow-view-1.6-SNAPSHOT-sources.jar
[JENKINS] Archiving /local/jenkins/jobs/taverna-ui-components-maintenance/workspace/workflow-view/target/workflow-view-1.6-SNAPSHOT-tests.jar to net.sf.taverna.t2.ui-components/workflow-view/1.6-SNAPSHOT/workflow-view-1.6-SNAPSHOT-tests.jar
[JENKINS] Archiving /local/jenkins/jobs/taverna-ui-components-maintenance/workspace/credential-manager-ui/pom.xml to net.sf.taverna.t2.ui-components/credential-manager-ui/1.6-SNAPSHOT/credential-manager-ui-1.6-SNAPSHOT.pom
[JENKINS] Archiving /local/jenkins/jobs/taverna-ui-components-maintenance/workspace/credential-manager-ui/target/credential-manager-ui-1.6-SNAPSHOT.jar to net.sf.taverna.t2.ui-components/credential-manager-ui/1.6-SNAPSHOT/credential-manager-ui-1.6-SNAPSHOT.jar
[JENKINS] Archiving /local/jenkins/jobs/taverna-ui-components-maintenance/workspace/credential-manager-ui/target/credential-manager-ui-1.6-SNAPSHOT-sources.jar to net.sf.taverna.t2.ui-components/credential-manager-ui/1.6-SNAPSHOT/credential-manager-ui-1.6-SNAPSHOT-sources.jar
[JENKINS] Archiving /local/jenkins/jobs/taverna-ui-components-maintenance/workspace/credential-manager-ui/target/credential-manager-ui-1.6-SNAPSHOT-tests.jar to net.sf.taverna.t2.ui-components/credential-manager-ui/1.6-SNAPSHOT/credential-manager-ui-1.6-SNAPSHOT-tests.jar
[JENKINS] Archiving /local/jenkins/jobs/taverna-ui-components-maintenance/workspace/activity-palette-ui/pom.xml to net.sf.taverna.t2.ui-components/activity-palette-ui/1.6-SNAPSHOT/activity-palette-ui-1.6-SNAPSHOT.pom
[JENKINS] Archiving /local/jenkins/jobs/taverna-ui-components-maintenance/workspace/activity-palette-ui/target/activity-palette-ui-1.6-SNAPSHOT.jar to net.sf.taverna.t2.ui-components/activity-palette-ui/1.6-SNAPSHOT/activity-palette-ui-1.6-SNAPSHOT.jar
[JENKINS] Archiving /local/jenkins/jobs/taverna-ui-components-maintenance/workspace/activity-palette-ui/target/activity-palette-ui-1.6-SNAPSHOT-sources.jar to net.sf.taverna.t2.ui-components/activity-palette-ui/1.6-SNAPSHOT/activity-palette-ui-1.6-SNAPSHOT-sources.jar
[JENKINS] Archiving /local/jenkins/jobs/taverna-ui-components-maintenance/workspace/activity-palette-ui/target/activity-palette-ui-1.6-SNAPSHOT-tests.jar to net.sf.taverna.t2.ui-components/activity-palette-ui/1.6-SNAPSHOT/activity-palette-ui-1.6-SNAPSHOT-tests.jar
[JENKINS] Archiving /local/jenkins/jobs/taverna-ui-components-maintenance/workspace/pom.xml to net.sf.taverna.t2/ui-components/1.6-SNAPSHOT/ui-components-1.6-SNAPSHOT.pom
[JENKINS] Archiving /local/jenkins/jobs/taverna-ui-components-maintenance/workspace/target/ui-components-1.6-SNAPSHOT-tests.jar to net.sf.taverna.t2/ui-components/1.6-SNAPSHOT/ui-components-1.6-SNAPSHOT-tests.jar
[JENKINS] Archiving /local/jenkins/jobs/taverna-ui-components-maintenance/workspace/workflow-explorer/pom.xml to net.sf.taverna.t2.ui-components/workflow-explorer/1.6-SNAPSHOT/workflow-explorer-1.6-SNAPSHOT.pom
[JENKINS] Archiving /local/jenkins/jobs/taverna-ui-components-maintenance/workspace/iteration-strategy-ui/pom.xml to net.sf.taverna.t2.ui-components/iteration-strategy-ui/1.6-SNAPSHOT/iteration-strategy-ui-1.6-SNAPSHOT.pom
[JENKINS] Archiving /local/jenkins/jobs/taverna-ui-components-maintenance/workspace/iteration-strategy-ui/target/iteration-strategy-ui-1.6-SNAPSHOT.jar to net.sf.taverna.t2.ui-components/iteration-strategy-ui/1.6-SNAPSHOT/iteration-strategy-ui-1.6-SNAPSHOT.jar
[JENKINS] Archiving /local/jenkins/jobs/taverna-ui-components-maintenance/workspace/iteration-strategy-ui/target/iteration-strategy-ui-1.6-SNAPSHOT-sources.jar to net.sf.taverna.t2.ui-components/iteration-strategy-ui/1.6-SNAPSHOT/iteration-strategy-ui-1.6-SNAPSHOT-sources.jar
[JENKINS] Archiving /local/jenkins/jobs/taverna-ui-components-maintenance/workspace/iteration-strategy-ui/target/iteration-strategy-ui-1.6-SNAPSHOT-test-sources.jar to net.sf.taverna.t2.ui-components/iteration-strategy-ui/1.6-SNAPSHOT/iteration-strategy-ui-1.6-SNAPSHOT-test-sources.jar
[JENKINS] Archiving /local/jenkins/jobs/taverna-ui-components-maintenance/workspace/iteration-strategy-ui/target/iteration-strategy-ui-1.6-SNAPSHOT-tests.jar to net.sf.taverna.t2.ui-components/iteration-strategy-ui/1.6-SNAPSHOT/iteration-strategy-ui-1.6-SNAPSHOT-tests.jar
[JENKINS] Archiving /local/jenkins/jobs/taverna-ui-components-maintenance/workspace/graph-model/pom.xml to net.sf.taverna.t2.ui-components/graph-model/1.6-SNAPSHOT/graph-model-1.6-SNAPSHOT.pom
[JENKINS] Archiving /local/jenkins/jobs/taverna-ui-components-maintenance/workspace/graph-model/target/graph-model-1.6-SNAPSHOT.jar to net.sf.taverna.t2.ui-components/graph-model/1.6-SNAPSHOT/graph-model-1.6-SNAPSHOT.jar
[JENKINS] Archiving /local/jenkins/jobs/taverna-ui-components-maintenance/workspace/graph-model/target/graph-model-1.6-SNAPSHOT-sources.jar to net.sf.taverna.t2.ui-components/graph-model/1.6-SNAPSHOT/graph-model-1.6-SNAPSHOT-sources.jar
[JENKINS] Archiving /local/jenkins/jobs/taverna-ui-components-maintenance/workspace/graph-model/target/graph-model-1.6-SNAPSHOT-test-sources.jar to net.sf.taverna.t2.ui-components/graph-model/1.6-SNAPSHOT/graph-model-1.6-SNAPSHOT-test-sources.jar
[JENKINS] Archiving /local/jenkins/jobs/taverna-ui-components-maintenance/workspace/graph-model/target/graph-model-1.6-SNAPSHOT-tests.jar to net.sf.taverna.t2.ui-components/graph-model/1.6-SNAPSHOT/graph-model-1.6-SNAPSHOT-tests.jar
[JENKINS] Archiving /local/jenkins/jobs/taverna-ui-components-maintenance/workspace/reference-ui/pom.xml to net.sf.taverna.t2.ui-components/reference-ui/1.6-SNAPSHOT/reference-ui-1.6-SNAPSHOT.pom
[JENKINS] Archiving /local/jenkins/jobs/taverna-ui-components-maintenance/workspace/data-management-config-ui/pom.xml to net.sf.taverna.t2.ui-components/data-management-config-ui/1.6-SNAPSHOT/data-management-config-ui-1.6-SNAPSHOT.pom
[JENKINS] Archiving /local/jenkins/jobs/taverna-ui-components-maintenance/workspace/data-management-config-ui/target/data-management-config-ui-1.6-SNAPSHOT.jar to net.sf.taverna.t2.ui-components/data-management-config-ui/1.6-SNAPSHOT/data-management-config-ui-1.6-SNAPSHOT.jar
[JENKINS] Archiving /local/jenkins/jobs/taverna-ui-components-maintenance/workspace/data-management-config-ui/target/data-management-config-ui-1.6-SNAPSHOT-sources.jar to net.sf.taverna.t2.ui-components/data-management-config-ui/1.6-SNAPSHOT/data-management-config-ui-1.6-SNAPSHOT-sources.jar
[JENKINS] Archiving /local/jenkins/jobs/taverna-ui-components-maintenance/workspace/data-management-config-ui/target/data-management-config-ui-1.6-SNAPSHOT-tests.jar to net.sf.taverna.t2.ui-components/data-management-config-ui/1.6-SNAPSHOT/data-management-config-ui-1.6-SNAPSHOT-tests.jar
[JENKINS] Archiving /local/jenkins/jobs/taverna-ui-components-maintenance/workspace/report-view/pom.xml to net.sf.taverna.t2.ui-components/report-view/1.6-SNAPSHOT/report-view-1.6-SNAPSHOT.pom
[JENKINS] Archiving /local/jenkins/jobs/taverna-ui-components-maintenance/workspace/design-ui/pom.xml to net.sf.taverna.t2.ui-components/design-ui/1.6-SNAPSHOT/design-ui-1.6-SNAPSHOT.pom
[JENKINS] Archiving /local/jenkins/jobs/taverna-ui-components-maintenance/workspace/design-ui/target/design-ui-1.6-SNAPSHOT.jar to net.sf.taverna.t2.ui-components/design-ui/1.6-SNAPSHOT/design-ui-1.6-SNAPSHOT.jar
[JENKINS] Archiving /local/jenkins/jobs/taverna-ui-components-maintenance/workspace/design-ui/target/design-ui-1.6-SNAPSHOT-sources.jar to net.sf.taverna.t2.ui-components/design-ui/1.6-SNAPSHOT/design-ui-1.6-SNAPSHOT-sources.jar
[JENKINS] Archiving /local/jenkins/jobs/taverna-ui-components-maintenance/workspace/design-ui/target/design-ui-1.6-SNAPSHOT-tests.jar to net.sf.taverna.t2.ui-components/design-ui/1.6-SNAPSHOT/design-ui-1.6-SNAPSHOT-tests.jar
[JENKINS] Archiving /local/jenkins/jobs/taverna-ui-components-maintenance/workspace/perspective-results/pom.xml to net.sf.taverna.t2.ui-components/perspective-results/1.6-SNAPSHOT/perspective-results-1.6-SNAPSHOT.pom
[JENKINS] Archiving /local/jenkins/jobs/taverna-ui-components-maintenance/workspace/perspective-results/target/perspective-results-1.6-SNAPSHOT.jar to net.sf.taverna.t2.ui-components/perspective-results/1.6-SNAPSHOT/perspective-results-1.6-SNAPSHOT.jar
[JENKINS] Archiving /local/jenkins/jobs/taverna-ui-components-maintenance/workspace/perspective-results/target/perspective-results-1.6-SNAPSHOT-sources.jar to net.sf.taverna.t2.ui-components/perspective-results/1.6-SNAPSHOT/perspective-results-1.6-SNAPSHOT-sources.jar
[JENKINS] Archiving /local/jenkins/jobs/taverna-ui-components-maintenance/workspace/perspective-results/target/perspective-results-1.6-SNAPSHOT-tests.jar to net.sf.taverna.t2.ui-components/perspective-results/1.6-SNAPSHOT/perspective-results-1.6-SNAPSHOT-tests.jar
channel stopped
Warning: you have no plugins providing access control for builds, so falling back to legacy behavior of permitting any downstream builds to be triggered
Finished: FAILURE