FailedConsole Output

Started by user Donal K Fellows (donal)
Building remotely on jenkins-slave in workspace /var/lib/jenkins/workspace/taverna-server-scape-auto
 > /usr/bin/git rev-parse --is-inside-work-tree # timeout=10
Fetching changes from the remote Git repository
 > /usr/bin/git config remote.origin.url git://github.com/myGrid/taverna-server.git # timeout=10
Fetching upstream changes from git://github.com/myGrid/taverna-server.git
 > /usr/bin/git --version # timeout=10
 > /usr/bin/git fetch --tags --progress git://github.com/myGrid/taverna-server.git +refs/heads/*:refs/remotes/origin/*
 > /usr/bin/git rev-parse origin/scape-execution-interface^{commit} # timeout=10
Checking out Revision 5bd63ee9ce15df3f10011e9b2f9c97cbd26b5459 (origin/scape-execution-interface)
 > /usr/bin/git config core.sparsecheckout # timeout=10
 > /usr/bin/git checkout -f 5bd63ee9ce15df3f10011e9b2f9c97cbd26b5459
 > /usr/bin/git rev-list 5bd63ee9ce15df3f10011e9b2f9c97cbd26b5459 # timeout=10
 > /usr/bin/git tag -a -f -m Jenkins Build #25 jenkins-taverna-server-scape-auto-25 # timeout=10
Parsing POMs
maven31-agent.jar already up to date
maven31-interceptor.jar already up to date
maven3-interceptor-commons.jar already up to date
[taverna-server-scape-auto] $ /var/lib/jenkins/tools/hudson.model.JDK/jdk7/bin/java -Xmx1024m -XX:MaxPermSize=1024m -Djava.awt.headless=true -cp /var/lib/jenkins/maven31-agent.jar:/var/lib/jenkins/tools/hudson.tasks.Maven_MavenInstallation/maven_3.2.1/boot/plexus-classworlds-2.5.1.jar:/var/lib/jenkins/tools/hudson.tasks.Maven_MavenInstallation/maven_3.2.1/conf/logging jenkins.maven3.agent.Maven31Main /var/lib/jenkins/tools/hudson.tasks.Maven_MavenInstallation/maven_3.2.1 /run/jenkins/slave.jar /var/lib/jenkins/maven31-interceptor.jar /var/lib/jenkins/maven3-interceptor-commons.jar 54010
<===[JENKINS REMOTING CAPACITY]===>channel started
Executing Maven:  -B -f /var/lib/jenkins/workspace/taverna-server-scape-auto/pom.xml -U clean install
[INFO] Scanning for projects...
[INFO] Downloading: http://repository.mygrid.org.uk/artifactory/repo/org/apache/felix/maven-bundle-plugin/maven-metadata.xml
[INFO] Downloaded: http://repository.mygrid.org.uk/artifactory/repo/org/apache/felix/maven-bundle-plugin/maven-metadata.xml (896 B at 0.0 KB/sec)
[WARNING] 
[WARNING] Some problems were encountered while building the effective model for uk.org.taverna.server:server-client:bundle:2.5.5_SCAPE-SNAPSHOT
[WARNING] 'build.plugins.plugin.version' for org.apache.felix:maven-bundle-plugin is missing. @ line 42, column 12
[WARNING] 
[WARNING] It is highly recommended to fix these problems because they threaten the stability of your build.
[WARNING] 
[WARNING] For this reason, future Maven versions might no longer support building such malformed projects.
[WARNING] 
[HUDSON] Collecting dependencies info[INFO] ------------------------------------------------------------------------
[INFO] Reactor Build Order:
[INFO] 
[INFO] Taverna Server
[INFO] Workflow Port Descriptor Types
[INFO] RMI Interface: Webapp <-> Worker
[INFO] Usage Record Support
[INFO] Workflow Executor/File System Access Process Implementation
[INFO] Impersonation Module (Unix)
[INFO] RMI registry daemon
[INFO] Operations for SCAPE Workflows
[INFO] Web Application Core
[INFO] server-client
[INFO] Distribution Packaging

[HUDSON] Collecting dependencies info
[HUDSON] Collecting dependencies info
[HUDSON] Collecting dependencies info
[HUDSON] Collecting dependencies info
[HUDSON] Collecting dependencies info
[HUDSON] Collecting dependencies info
[HUDSON] Collecting dependencies info
[HUDSON] Collecting dependencies info
[HUDSON] Collecting dependencies info
[HUDSON] Collecting dependencies info
[INFO] 
[INFO] Using the builder org.apache.maven.lifecycle.internal.builder.singlethreaded.SingleThreadedBuilder with a thread count of 1
[INFO]                                                                         
[INFO] ------------------------------------------------------------------------
[INFO] Building Taverna Server 2.5.5_SCAPE-SNAPSHOT
[INFO] ------------------------------------------------------------------------
[INFO] 
[INFO] --- maven-clean-plugin:2.5:clean (default-clean) @ server ---
[INFO] Deleting /var/lib/jenkins/workspace/taverna-server-scape-auto/target
[INFO] 
[INFO] >>> maven-source-plugin:2.2.1:jar (default) @ server >>>
[WARNING] Failed to getClass for org.apache.maven.plugin.source.SourceJarMojo
[INFO] 
[INFO] <<< maven-source-plugin:2.2.1:jar (default) @ server <<<
[INFO] 
[INFO] --- maven-source-plugin:2.2.1:jar (default) @ server ---
[INFO] 
[INFO] >>> maven-source-plugin:2.2.1:test-jar (default) @ server >>>
[WARNING] Failed to getClass for org.apache.maven.plugin.source.TestSourceJarMojo
[INFO] 
[INFO] <<< maven-source-plugin:2.2.1:test-jar (default) @ server <<<
[INFO] 
[INFO] --- maven-source-plugin:2.2.1:test-jar (default) @ server ---
[INFO] 
[INFO] --- maven-jar-plugin:2.4:test-jar (default) @ server ---
[WARNING] JAR will be empty - no content was marked for inclusion!
[INFO] Building jar: /var/lib/jenkins/workspace/taverna-server-scape-auto/target/server-2.5.5_SCAPE-SNAPSHOT-tests.jar
[INFO] 
[INFO] --- maven-install-plugin:2.4:install (default-install) @ server ---
[INFO] Installing /var/lib/jenkins/workspace/taverna-server-scape-auto/pom.xml to /home/jenkins/.m2/repository/uk/org/taverna/server/server/2.5.5_SCAPE-SNAPSHOT/server-2.5.5_SCAPE-SNAPSHOT.pom
[INFO] Installing /var/lib/jenkins/workspace/taverna-server-scape-auto/target/server-2.5.5_SCAPE-SNAPSHOT-tests.jar to /home/jenkins/.m2/repository/uk/org/taverna/server/server/2.5.5_SCAPE-SNAPSHOT/server-2.5.5_SCAPE-SNAPSHOT-tests.jar
[INFO]                                                                         
[INFO] ------------------------------------------------------------------------
[INFO] Building Workflow Port Descriptor Types 2.5.5_SCAPE-SNAPSHOT
[INFO] ------------------------------------------------------------------------
[INFO] 
[INFO] --- maven-clean-plugin:2.5:clean (default-clean) @ server-port-description ---
[INFO] Deleting /var/lib/jenkins/workspace/taverna-server-scape-auto/server-port-description/target
[INFO] 
[INFO] --- maven-resources-plugin:2.6:resources (default-resources) @ server-port-description ---
[INFO] Using 'US-ASCII' encoding to copy filtered resources.
[INFO] skip non existing resourceDirectory /var/lib/jenkins/workspace/taverna-server-scape-auto/server-port-description/src/main/resources
[INFO] 
[INFO] --- maven-compiler-plugin:3.1:compile (default-compile) @ server-port-description ---
[INFO] Changes detected - recompiling the module!
[INFO] Compiling 12 source files to /var/lib/jenkins/workspace/taverna-server-scape-auto/server-port-description/target/classes
[INFO] 
[INFO] --- maven-resources-plugin:2.6:testResources (default-testResources) @ server-port-description ---
[INFO] Using 'US-ASCII' encoding to copy filtered resources.
[INFO] skip non existing resourceDirectory /var/lib/jenkins/workspace/taverna-server-scape-auto/server-port-description/src/test/resources
[INFO] 
[INFO] --- maven-compiler-plugin:3.1:testCompile (default-testCompile) @ server-port-description ---
[INFO] Changes detected - recompiling the module!
[INFO] Compiling 1 source file to /var/lib/jenkins/workspace/taverna-server-scape-auto/server-port-description/target/test-classes
[INFO] 
[INFO] --- maven-surefire-plugin:2.17:test (default-test) @ server-port-description ---
[INFO] Surefire report directory: /var/lib/jenkins/workspace/taverna-server-scape-auto/server-port-description/target/surefire-reports

-------------------------------------------------------
 T E S T S
-------------------------------------------------------
Running org.taverna.server.port_description.JaxbSanityTest
Tests run: 9, Failures: 0, Errors: 0, Skipped: 0, Time elapsed: 0.793 sec - in org.taverna.server.port_description.JaxbSanityTest

Results :

Tests run: 9, Failures: 0, Errors: 0, Skipped: 0

[JENKINS] Recording test results
log4j:WARN No appenders could be found for logger (org.apache.commons.beanutils.converters.BooleanConverter).
log4j:WARN Please initialize the log4j system properly.
[INFO] 
[INFO] --- maven-jar-plugin:2.4:jar (default-jar) @ server-port-description ---
[INFO] Building jar: /var/lib/jenkins/workspace/taverna-server-scape-auto/server-port-description/target/server-port-description-2.5.5_SCAPE-SNAPSHOT.jar
[INFO] 
[INFO] >>> maven-source-plugin:2.2.1:jar (default) @ server-port-description >>>
[WARNING] Failed to getClass for org.apache.maven.plugin.source.SourceJarMojo
[INFO] 
[INFO] <<< maven-source-plugin:2.2.1:jar (default) @ server-port-description <<<
[INFO] 
[INFO] --- maven-source-plugin:2.2.1:jar (default) @ server-port-description ---
[INFO] Building jar: /var/lib/jenkins/workspace/taverna-server-scape-auto/server-port-description/target/server-port-description-2.5.5_SCAPE-SNAPSHOT-sources.jar
[INFO] 
[INFO] >>> maven-source-plugin:2.2.1:test-jar (default) @ server-port-description >>>
[WARNING] Failed to getClass for org.apache.maven.plugin.source.TestSourceJarMojo
[INFO] 
[INFO] <<< maven-source-plugin:2.2.1:test-jar (default) @ server-port-description <<<
[INFO] 
[INFO] --- maven-source-plugin:2.2.1:test-jar (default) @ server-port-description ---
[INFO] Building jar: /var/lib/jenkins/workspace/taverna-server-scape-auto/server-port-description/target/server-port-description-2.5.5_SCAPE-SNAPSHOT-test-sources.jar
[INFO] 
[INFO] --- maven-jar-plugin:2.4:test-jar (default) @ server-port-description ---
[INFO] Building jar: /var/lib/jenkins/workspace/taverna-server-scape-auto/server-port-description/target/server-port-description-2.5.5_SCAPE-SNAPSHOT-tests.jar
[INFO] 
[INFO] --- maven-install-plugin:2.4:install (default-install) @ server-port-description ---
[INFO] Installing /var/lib/jenkins/workspace/taverna-server-scape-auto/server-port-description/target/server-port-description-2.5.5_SCAPE-SNAPSHOT.jar to /home/jenkins/.m2/repository/uk/org/taverna/server/server-port-description/2.5.5_SCAPE-SNAPSHOT/server-port-description-2.5.5_SCAPE-SNAPSHOT.jar
[INFO] Installing /var/lib/jenkins/workspace/taverna-server-scape-auto/server-port-description/pom.xml to /home/jenkins/.m2/repository/uk/org/taverna/server/server-port-description/2.5.5_SCAPE-SNAPSHOT/server-port-description-2.5.5_SCAPE-SNAPSHOT.pom
[INFO] Installing /var/lib/jenkins/workspace/taverna-server-scape-auto/server-port-description/target/server-port-description-2.5.5_SCAPE-SNAPSHOT-sources.jar to /home/jenkins/.m2/repository/uk/org/taverna/server/server-port-description/2.5.5_SCAPE-SNAPSHOT/server-port-description-2.5.5_SCAPE-SNAPSHOT-sources.jar
[INFO] Installing /var/lib/jenkins/workspace/taverna-server-scape-auto/server-port-description/target/server-port-description-2.5.5_SCAPE-SNAPSHOT-test-sources.jar to /home/jenkins/.m2/repository/uk/org/taverna/server/server-port-description/2.5.5_SCAPE-SNAPSHOT/server-port-description-2.5.5_SCAPE-SNAPSHOT-test-sources.jar
[INFO] Installing /var/lib/jenkins/workspace/taverna-server-scape-auto/server-port-description/target/server-port-description-2.5.5_SCAPE-SNAPSHOT-tests.jar to /home/jenkins/.m2/repository/uk/org/taverna/server/server-port-description/2.5.5_SCAPE-SNAPSHOT/server-port-description-2.5.5_SCAPE-SNAPSHOT-tests.jar
[INFO]                                                                         
[INFO] ------------------------------------------------------------------------
[INFO] Building RMI Interface: Webapp <-> Worker 2.5.5_SCAPE-SNAPSHOT
[INFO] ------------------------------------------------------------------------
[INFO] 
[INFO] --- maven-clean-plugin:2.5:clean (default-clean) @ server-runinterface ---
[INFO] Deleting /var/lib/jenkins/workspace/taverna-server-scape-auto/server-runinterface/target
[INFO] 
[INFO] --- maven-resources-plugin:2.6:resources (default-resources) @ server-runinterface ---
[INFO] Using 'US-ASCII' encoding to copy filtered resources.
[INFO] skip non existing resourceDirectory /var/lib/jenkins/workspace/taverna-server-scape-auto/server-runinterface/src/main/resources
[INFO] 
[INFO] --- maven-compiler-plugin:3.1:compile (default-compile) @ server-runinterface ---
[INFO] Changes detected - recompiling the module!
[INFO] Compiling 15 source files to /var/lib/jenkins/workspace/taverna-server-scape-auto/server-runinterface/target/classes
[INFO] 
[INFO] --- maven-resources-plugin:2.6:testResources (default-testResources) @ server-runinterface ---
[INFO] Using 'US-ASCII' encoding to copy filtered resources.
[INFO] skip non existing resourceDirectory /var/lib/jenkins/workspace/taverna-server-scape-auto/server-runinterface/src/test/resources
[INFO] 
[INFO] --- maven-compiler-plugin:3.1:testCompile (default-testCompile) @ server-runinterface ---
[INFO] No sources to compile
[INFO] 
[INFO] --- maven-surefire-plugin:2.17:test (default-test) @ server-runinterface ---
[INFO] No tests to run.
[JENKINS] Recording test results
[INFO] 
[INFO] --- maven-jar-plugin:2.4:jar (default-jar) @ server-runinterface ---
[INFO] Building jar: /var/lib/jenkins/workspace/taverna-server-scape-auto/server-runinterface/target/server-runinterface-2.5.5_SCAPE-SNAPSHOT.jar
[INFO] 
[INFO] >>> maven-source-plugin:2.2.1:jar (default) @ server-runinterface >>>
[WARNING] Failed to getClass for org.apache.maven.plugin.source.SourceJarMojo
[INFO] 
[INFO] <<< maven-source-plugin:2.2.1:jar (default) @ server-runinterface <<<
[INFO] 
[INFO] --- maven-source-plugin:2.2.1:jar (default) @ server-runinterface ---
[INFO] Building jar: /var/lib/jenkins/workspace/taverna-server-scape-auto/server-runinterface/target/server-runinterface-2.5.5_SCAPE-SNAPSHOT-sources.jar
[INFO] 
[INFO] >>> maven-source-plugin:2.2.1:test-jar (default) @ server-runinterface >>>
[WARNING] Failed to getClass for org.apache.maven.plugin.source.TestSourceJarMojo
[INFO] 
[INFO] <<< maven-source-plugin:2.2.1:test-jar (default) @ server-runinterface <<<
[INFO] 
[INFO] --- maven-source-plugin:2.2.1:test-jar (default) @ server-runinterface ---
[INFO] No sources in project. Archive not created.
[INFO] 
[INFO] --- maven-jar-plugin:2.4:test-jar (default) @ server-runinterface ---
[WARNING] JAR will be empty - no content was marked for inclusion!
[INFO] Building jar: /var/lib/jenkins/workspace/taverna-server-scape-auto/server-runinterface/target/server-runinterface-2.5.5_SCAPE-SNAPSHOT-tests.jar
[INFO] 
[INFO] --- maven-install-plugin:2.4:install (default-install) @ server-runinterface ---
[INFO] Installing /var/lib/jenkins/workspace/taverna-server-scape-auto/server-runinterface/target/server-runinterface-2.5.5_SCAPE-SNAPSHOT.jar to /home/jenkins/.m2/repository/uk/org/taverna/server/server-runinterface/2.5.5_SCAPE-SNAPSHOT/server-runinterface-2.5.5_SCAPE-SNAPSHOT.jar
[INFO] Installing /var/lib/jenkins/workspace/taverna-server-scape-auto/server-runinterface/pom.xml to /home/jenkins/.m2/repository/uk/org/taverna/server/server-runinterface/2.5.5_SCAPE-SNAPSHOT/server-runinterface-2.5.5_SCAPE-SNAPSHOT.pom
[INFO] Installing /var/lib/jenkins/workspace/taverna-server-scape-auto/server-runinterface/target/server-runinterface-2.5.5_SCAPE-SNAPSHOT-sources.jar to /home/jenkins/.m2/repository/uk/org/taverna/server/server-runinterface/2.5.5_SCAPE-SNAPSHOT/server-runinterface-2.5.5_SCAPE-SNAPSHOT-sources.jar
[INFO] Installing /var/lib/jenkins/workspace/taverna-server-scape-auto/server-runinterface/target/server-runinterface-2.5.5_SCAPE-SNAPSHOT-tests.jar to /home/jenkins/.m2/repository/uk/org/taverna/server/server-runinterface/2.5.5_SCAPE-SNAPSHOT/server-runinterface-2.5.5_SCAPE-SNAPSHOT-tests.jar
[INFO]                                                                         
[INFO] ------------------------------------------------------------------------
[INFO] Building Usage Record Support 2.5.5_SCAPE-SNAPSHOT
[INFO] ------------------------------------------------------------------------
[INFO] 
[INFO] --- maven-clean-plugin:2.5:clean (default-clean) @ server-usagerecord ---
[INFO] Deleting /var/lib/jenkins/workspace/taverna-server-scape-auto/server-usagerecord/target
[INFO] 
[INFO] --- jaxb2-maven-plugin:1.3.1:xjc (xsd2java) @ server-usagerecord ---
[INFO] Generating source...
[INFO] parsing a schema...
[INFO] compiling a schema...
[INFO] org/w3/_2000/_09/xmldsig_/CanonicalizationMethodType.java
[INFO] org/w3/_2000/_09/xmldsig_/DSAKeyValueType.java
[INFO] org/w3/_2000/_09/xmldsig_/DigestMethodType.java
[INFO] org/w3/_2000/_09/xmldsig_/KeyInfoType.java
[INFO] org/w3/_2000/_09/xmldsig_/KeyValueType.java
[INFO] org/w3/_2000/_09/xmldsig_/ManifestType.java
[INFO] org/w3/_2000/_09/xmldsig_/ObjectFactory.java
[INFO] org/w3/_2000/_09/xmldsig_/ObjectType.java
[INFO] org/w3/_2000/_09/xmldsig_/PGPDataType.java
[INFO] org/w3/_2000/_09/xmldsig_/RSAKeyValueType.java
[INFO] org/w3/_2000/_09/xmldsig_/ReferenceType.java
[INFO] org/w3/_2000/_09/xmldsig_/RetrievalMethodType.java
[INFO] org/w3/_2000/_09/xmldsig_/SPKIDataType.java
[INFO] org/w3/_2000/_09/xmldsig_/SignatureMethodType.java
[INFO] org/w3/_2000/_09/xmldsig_/SignaturePropertiesType.java
[INFO] org/w3/_2000/_09/xmldsig_/SignaturePropertyType.java
[INFO] org/w3/_2000/_09/xmldsig_/SignatureType.java
[INFO] org/w3/_2000/_09/xmldsig_/SignatureValueType.java
[INFO] org/w3/_2000/_09/xmldsig_/SignedInfoType.java
[INFO] org/w3/_2000/_09/xmldsig_/TransformType.java
[INFO] org/w3/_2000/_09/xmldsig_/TransformsType.java
[INFO] org/w3/_2000/_09/xmldsig_/X509DataType.java
[INFO] org/w3/_2000/_09/xmldsig_/X509IssuerSerialType.java
[INFO] org/w3/_2000/_09/xmldsig_/package-info.java
[INFO] org/ogf/usage/v1_0/Charge.java
[INFO] org/ogf/usage/v1_0/ConsumableResourceType.java
[INFO] org/ogf/usage/v1_0/CpuDuration.java
[INFO] org/ogf/usage/v1_0/Disk.java
[INFO] org/ogf/usage/v1_0/EndTime.java
[INFO] org/ogf/usage/v1_0/Host.java
[INFO] org/ogf/usage/v1_0/JobIdentity.java
[INFO] org/ogf/usage/v1_0/JobName.java
[INFO] org/ogf/usage/v1_0/JobUsageRecord.java
[INFO] org/ogf/usage/v1_0/MachineName.java
[INFO] org/ogf/usage/v1_0/Memory.java
[INFO] org/ogf/usage/v1_0/Network.java
[INFO] org/ogf/usage/v1_0/NodeCount.java
[INFO] org/ogf/usage/v1_0/ObjectFactory.java
[INFO] org/ogf/usage/v1_0/PhaseResource.java
[INFO] org/ogf/usage/v1_0/Processors.java
[INFO] org/ogf/usage/v1_0/ProjectName.java
[INFO] org/ogf/usage/v1_0/Queue.java
[INFO] org/ogf/usage/v1_0/RecordIdentity.java
[INFO] org/ogf/usage/v1_0/ResourceType.java
[INFO] org/ogf/usage/v1_0/ServiceLevel.java
[INFO] org/ogf/usage/v1_0/StartTime.java
[INFO] org/ogf/usage/v1_0/Status.java
[INFO] org/ogf/usage/v1_0/SubmitHost.java
[INFO] org/ogf/usage/v1_0/Swap.java
[INFO] org/ogf/usage/v1_0/TimeDuration.java
[INFO] org/ogf/usage/v1_0/TimeInstant.java
[INFO] org/ogf/usage/v1_0/UsageRecordType.java
[INFO] org/ogf/usage/v1_0/UsageRecords.java
[INFO] org/ogf/usage/v1_0/UserIdentity.java
[INFO] org/ogf/usage/v1_0/VolumeResource.java
[INFO] org/ogf/usage/v1_0/WallDuration.java
[INFO] org/ogf/usage/v1_0/package-info.java
[INFO] 
[INFO] --- maven-resources-plugin:2.6:resources (default-resources) @ server-usagerecord ---
[INFO] Using 'US-ASCII' encoding to copy filtered resources.
[INFO] skip non existing resourceDirectory /var/lib/jenkins/workspace/taverna-server-scape-auto/server-usagerecord/src/main/resources
[INFO] 
[INFO] --- maven-compiler-plugin:3.1:compile (default-compile) @ server-usagerecord ---
[INFO] Changes detected - recompiling the module!
[INFO] Compiling 58 source files to /var/lib/jenkins/workspace/taverna-server-scape-auto/server-usagerecord/target/classes
[INFO] 
[INFO] --- maven-resources-plugin:2.6:testResources (default-testResources) @ server-usagerecord ---
[INFO] Using 'US-ASCII' encoding to copy filtered resources.
[INFO] skip non existing resourceDirectory /var/lib/jenkins/workspace/taverna-server-scape-auto/server-usagerecord/src/test/resources
[INFO] 
[INFO] --- maven-compiler-plugin:3.1:testCompile (default-testCompile) @ server-usagerecord ---
[INFO] Changes detected - recompiling the module!
[INFO] Compiling 1 source file to /var/lib/jenkins/workspace/taverna-server-scape-auto/server-usagerecord/target/test-classes
[INFO] 
[INFO] --- maven-surefire-plugin:2.17:test (default-test) @ server-usagerecord ---
[INFO] Surefire report directory: /var/lib/jenkins/workspace/taverna-server-scape-auto/server-usagerecord/target/surefire-reports

-------------------------------------------------------
 T E S T S
-------------------------------------------------------
Running TestUR
Tests run: 3, Failures: 0, Errors: 0, Skipped: 0, Time elapsed: 1.565 sec - in TestUR

Results :

Tests run: 3, Failures: 0, Errors: 0, Skipped: 0

[JENKINS] Recording test results
[INFO] 
[INFO] --- maven-jar-plugin:2.4:jar (default-jar) @ server-usagerecord ---
[INFO] Building jar: /var/lib/jenkins/workspace/taverna-server-scape-auto/server-usagerecord/target/server-usagerecord-2.5.5_SCAPE-SNAPSHOT.jar
[INFO] 
[INFO] >>> maven-source-plugin:2.2.1:jar (default) @ server-usagerecord >>>
[INFO] 
[INFO] --- jaxb2-maven-plugin:1.3.1:xjc (xsd2java) @ server-usagerecord ---
[INFO] No changes detected in schema or binding files, skipping source generation.
[WARNING] Failed to getClass for org.apache.maven.plugin.source.SourceJarMojo
[INFO] 
[INFO] <<< maven-source-plugin:2.2.1:jar (default) @ server-usagerecord <<<
[INFO] 
[INFO] --- maven-source-plugin:2.2.1:jar (default) @ server-usagerecord ---
[INFO] Building jar: /var/lib/jenkins/workspace/taverna-server-scape-auto/server-usagerecord/target/server-usagerecord-2.5.5_SCAPE-SNAPSHOT-sources.jar
[INFO] 
[INFO] >>> maven-source-plugin:2.2.1:test-jar (default) @ server-usagerecord >>>
[INFO] 
[INFO] --- jaxb2-maven-plugin:1.3.1:xjc (xsd2java) @ server-usagerecord ---
[INFO] No changes detected in schema or binding files, skipping source generation.
[WARNING] Failed to getClass for org.apache.maven.plugin.source.TestSourceJarMojo
[INFO] 
[INFO] <<< maven-source-plugin:2.2.1:test-jar (default) @ server-usagerecord <<<
[INFO] 
[INFO] --- maven-source-plugin:2.2.1:test-jar (default) @ server-usagerecord ---
[INFO] Building jar: /var/lib/jenkins/workspace/taverna-server-scape-auto/server-usagerecord/target/server-usagerecord-2.5.5_SCAPE-SNAPSHOT-test-sources.jar
[INFO] 
[INFO] --- maven-jar-plugin:2.4:test-jar (default) @ server-usagerecord ---
[INFO] Building jar: /var/lib/jenkins/workspace/taverna-server-scape-auto/server-usagerecord/target/server-usagerecord-2.5.5_SCAPE-SNAPSHOT-tests.jar
[INFO] 
[INFO] --- maven-install-plugin:2.4:install (default-install) @ server-usagerecord ---
[INFO] Installing /var/lib/jenkins/workspace/taverna-server-scape-auto/server-usagerecord/target/server-usagerecord-2.5.5_SCAPE-SNAPSHOT.jar to /home/jenkins/.m2/repository/uk/org/taverna/server/server-usagerecord/2.5.5_SCAPE-SNAPSHOT/server-usagerecord-2.5.5_SCAPE-SNAPSHOT.jar
[INFO] Installing /var/lib/jenkins/workspace/taverna-server-scape-auto/server-usagerecord/pom.xml to /home/jenkins/.m2/repository/uk/org/taverna/server/server-usagerecord/2.5.5_SCAPE-SNAPSHOT/server-usagerecord-2.5.5_SCAPE-SNAPSHOT.pom
[INFO] Installing /var/lib/jenkins/workspace/taverna-server-scape-auto/server-usagerecord/target/server-usagerecord-2.5.5_SCAPE-SNAPSHOT-sources.jar to /home/jenkins/.m2/repository/uk/org/taverna/server/server-usagerecord/2.5.5_SCAPE-SNAPSHOT/server-usagerecord-2.5.5_SCAPE-SNAPSHOT-sources.jar
[INFO] Installing /var/lib/jenkins/workspace/taverna-server-scape-auto/server-usagerecord/target/server-usagerecord-2.5.5_SCAPE-SNAPSHOT-test-sources.jar to /home/jenkins/.m2/repository/uk/org/taverna/server/server-usagerecord/2.5.5_SCAPE-SNAPSHOT/server-usagerecord-2.5.5_SCAPE-SNAPSHOT-test-sources.jar
[INFO] Installing /var/lib/jenkins/workspace/taverna-server-scape-auto/server-usagerecord/target/server-usagerecord-2.5.5_SCAPE-SNAPSHOT-tests.jar to /home/jenkins/.m2/repository/uk/org/taverna/server/server-usagerecord/2.5.5_SCAPE-SNAPSHOT/server-usagerecord-2.5.5_SCAPE-SNAPSHOT-tests.jar
[INFO]                                                                         
[INFO] ------------------------------------------------------------------------
[INFO] Building Workflow Executor/File System Access Process Implementation 2.5.5_SCAPE-SNAPSHOT
[INFO] ------------------------------------------------------------------------
[INFO] 
[INFO] --- maven-clean-plugin:2.5:clean (default-clean) @ server-worker ---
[INFO] Deleting /var/lib/jenkins/workspace/taverna-server-scape-auto/server-worker/target
[INFO] 
[INFO] --- maven-resources-plugin:2.6:resources (default-resources) @ server-worker ---
[INFO] Using 'US-ASCII' encoding to copy filtered resources.
[INFO] Copying 1 resource
[INFO] 
[INFO] --- maven-compiler-plugin:3.1:compile (default-compile) @ server-worker ---
[INFO] Changes detected - recompiling the module!
[INFO] Compiling 11 source files to /var/lib/jenkins/workspace/taverna-server-scape-auto/server-worker/target/classes
[INFO] 
[INFO] --- maven-resources-plugin:2.6:testResources (default-testResources) @ server-worker ---
[INFO] Using 'US-ASCII' encoding to copy filtered resources.
[INFO] skip non existing resourceDirectory /var/lib/jenkins/workspace/taverna-server-scape-auto/server-worker/src/test/resources
[INFO] 
[INFO] --- maven-compiler-plugin:3.1:testCompile (default-testCompile) @ server-worker ---
[INFO] Changes detected - recompiling the module!
[INFO] Compiling 1 source file to /var/lib/jenkins/workspace/taverna-server-scape-auto/server-worker/target/test-classes
[INFO] 
[INFO] --- maven-surefire-plugin:2.17:test (default-test) @ server-worker ---
[INFO] Surefire report directory: /var/lib/jenkins/workspace/taverna-server-scape-auto/server-worker/target/surefire-reports

-------------------------------------------------------
 T E S T S
-------------------------------------------------------
Running org.taverna.server.localworker.impl.LocalWorkerTest
about to create /tmp/15228803-ce1d-4e18-a93b-d3dd002b7f60
about to create /tmp/9d348732-df76-427c-9d5d-36c86c685bea
about to create /tmp/62b4037d-b35f-484a-a4fd-4996335534cd
about to create /tmp/11f965c2-fb87-46b6-9c9c-73c0e77ebee8
about to create /tmp/5a9bd4c6-cd4e-4e33-bafb-174fea5b8fb5
about to create /tmp/e26e21cf-5f79-4616-b7d7-be7629517ce5
about to create /tmp/0597569d-3cda-409b-958b-08fbcfca6b2c
about to create /tmp/945ad816-0485-47db-b830-f6c1b0782dc4
about to create /tmp/0c2fe15f-2391-4e50-a41e-3781674d7589
about to create /tmp/448f29f1-72fe-4605-8387-065eb28893f6
about to create /tmp/3bff1ffd-72b8-4c87-999b-782436e918a5
about to create /tmp/b2ae4e21-ff99-4140-8630-f9024cb3aafc
about to create /tmp/cb76b617-593a-4d86-9a6c-96ae7c1ed3bf
about to create /tmp/76cf588e-7857-4311-b4fe-820f72aca021
about to create /tmp/5f1ed844-6a13-4251-b050-e151dab09e3d
about to create /tmp/216ba9f8-2ce5-4d8a-8d6e-d88a22d8fd0a
about to create /tmp/c2493e0e-9cce-4ef2-bc0d-e261c48c960f
about to create /tmp/71dbbe57-a466-4f42-a38d-25c5de7c65d7
about to create /tmp/8b1a8f6c-7cdc-45e9-a4b2-9dbebc4e2f7d
about to create /tmp/f8cc61f5-e490-4d1d-abe1-2bf43867ef2e
about to create /tmp/3363aebc-5df5-425a-9b46-1579edb4f15f
about to create /tmp/9abfcd7e-e28f-46df-947f-db56a0bb7ef3
about to create /tmp/f1906ec8-097c-46fc-85d1-a07c03483248
about to create /tmp/a99b11a2-d8f4-4357-8ae7-22dfab35f045
about to create /tmp/628848db-2b16-4be7-8995-6167cc5514ff
about to create /tmp/f3f45188-f1d0-477b-aba9-c8c1136f4364
about to create /tmp/5089ceaf-079b-4c44-87f6-2725c6d45d9b
about to create /tmp/73594088-1e01-4784-9d14-497bac770f0f
about to create /tmp/f9da0834-b9fa-4154-b30f-e879aa7a163b
about to create /tmp/b2556113-8e36-4474-99d6-b870d8beb5ac
about to create /tmp/5a46ae49-1517-4fd7-a34b-735690c00427
about to create /tmp/ef115988-f430-4559-bad4-75acee001ac9
about to create /tmp/2f930d7b-d748-41b7-925f-22666cb4fdf8
about to create /tmp/2b3357d0-c872-4205-a5da-6758fcdb3d9c
about to create /tmp/aa79f328-e8ef-4df6-b275-4e226b2e8d03
about to create /tmp/41ed9353-9952-46cb-ad73-d4d62e9a3a27
about to create /tmp/6a29b681-0f51-4029-bca9-ef075e9621ae
about to create /tmp/0594b06f-c780-42b4-8a56-59ab7063fce8
about to create /tmp/450dde62-2121-4b95-b7e3-c56c63a2332f
Tests run: 39, Failures: 0, Errors: 0, Skipped: 0, Time elapsed: 0.741 sec - in org.taverna.server.localworker.impl.LocalWorkerTest

Results :

Tests run: 39, Failures: 0, Errors: 0, Skipped: 0

[JENKINS] Recording test results
[INFO] 
[INFO] --- maven-jar-plugin:2.4:jar (default-jar) @ server-worker ---
[INFO] Building jar: /var/lib/jenkins/workspace/taverna-server-scape-auto/server-worker/target/server-worker-2.5.5_SCAPE-SNAPSHOT.jar
[INFO] 
[INFO] >>> maven-source-plugin:2.2.1:jar (default) @ server-worker >>>
[WARNING] Failed to getClass for org.apache.maven.plugin.source.SourceJarMojo
[INFO] 
[INFO] <<< maven-source-plugin:2.2.1:jar (default) @ server-worker <<<
[INFO] 
[INFO] --- maven-source-plugin:2.2.1:jar (default) @ server-worker ---
[INFO] Building jar: /var/lib/jenkins/workspace/taverna-server-scape-auto/server-worker/target/server-worker-2.5.5_SCAPE-SNAPSHOT-sources.jar
[INFO] 
[INFO] >>> maven-source-plugin:2.2.1:test-jar (default) @ server-worker >>>
[WARNING] Failed to getClass for org.apache.maven.plugin.source.TestSourceJarMojo
[INFO] 
[INFO] <<< maven-source-plugin:2.2.1:test-jar (default) @ server-worker <<<
[INFO] 
[INFO] --- maven-source-plugin:2.2.1:test-jar (default) @ server-worker ---
[INFO] Building jar: /var/lib/jenkins/workspace/taverna-server-scape-auto/server-worker/target/server-worker-2.5.5_SCAPE-SNAPSHOT-test-sources.jar
[INFO] 
[INFO] --- maven-jar-plugin:2.4:test-jar (default) @ server-worker ---
[INFO] Building jar: /var/lib/jenkins/workspace/taverna-server-scape-auto/server-worker/target/server-worker-2.5.5_SCAPE-SNAPSHOT-tests.jar
[INFO] 
[INFO] --- maven-assembly-plugin:2.4:single (make-assembly) @ server-worker ---
[INFO] Building jar: /var/lib/jenkins/workspace/taverna-server-scape-auto/server-worker/target/server-worker-2.5.5_SCAPE-SNAPSHOT-jar-with-dependencies.jar
[INFO] 
[INFO] --- maven-install-plugin:2.4:install (default-install) @ server-worker ---
[INFO] Installing /var/lib/jenkins/workspace/taverna-server-scape-auto/server-worker/target/server-worker-2.5.5_SCAPE-SNAPSHOT.jar to /home/jenkins/.m2/repository/uk/org/taverna/server/server-worker/2.5.5_SCAPE-SNAPSHOT/server-worker-2.5.5_SCAPE-SNAPSHOT.jar
[INFO] Installing /var/lib/jenkins/workspace/taverna-server-scape-auto/server-worker/pom.xml to /home/jenkins/.m2/repository/uk/org/taverna/server/server-worker/2.5.5_SCAPE-SNAPSHOT/server-worker-2.5.5_SCAPE-SNAPSHOT.pom
[INFO] Installing /var/lib/jenkins/workspace/taverna-server-scape-auto/server-worker/target/server-worker-2.5.5_SCAPE-SNAPSHOT-sources.jar to /home/jenkins/.m2/repository/uk/org/taverna/server/server-worker/2.5.5_SCAPE-SNAPSHOT/server-worker-2.5.5_SCAPE-SNAPSHOT-sources.jar
[INFO] Installing /var/lib/jenkins/workspace/taverna-server-scape-auto/server-worker/target/server-worker-2.5.5_SCAPE-SNAPSHOT-test-sources.jar to /home/jenkins/.m2/repository/uk/org/taverna/server/server-worker/2.5.5_SCAPE-SNAPSHOT/server-worker-2.5.5_SCAPE-SNAPSHOT-test-sources.jar
[INFO] Installing /var/lib/jenkins/workspace/taverna-server-scape-auto/server-worker/target/server-worker-2.5.5_SCAPE-SNAPSHOT-tests.jar to /home/jenkins/.m2/repository/uk/org/taverna/server/server-worker/2.5.5_SCAPE-SNAPSHOT/server-worker-2.5.5_SCAPE-SNAPSHOT-tests.jar
[INFO] Installing /var/lib/jenkins/workspace/taverna-server-scape-auto/server-worker/target/server-worker-2.5.5_SCAPE-SNAPSHOT-jar-with-dependencies.jar to /home/jenkins/.m2/repository/uk/org/taverna/server/server-worker/2.5.5_SCAPE-SNAPSHOT/server-worker-2.5.5_SCAPE-SNAPSHOT-jar-with-dependencies.jar
[INFO]                                                                         
[INFO] ------------------------------------------------------------------------
[INFO] Building Impersonation Module (Unix) 2.5.5_SCAPE-SNAPSHOT
[INFO] ------------------------------------------------------------------------
[INFO] 
[INFO] --- maven-clean-plugin:2.5:clean (default-clean) @ server-unix-forker ---
[INFO] Deleting /var/lib/jenkins/workspace/taverna-server-scape-auto/server-unix-forker/target
[INFO] 
[INFO] --- maven-resources-plugin:2.6:resources (default-resources) @ server-unix-forker ---
[INFO] Using 'US-ASCII' encoding to copy filtered resources.
[INFO] skip non existing resourceDirectory /var/lib/jenkins/workspace/taverna-server-scape-auto/server-unix-forker/src/main/resources
[INFO] 
[INFO] --- maven-compiler-plugin:3.1:compile (default-compile) @ server-unix-forker ---
[INFO] Changes detected - recompiling the module!
[INFO] Compiling 1 source file to /var/lib/jenkins/workspace/taverna-server-scape-auto/server-unix-forker/target/classes
[INFO] 
[INFO] --- maven-resources-plugin:2.6:testResources (default-testResources) @ server-unix-forker ---
[INFO] Using 'US-ASCII' encoding to copy filtered resources.
[INFO] skip non existing resourceDirectory /var/lib/jenkins/workspace/taverna-server-scape-auto/server-unix-forker/src/test/resources
[INFO] 
[INFO] --- maven-compiler-plugin:3.1:testCompile (default-testCompile) @ server-unix-forker ---
[INFO] No sources to compile
[INFO] 
[INFO] --- maven-surefire-plugin:2.17:test (default-test) @ server-unix-forker ---
[INFO] No tests to run.
[JENKINS] Recording test results
[INFO] 
[INFO] --- maven-jar-plugin:2.4:jar (default-jar) @ server-unix-forker ---
[INFO] Building jar: /var/lib/jenkins/workspace/taverna-server-scape-auto/server-unix-forker/target/server-unix-forker-2.5.5_SCAPE-SNAPSHOT.jar
[INFO] 
[INFO] >>> maven-source-plugin:2.2.1:jar (default) @ server-unix-forker >>>
[WARNING] Failed to getClass for org.apache.maven.plugin.source.SourceJarMojo
[INFO] 
[INFO] <<< maven-source-plugin:2.2.1:jar (default) @ server-unix-forker <<<
[INFO] 
[INFO] --- maven-source-plugin:2.2.1:jar (default) @ server-unix-forker ---
[INFO] Building jar: /var/lib/jenkins/workspace/taverna-server-scape-auto/server-unix-forker/target/server-unix-forker-2.5.5_SCAPE-SNAPSHOT-sources.jar
[INFO] 
[INFO] >>> maven-source-plugin:2.2.1:test-jar (default) @ server-unix-forker >>>
[WARNING] Failed to getClass for org.apache.maven.plugin.source.TestSourceJarMojo
[INFO] 
[INFO] <<< maven-source-plugin:2.2.1:test-jar (default) @ server-unix-forker <<<
[INFO] 
[INFO] --- maven-source-plugin:2.2.1:test-jar (default) @ server-unix-forker ---
[INFO] No sources in project. Archive not created.
[INFO] 
[INFO] --- maven-jar-plugin:2.4:test-jar (default) @ server-unix-forker ---
[WARNING] JAR will be empty - no content was marked for inclusion!
[INFO] Building jar: /var/lib/jenkins/workspace/taverna-server-scape-auto/server-unix-forker/target/server-unix-forker-2.5.5_SCAPE-SNAPSHOT-tests.jar
[INFO] 
[INFO] --- maven-assembly-plugin:2.4:single (make-assembly) @ server-unix-forker ---
[INFO] Building jar: /var/lib/jenkins/workspace/taverna-server-scape-auto/server-unix-forker/target/server-unix-forker-2.5.5_SCAPE-SNAPSHOT-jar-with-dependencies.jar
[INFO] 
[INFO] --- maven-install-plugin:2.4:install (default-install) @ server-unix-forker ---
[INFO] Installing /var/lib/jenkins/workspace/taverna-server-scape-auto/server-unix-forker/target/server-unix-forker-2.5.5_SCAPE-SNAPSHOT.jar to /home/jenkins/.m2/repository/uk/org/taverna/server/server-unix-forker/2.5.5_SCAPE-SNAPSHOT/server-unix-forker-2.5.5_SCAPE-SNAPSHOT.jar
[INFO] Installing /var/lib/jenkins/workspace/taverna-server-scape-auto/server-unix-forker/pom.xml to /home/jenkins/.m2/repository/uk/org/taverna/server/server-unix-forker/2.5.5_SCAPE-SNAPSHOT/server-unix-forker-2.5.5_SCAPE-SNAPSHOT.pom
[INFO] Installing /var/lib/jenkins/workspace/taverna-server-scape-auto/server-unix-forker/target/server-unix-forker-2.5.5_SCAPE-SNAPSHOT-sources.jar to /home/jenkins/.m2/repository/uk/org/taverna/server/server-unix-forker/2.5.5_SCAPE-SNAPSHOT/server-unix-forker-2.5.5_SCAPE-SNAPSHOT-sources.jar
[INFO] Installing /var/lib/jenkins/workspace/taverna-server-scape-auto/server-unix-forker/target/server-unix-forker-2.5.5_SCAPE-SNAPSHOT-tests.jar to /home/jenkins/.m2/repository/uk/org/taverna/server/server-unix-forker/2.5.5_SCAPE-SNAPSHOT/server-unix-forker-2.5.5_SCAPE-SNAPSHOT-tests.jar
[INFO] Installing /var/lib/jenkins/workspace/taverna-server-scape-auto/server-unix-forker/target/server-unix-forker-2.5.5_SCAPE-SNAPSHOT-jar-with-dependencies.jar to /home/jenkins/.m2/repository/uk/org/taverna/server/server-unix-forker/2.5.5_SCAPE-SNAPSHOT/server-unix-forker-2.5.5_SCAPE-SNAPSHOT-jar-with-dependencies.jar
[INFO]                                                                         
[INFO] ------------------------------------------------------------------------
[INFO] Building RMI registry daemon 2.5.5_SCAPE-SNAPSHOT
[INFO] ------------------------------------------------------------------------
[INFO] 
[INFO] --- maven-clean-plugin:2.5:clean (default-clean) @ server-rmidaemon ---
[INFO] Deleting /var/lib/jenkins/workspace/taverna-server-scape-auto/server-rmidaemon/target
[INFO] 
[INFO] --- maven-resources-plugin:2.6:resources (default-resources) @ server-rmidaemon ---
[INFO] Using 'US-ASCII' encoding to copy filtered resources.
[INFO] skip non existing resourceDirectory /var/lib/jenkins/workspace/taverna-server-scape-auto/server-rmidaemon/src/main/resources
[INFO] 
[INFO] --- maven-compiler-plugin:3.1:compile (default-compile) @ server-rmidaemon ---
[INFO] Changes detected - recompiling the module!
[INFO] Compiling 2 source files to /var/lib/jenkins/workspace/taverna-server-scape-auto/server-rmidaemon/target/classes
[INFO] 
[INFO] --- maven-resources-plugin:2.6:testResources (default-testResources) @ server-rmidaemon ---
[INFO] Using 'US-ASCII' encoding to copy filtered resources.
[INFO] skip non existing resourceDirectory /var/lib/jenkins/workspace/taverna-server-scape-auto/server-rmidaemon/src/test/resources
[INFO] 
[INFO] --- maven-compiler-plugin:3.1:testCompile (default-testCompile) @ server-rmidaemon ---
[INFO] No sources to compile
[INFO] 
[INFO] --- maven-surefire-plugin:2.17:test (default-test) @ server-rmidaemon ---
[INFO] No tests to run.
[JENKINS] Recording test results
[INFO] 
[INFO] --- maven-jar-plugin:2.4:jar (default-jar) @ server-rmidaemon ---
[INFO] Building jar: /var/lib/jenkins/workspace/taverna-server-scape-auto/server-rmidaemon/target/server-rmidaemon-2.5.5_SCAPE-SNAPSHOT.jar
[INFO] 
[INFO] >>> maven-source-plugin:2.2.1:jar (default) @ server-rmidaemon >>>
[WARNING] Failed to getClass for org.apache.maven.plugin.source.SourceJarMojo
[INFO] 
[INFO] <<< maven-source-plugin:2.2.1:jar (default) @ server-rmidaemon <<<
[INFO] 
[INFO] --- maven-source-plugin:2.2.1:jar (default) @ server-rmidaemon ---
[INFO] Building jar: /var/lib/jenkins/workspace/taverna-server-scape-auto/server-rmidaemon/target/server-rmidaemon-2.5.5_SCAPE-SNAPSHOT-sources.jar
[INFO] 
[INFO] >>> maven-source-plugin:2.2.1:test-jar (default) @ server-rmidaemon >>>
[WARNING] Failed to getClass for org.apache.maven.plugin.source.TestSourceJarMojo
[INFO] 
[INFO] <<< maven-source-plugin:2.2.1:test-jar (default) @ server-rmidaemon <<<
[INFO] 
[INFO] --- maven-source-plugin:2.2.1:test-jar (default) @ server-rmidaemon ---
[INFO] No sources in project. Archive not created.
[INFO] 
[INFO] --- maven-jar-plugin:2.4:test-jar (default) @ server-rmidaemon ---
[WARNING] JAR will be empty - no content was marked for inclusion!
[INFO] Building jar: /var/lib/jenkins/workspace/taverna-server-scape-auto/server-rmidaemon/target/server-rmidaemon-2.5.5_SCAPE-SNAPSHOT-tests.jar
[INFO] 
[INFO] --- maven-assembly-plugin:2.4:single (make-assembly) @ server-rmidaemon ---
[INFO] Building jar: /var/lib/jenkins/workspace/taverna-server-scape-auto/server-rmidaemon/target/server-rmidaemon-2.5.5_SCAPE-SNAPSHOT-jar-with-dependencies.jar
[INFO] 
[INFO] --- maven-install-plugin:2.4:install (default-install) @ server-rmidaemon ---
[INFO] Installing /var/lib/jenkins/workspace/taverna-server-scape-auto/server-rmidaemon/target/server-rmidaemon-2.5.5_SCAPE-SNAPSHOT.jar to /home/jenkins/.m2/repository/uk/org/taverna/server/server-rmidaemon/2.5.5_SCAPE-SNAPSHOT/server-rmidaemon-2.5.5_SCAPE-SNAPSHOT.jar
[INFO] Installing /var/lib/jenkins/workspace/taverna-server-scape-auto/server-rmidaemon/pom.xml to /home/jenkins/.m2/repository/uk/org/taverna/server/server-rmidaemon/2.5.5_SCAPE-SNAPSHOT/server-rmidaemon-2.5.5_SCAPE-SNAPSHOT.pom
[INFO] Installing /var/lib/jenkins/workspace/taverna-server-scape-auto/server-rmidaemon/target/server-rmidaemon-2.5.5_SCAPE-SNAPSHOT-sources.jar to /home/jenkins/.m2/repository/uk/org/taverna/server/server-rmidaemon/2.5.5_SCAPE-SNAPSHOT/server-rmidaemon-2.5.5_SCAPE-SNAPSHOT-sources.jar
[INFO] Installing /var/lib/jenkins/workspace/taverna-server-scape-auto/server-rmidaemon/target/server-rmidaemon-2.5.5_SCAPE-SNAPSHOT-tests.jar to /home/jenkins/.m2/repository/uk/org/taverna/server/server-rmidaemon/2.5.5_SCAPE-SNAPSHOT/server-rmidaemon-2.5.5_SCAPE-SNAPSHOT-tests.jar
[INFO] Installing /var/lib/jenkins/workspace/taverna-server-scape-auto/server-rmidaemon/target/server-rmidaemon-2.5.5_SCAPE-SNAPSHOT-jar-with-dependencies.jar to /home/jenkins/.m2/repository/uk/org/taverna/server/server-rmidaemon/2.5.5_SCAPE-SNAPSHOT/server-rmidaemon-2.5.5_SCAPE-SNAPSHOT-jar-with-dependencies.jar
[INFO]                                                                         
[INFO] ------------------------------------------------------------------------
[INFO] Building Operations for SCAPE Workflows 2.5.5_SCAPE-SNAPSHOT
[INFO] ------------------------------------------------------------------------
[INFO] Downloading: http://repository.mygrid.org.uk/artifactory/repo/eu/scape-project/model/scape-platform-datamodel/0.1.9-SNAPSHOT/maven-metadata.xml
[INFO] Downloaded: http://repository.mygrid.org.uk/artifactory/repo/eu/scape-project/model/scape-platform-datamodel/0.1.9-SNAPSHOT/maven-metadata.xml (2 KB at 12.4 KB/sec)
[INFO] Downloading: http://repository.mygrid.org.uk/artifactory/repo/eu/scape-project/model/scape-platform-datamodel/0.1.9-SNAPSHOT/scape-platform-datamodel-0.1.9-20140827.053457-88.pom
[INFO] Downloaded: http://repository.mygrid.org.uk/artifactory/repo/eu/scape-project/model/scape-platform-datamodel/0.1.9-SNAPSHOT/scape-platform-datamodel-0.1.9-20140827.053457-88.pom (10 KB at 211.9 KB/sec)
[INFO] Downloading: http://repository.mygrid.org.uk/artifactory/repo/eu/scape-project/scape-parent/1.0.0-SNAPSHOT/maven-metadata.xml
[INFO] Downloaded: http://repository.mygrid.org.uk/artifactory/repo/eu/scape-project/scape-parent/1.0.0-SNAPSHOT/maven-metadata.xml (605 B at 0.5 KB/sec)
[INFO] Downloading: http://repository.mygrid.org.uk/artifactory/repo/eu/scape-project/scape-parent/1.0.0-SNAPSHOT/scape-parent-1.0.0-20131219.180519-5.pom
[INFO] Downloaded: http://repository.mygrid.org.uk/artifactory/repo/eu/scape-project/scape-parent/1.0.0-SNAPSHOT/scape-parent-1.0.0-20131219.180519-5.pom (5 KB at 4.3 KB/sec)
[INFO] Downloading: http://repository.mygrid.org.uk/artifactory/repo/com/sun/xml/bind/jaxb-impl/2.2.4-1/jaxb-impl-2.2.4-1.pom
[INFO] Downloaded: http://repository.mygrid.org.uk/artifactory/repo/com/sun/xml/bind/jaxb-impl/2.2.4-1/jaxb-impl-2.2.4-1.pom (4 KB at 37.0 KB/sec)
[INFO] Downloading: http://repository.mygrid.org.uk/artifactory/repo/javax/xml/bind/jaxb-api/2.2.3/jaxb-api-2.2.3.pom
[INFO] Downloaded: http://repository.mygrid.org.uk/artifactory/repo/javax/xml/bind/jaxb-api/2.2.3/jaxb-api-2.2.3.pom (9 KB at 180.3 KB/sec)
[INFO] Downloading: http://repository.mygrid.org.uk/artifactory/repo/gov/loc/pairtree/1.1.1/pairtree-1.1.1.pom
[WARNING] The POM for gov.loc:pairtree:jar:1.1.1 is missing, no dependency information available
[INFO] Downloading: http://repository.mygrid.org.uk/artifactory/repo/eu/scape-project/model/scape-platform-datamodel/0.1.9-SNAPSHOT/scape-platform-datamodel-0.1.9-20140827.053457-88.jar
[INFO] Downloading: http://repository.mygrid.org.uk/artifactory/repo/com/sun/xml/bind/jaxb-impl/2.2.4-1/jaxb-impl-2.2.4-1.jar
[INFO] Downloading: http://repository.mygrid.org.uk/artifactory/repo/gov/loc/pairtree/1.1.1/pairtree-1.1.1.jar
[INFO] Downloading: http://repository.mygrid.org.uk/artifactory/repo/javax/xml/bind/jaxb-api/2.2.3/jaxb-api-2.2.3.jar
[INFO] Downloaded: http://repository.mygrid.org.uk/artifactory/repo/com/sun/xml/bind/jaxb-impl/2.2.4-1/jaxb-impl-2.2.4-1.jar (876 KB at 3183.9 KB/sec)
[INFO] Downloaded: http://repository.mygrid.org.uk/artifactory/repo/javax/xml/bind/jaxb-api/2.2.3/jaxb-api-2.2.3.jar (105 KB at 380.4 KB/sec)
[INFO] Downloaded: http://repository.mygrid.org.uk/artifactory/repo/eu/scape-project/model/scape-platform-datamodel/0.1.9-SNAPSHOT/scape-platform-datamodel-0.1.9-20140827.053457-88.jar (450 KB at 1241.5 KB/sec)
[INFO] ------------------------------------------------------------------------
[INFO] Reactor Summary:
[INFO] 
[INFO] Taverna Server .................................... SUCCESS [  2.445 s]
[INFO] Workflow Port Descriptor Types .................... SUCCESS [ 21.623 s]
[INFO] RMI Interface: Webapp <-> Worker .................. SUCCESS [  1.140 s]
[INFO] Usage Record Support .............................. SUCCESS [  7.748 s]
[INFO] Workflow Executor/File System Access Process Implementation  SUCCESS [  6.628 s]
[INFO] Impersonation Module (Unix) ....................... SUCCESS [  1.416 s]
[INFO] RMI registry daemon ............................... SUCCESS [  1.071 s]
[INFO] Operations for SCAPE Workflows .................... FAILURE [  5.974 s]
[INFO] Web Application Core .............................. SKIPPED
[INFO] server-client ..................................... SKIPPED
[INFO] Distribution Packaging ............................ SKIPPED
[INFO] ------------------------------------------------------------------------
[INFO] BUILD FAILURE
[INFO] ------------------------------------------------------------------------
[INFO] Total time: 01:22 min
[INFO] Finished at: 2014-08-27T15:13:02+00:00
[INFO] Final Memory: 28M/173M
[INFO] ------------------------------------------------------------------------
[ERROR] Failed to execute goal on project server-scape-operations: Could not resolve dependencies for project uk.org.taverna.server:server-scape-operations:jar:2.5.5_SCAPE-SNAPSHOT: Could not find artifact gov.loc:pairtree:jar:1.1.1 in repo (http://repository.mygrid.org.uk/artifactory/repo) -> [Help 1]
[ERROR] 
[ERROR] To see the full stack trace of the errors, re-run Maven with the -e switch.
[ERROR] Re-run Maven using the -X switch to enable full debug logging.
[ERROR] 
[ERROR] For more information about the errors and possible solutions, please read the following articles:
[ERROR] [Help 1] http://cwiki.apache.org/confluence/display/MAVEN/DependencyResolutionException
Waiting for Jenkins to finish collecting data[ERROR] 
[ERROR] After correcting the problems, you can resume the build with the command
[ERROR]   mvn <goals> -rf :server-scape-operations

[JENKINS] Archiving /var/lib/jenkins/workspace/taverna-server-scape-auto/server-rmidaemon/pom.xml to uk.org.taverna.server/server-rmidaemon/2.5.5_SCAPE-SNAPSHOT/server-rmidaemon-2.5.5_SCAPE-SNAPSHOT.pom
[JENKINS] Archiving /var/lib/jenkins/workspace/taverna-server-scape-auto/server-rmidaemon/target/server-rmidaemon-2.5.5_SCAPE-SNAPSHOT.jar to uk.org.taverna.server/server-rmidaemon/2.5.5_SCAPE-SNAPSHOT/server-rmidaemon-2.5.5_SCAPE-SNAPSHOT.jar
[JENKINS] Archiving /var/lib/jenkins/workspace/taverna-server-scape-auto/server-rmidaemon/target/server-rmidaemon-2.5.5_SCAPE-SNAPSHOT-sources.jar to uk.org.taverna.server/server-rmidaemon/2.5.5_SCAPE-SNAPSHOT/server-rmidaemon-2.5.5_SCAPE-SNAPSHOT-sources.jar
[JENKINS] Archiving /var/lib/jenkins/workspace/taverna-server-scape-auto/server-rmidaemon/target/server-rmidaemon-2.5.5_SCAPE-SNAPSHOT-tests.jar to uk.org.taverna.server/server-rmidaemon/2.5.5_SCAPE-SNAPSHOT/server-rmidaemon-2.5.5_SCAPE-SNAPSHOT-tests.jar
[JENKINS] Archiving /var/lib/jenkins/workspace/taverna-server-scape-auto/server-rmidaemon/target/server-rmidaemon-2.5.5_SCAPE-SNAPSHOT-jar-with-dependencies.jar to uk.org.taverna.server/server-rmidaemon/2.5.5_SCAPE-SNAPSHOT/server-rmidaemon-2.5.5_SCAPE-SNAPSHOT-jar-with-dependencies.jar
[JENKINS] Archiving /var/lib/jenkins/workspace/taverna-server-scape-auto/server-client/pom.xml to uk.org.taverna.server/server-client/2.5.5_SCAPE-SNAPSHOT/server-client-2.5.5_SCAPE-SNAPSHOT.pom
[JENKINS] Archiving /var/lib/jenkins/workspace/taverna-server-scape-auto/server-distribution/pom.xml to uk.org.taverna.server/server-distribution/2.5.5_SCAPE-SNAPSHOT/server-distribution-2.5.5_SCAPE-SNAPSHOT.pom
[JENKINS] Archiving /var/lib/jenkins/workspace/taverna-server-scape-auto/pom.xml to uk.org.taverna.server/server/2.5.5_SCAPE-SNAPSHOT/server-2.5.5_SCAPE-SNAPSHOT.pom
[JENKINS] Archiving /var/lib/jenkins/workspace/taverna-server-scape-auto/target/server-2.5.5_SCAPE-SNAPSHOT-tests.jar to uk.org.taverna.server/server/2.5.5_SCAPE-SNAPSHOT/server-2.5.5_SCAPE-SNAPSHOT-tests.jar
[JENKINS] Archiving /var/lib/jenkins/workspace/taverna-server-scape-auto/server-runinterface/pom.xml to uk.org.taverna.server/server-runinterface/2.5.5_SCAPE-SNAPSHOT/server-runinterface-2.5.5_SCAPE-SNAPSHOT.pom
[JENKINS] Archiving /var/lib/jenkins/workspace/taverna-server-scape-auto/server-runinterface/target/server-runinterface-2.5.5_SCAPE-SNAPSHOT.jar to uk.org.taverna.server/server-runinterface/2.5.5_SCAPE-SNAPSHOT/server-runinterface-2.5.5_SCAPE-SNAPSHOT.jar
[JENKINS] Archiving /var/lib/jenkins/workspace/taverna-server-scape-auto/server-runinterface/target/server-runinterface-2.5.5_SCAPE-SNAPSHOT-sources.jar to uk.org.taverna.server/server-runinterface/2.5.5_SCAPE-SNAPSHOT/server-runinterface-2.5.5_SCAPE-SNAPSHOT-sources.jar
[JENKINS] Archiving /var/lib/jenkins/workspace/taverna-server-scape-auto/server-runinterface/target/server-runinterface-2.5.5_SCAPE-SNAPSHOT-tests.jar to uk.org.taverna.server/server-runinterface/2.5.5_SCAPE-SNAPSHOT/server-runinterface-2.5.5_SCAPE-SNAPSHOT-tests.jar
[JENKINS] Archiving /var/lib/jenkins/workspace/taverna-server-scape-auto/server-scape-operations/pom.xml to uk.org.taverna.server/server-scape-operations/2.5.5_SCAPE-SNAPSHOT/server-scape-operations-2.5.5_SCAPE-SNAPSHOT.pom
[JENKINS] Archiving /var/lib/jenkins/workspace/taverna-server-scape-auto/server-webapp/pom.xml to uk.org.taverna.server/server-webapp/2.5.5_SCAPE-SNAPSHOT/server-webapp-2.5.5_SCAPE-SNAPSHOT.pom
[JENKINS] Archiving /var/lib/jenkins/workspace/taverna-server-scape-auto/server-port-description/pom.xml to uk.org.taverna.server/server-port-description/2.5.5_SCAPE-SNAPSHOT/server-port-description-2.5.5_SCAPE-SNAPSHOT.pom
[JENKINS] Archiving /var/lib/jenkins/workspace/taverna-server-scape-auto/server-port-description/target/server-port-description-2.5.5_SCAPE-SNAPSHOT.jar to uk.org.taverna.server/server-port-description/2.5.5_SCAPE-SNAPSHOT/server-port-description-2.5.5_SCAPE-SNAPSHOT.jar
[JENKINS] Archiving /var/lib/jenkins/workspace/taverna-server-scape-auto/server-port-description/target/server-port-description-2.5.5_SCAPE-SNAPSHOT-sources.jar to uk.org.taverna.server/server-port-description/2.5.5_SCAPE-SNAPSHOT/server-port-description-2.5.5_SCAPE-SNAPSHOT-sources.jar
[JENKINS] Archiving /var/lib/jenkins/workspace/taverna-server-scape-auto/server-port-description/target/server-port-description-2.5.5_SCAPE-SNAPSHOT-test-sources.jar to uk.org.taverna.server/server-port-description/2.5.5_SCAPE-SNAPSHOT/server-port-description-2.5.5_SCAPE-SNAPSHOT-test-sources.jar
[JENKINS] Archiving /var/lib/jenkins/workspace/taverna-server-scape-auto/server-port-description/target/server-port-description-2.5.5_SCAPE-SNAPSHOT-tests.jar to uk.org.taverna.server/server-port-description/2.5.5_SCAPE-SNAPSHOT/server-port-description-2.5.5_SCAPE-SNAPSHOT-tests.jar
[JENKINS] Archiving /var/lib/jenkins/workspace/taverna-server-scape-auto/server-unix-forker/pom.xml to uk.org.taverna.server/server-unix-forker/2.5.5_SCAPE-SNAPSHOT/server-unix-forker-2.5.5_SCAPE-SNAPSHOT.pom
[JENKINS] Archiving /var/lib/jenkins/workspace/taverna-server-scape-auto/server-unix-forker/target/server-unix-forker-2.5.5_SCAPE-SNAPSHOT.jar to uk.org.taverna.server/server-unix-forker/2.5.5_SCAPE-SNAPSHOT/server-unix-forker-2.5.5_SCAPE-SNAPSHOT.jar
[JENKINS] Archiving /var/lib/jenkins/workspace/taverna-server-scape-auto/server-unix-forker/target/server-unix-forker-2.5.5_SCAPE-SNAPSHOT-sources.jar to uk.org.taverna.server/server-unix-forker/2.5.5_SCAPE-SNAPSHOT/server-unix-forker-2.5.5_SCAPE-SNAPSHOT-sources.jar
[JENKINS] Archiving /var/lib/jenkins/workspace/taverna-server-scape-auto/server-unix-forker/target/server-unix-forker-2.5.5_SCAPE-SNAPSHOT-tests.jar to uk.org.taverna.server/server-unix-forker/2.5.5_SCAPE-SNAPSHOT/server-unix-forker-2.5.5_SCAPE-SNAPSHOT-tests.jar
[JENKINS] Archiving /var/lib/jenkins/workspace/taverna-server-scape-auto/server-unix-forker/target/server-unix-forker-2.5.5_SCAPE-SNAPSHOT-jar-with-dependencies.jar to uk.org.taverna.server/server-unix-forker/2.5.5_SCAPE-SNAPSHOT/server-unix-forker-2.5.5_SCAPE-SNAPSHOT-jar-with-dependencies.jar
[JENKINS] Archiving /var/lib/jenkins/workspace/taverna-server-scape-auto/server-usagerecord/pom.xml to uk.org.taverna.server/server-usagerecord/2.5.5_SCAPE-SNAPSHOT/server-usagerecord-2.5.5_SCAPE-SNAPSHOT.pom
[JENKINS] Archiving /var/lib/jenkins/workspace/taverna-server-scape-auto/server-usagerecord/target/server-usagerecord-2.5.5_SCAPE-SNAPSHOT.jar to uk.org.taverna.server/server-usagerecord/2.5.5_SCAPE-SNAPSHOT/server-usagerecord-2.5.5_SCAPE-SNAPSHOT.jar
[JENKINS] Archiving /var/lib/jenkins/workspace/taverna-server-scape-auto/server-usagerecord/target/server-usagerecord-2.5.5_SCAPE-SNAPSHOT-sources.jar to uk.org.taverna.server/server-usagerecord/2.5.5_SCAPE-SNAPSHOT/server-usagerecord-2.5.5_SCAPE-SNAPSHOT-sources.jar
[JENKINS] Archiving /var/lib/jenkins/workspace/taverna-server-scape-auto/server-usagerecord/target/server-usagerecord-2.5.5_SCAPE-SNAPSHOT-test-sources.jar to uk.org.taverna.server/server-usagerecord/2.5.5_SCAPE-SNAPSHOT/server-usagerecord-2.5.5_SCAPE-SNAPSHOT-test-sources.jar
[JENKINS] Archiving /var/lib/jenkins/workspace/taverna-server-scape-auto/server-usagerecord/target/server-usagerecord-2.5.5_SCAPE-SNAPSHOT-tests.jar to uk.org.taverna.server/server-usagerecord/2.5.5_SCAPE-SNAPSHOT/server-usagerecord-2.5.5_SCAPE-SNAPSHOT-tests.jar
[JENKINS] Archiving /var/lib/jenkins/workspace/taverna-server-scape-auto/server-worker/pom.xml to uk.org.taverna.server/server-worker/2.5.5_SCAPE-SNAPSHOT/server-worker-2.5.5_SCAPE-SNAPSHOT.pom
[JENKINS] Archiving /var/lib/jenkins/workspace/taverna-server-scape-auto/server-worker/target/server-worker-2.5.5_SCAPE-SNAPSHOT.jar to uk.org.taverna.server/server-worker/2.5.5_SCAPE-SNAPSHOT/server-worker-2.5.5_SCAPE-SNAPSHOT.jar
[JENKINS] Archiving /var/lib/jenkins/workspace/taverna-server-scape-auto/server-worker/target/server-worker-2.5.5_SCAPE-SNAPSHOT-sources.jar to uk.org.taverna.server/server-worker/2.5.5_SCAPE-SNAPSHOT/server-worker-2.5.5_SCAPE-SNAPSHOT-sources.jar
[JENKINS] Archiving /var/lib/jenkins/workspace/taverna-server-scape-auto/server-worker/target/server-worker-2.5.5_SCAPE-SNAPSHOT-test-sources.jar to uk.org.taverna.server/server-worker/2.5.5_SCAPE-SNAPSHOT/server-worker-2.5.5_SCAPE-SNAPSHOT-test-sources.jar
[JENKINS] Archiving /var/lib/jenkins/workspace/taverna-server-scape-auto/server-worker/target/server-worker-2.5.5_SCAPE-SNAPSHOT-tests.jar to uk.org.taverna.server/server-worker/2.5.5_SCAPE-SNAPSHOT/server-worker-2.5.5_SCAPE-SNAPSHOT-tests.jar
[JENKINS] Archiving /var/lib/jenkins/workspace/taverna-server-scape-auto/server-worker/target/server-worker-2.5.5_SCAPE-SNAPSHOT-jar-with-dependencies.jar to uk.org.taverna.server/server-worker/2.5.5_SCAPE-SNAPSHOT/server-worker-2.5.5_SCAPE-SNAPSHOT-jar-with-dependencies.jar
Sending e-mails to: donal.k.fellows@manchester.ac.uk
channel stopped
Sending e-mails to: donal.k.fellows@manchester.ac.uk
Finished: FAILURE