FailedConsole Output

Skipping 138 KB.. Full Log
4j-core: checking for updates from central
Downloading: http://www.mygrid.org.uk/maven/repository/org/twitter4j/twitter4j-core/4.0.1/twitter4j-core-4.0.1.pom
[INFO] Unable to find resource 'org.twitter4j:twitter4j-core:pom:4.0.1' in repository mygrid-repository (http://www.mygrid.org.uk/maven/repository)
Downloading: http://repo2.maven.org/maven2/org/twitter4j/twitter4j-core/4.0.1/twitter4j-core-4.0.1.pom
8K downloaded  (twitter4j-core-4.0.1.pom)
Downloading: http://www.mygrid.org.uk/maven/repository/cglib/cglib/3.0/cglib-3.0.pom
[INFO] Unable to find resource 'cglib:cglib:pom:3.0' in repository mygrid-repository (http://www.mygrid.org.uk/maven/repository)
Downloading: http://repo2.maven.org/maven2/cglib/cglib/3.0/cglib-3.0.pom
1K downloaded  (cglib-3.0.pom)
Downloading: http://www.mygrid.org.uk/maven/repository/org/ow2/asm/asm/4.0/asm-4.0.pom
[INFO] Unable to find resource 'org.ow2.asm:asm:pom:4.0' in repository mygrid-repository (http://www.mygrid.org.uk/maven/repository)
Downloading: http://repo2.maven.org/maven2/org/ow2/asm/asm/4.0/asm-4.0.pom
1K downloaded  (asm-4.0.pom)
Downloading: http://www.mygrid.org.uk/maven/repository/org/ow2/asm/asm-parent/4.0/asm-parent-4.0.pom
[INFO] Unable to find resource 'org.ow2.asm:asm-parent:pom:4.0' in repository mygrid-repository (http://www.mygrid.org.uk/maven/repository)
Downloading: http://repo2.maven.org/maven2/org/ow2/asm/asm-parent/4.0/asm-parent-4.0.pom
5K downloaded  (asm-parent-4.0.pom)
Downloading: http://www.mygrid.org.uk/maven/repository/org/ow2/ow2/1.3/ow2-1.3.pom
[INFO] Unable to find resource 'org.ow2:ow2:pom:1.3' in repository mygrid-repository (http://www.mygrid.org.uk/maven/repository)
Downloading: http://repo2.maven.org/maven2/org/ow2/ow2/1.3/ow2-1.3.pom
9K downloaded  (ow2-1.3.pom)
Downloading: http://www.mygrid.org.uk/maven/repository/org/aspectj/aspectjrt/1.7.4/aspectjrt-1.7.4.pom
[INFO] Unable to find resource 'org.aspectj:aspectjrt:pom:1.7.4' in repository mygrid-repository (http://www.mygrid.org.uk/maven/repository)
Downloading: http://repo2.maven.org/maven2/org/aspectj/aspectjrt/1.7.4/aspectjrt-1.7.4.pom
1K downloaded  (aspectjrt-1.7.4.pom)
Downloading: http://www.mygrid.org.uk/maven/repository/org/apache/httpcomponents/httpclient/4.3.1/httpclient-4.3.1.pom
[INFO] Unable to find resource 'org.apache.httpcomponents:httpclient:pom:4.3.1' in repository mygrid-repository (http://www.mygrid.org.uk/maven/repository)
Downloading: http://repo2.maven.org/maven2/org/apache/httpcomponents/httpclient/4.3.1/httpclient-4.3.1.pom
5K downloaded  (httpclient-4.3.1.pom)
Downloading: http://www.mygrid.org.uk/maven/repository/org/apache/httpcomponents/httpcomponents-client/4.3.1/httpcomponents-client-4.3.1.pom
[INFO] Unable to find resource 'org.apache.httpcomponents:httpcomponents-client:pom:4.3.1' in repository mygrid-repository (http://www.mygrid.org.uk/maven/repository)
Downloading: http://repo2.maven.org/maven2/org/apache/httpcomponents/httpcomponents-client/4.3.1/httpcomponents-client-4.3.1.pom
15K downloaded  (httpcomponents-client-4.3.1.pom)
Downloading: http://files.couchbase.com/maven2//org/apache/httpcomponents/project/7/project-7.pom
[INFO] Unable to find resource 'org.apache.httpcomponents:project:pom:7' in repository spy (http://files.couchbase.com/maven2/)
Downloading: http://www.mygrid.org.uk/maven/repository/org/apache/httpcomponents/project/7/project-7.pom
[INFO] Unable to find resource 'org.apache.httpcomponents:project:pom:7' in repository mygrid-repository (http://www.mygrid.org.uk/maven/repository)
Downloading: http://repo2.maven.org/maven2/org/apache/httpcomponents/project/7/project-7.pom
26K downloaded  (project-7.pom)
Downloading: http://www.mygrid.org.uk/maven/repository/org/apache/httpcomponents/httpcore/4.3/httpcore-4.3.pom
[INFO] Unable to find resource 'org.apache.httpcomponents:httpcore:pom:4.3' in repository mygrid-repository (http://www.mygrid.org.uk/maven/repository)
Downloading: http://repo2.maven.org/maven2/org/apache/httpcomponents/httpcore/4.3/httpcore-4.3.pom
4K downloaded  (httpcore-4.3.pom)
Downloading: http://www.mygrid.org.uk/maven/repository/org/apache/httpcomponents/httpcomponents-core/4.3/httpcomponents-core-4.3.pom
[INFO] Unable to find resource 'org.apache.httpcomponents:httpcomponents-core:pom:4.3' in repository mygrid-repository (http://www.mygrid.org.uk/maven/repository)
Downloading: http://repo2.maven.org/maven2/org/apache/httpcomponents/httpcomponents-core/4.3/httpcomponents-core-4.3.pom
11K downloaded  (httpcomponents-core-4.3.pom)
Downloading: http://www.mygrid.org.uk/maven/repository/commons-codec/commons-codec/1.8/commons-codec-1.8.pom
[INFO] Unable to find resource 'commons-codec:commons-codec:pom:1.8' in repository mygrid-repository (http://www.mygrid.org.uk/maven/repository)
Downloading: http://repo2.maven.org/maven2/commons-codec/commons-codec/1.8/commons-codec-1.8.pom
11K downloaded  (commons-codec-1.8.pom)
Downloading: http://www.mygrid.org.uk/maven/repository/org/apache/abdera/abdera-core/1.1.3/abdera-core-1.1.3.pom
[INFO] Unable to find resource 'org.apache.abdera:abdera-core:pom:1.1.3' in repository mygrid-repository (http://www.mygrid.org.uk/maven/repository)
Downloading: http://repo2.maven.org/maven2/org/apache/abdera/abdera-core/1.1.3/abdera-core-1.1.3.pom
2K downloaded  (abdera-core-1.1.3.pom)
Downloading: http://www.mygrid.org.uk/maven/repository/org/apache/abdera/abdera/1.1.3/abdera-1.1.3.pom
[INFO] Unable to find resource 'org.apache.abdera:abdera:pom:1.1.3' in repository mygrid-repository (http://www.mygrid.org.uk/maven/repository)
Downloading: http://repo2.maven.org/maven2/org/apache/abdera/abdera/1.1.3/abdera-1.1.3.pom
17K downloaded  (abdera-1.1.3.pom)
Downloading: http://www.mygrid.org.uk/maven/repository/org/apache/abdera/abdera-i18n/1.1.3/abdera-i18n-1.1.3.pom
[INFO] Unable to find resource 'org.apache.abdera:abdera-i18n:pom:1.1.3' in repository mygrid-repository (http://www.mygrid.org.uk/maven/repository)
Downloading: http://repo2.maven.org/maven2/org/apache/abdera/abdera-i18n/1.1.3/abdera-i18n-1.1.3.pom
1K downloaded  (abdera-i18n-1.1.3.pom)
Downloading: http://www.mygrid.org.uk/maven/repository/org/apache/geronimo/specs/geronimo-activation_1.1_spec/1.1/geronimo-activation_1.1_spec-1.1.pom
[INFO] Unable to find resource 'org.apache.geronimo.specs:geronimo-activation_1.1_spec:pom:1.1' in repository mygrid-repository (http://www.mygrid.org.uk/maven/repository)
Downloading: http://repo2.maven.org/maven2/org/apache/geronimo/specs/geronimo-activation_1.1_spec/1.1/geronimo-activation_1.1_spec-1.1.pom
4K downloaded  (geronimo-activation_1.1_spec-1.1.pom)
Downloading: http://www.mygrid.org.uk/maven/repository/org/apache/abdera/abdera-parser/1.1.3/abdera-parser-1.1.3.pom
[INFO] Unable to find resource 'org.apache.abdera:abdera-parser:pom:1.1.3' in repository mygrid-repository (http://www.mygrid.org.uk/maven/repository)
Downloading: http://repo2.maven.org/maven2/org/apache/abdera/abdera-parser/1.1.3/abdera-parser-1.1.3.pom
2K downloaded  (abdera-parser-1.1.3.pom)
Downloading: http://www.mygrid.org.uk/maven/repository/org/apache/ws/commons/axiom/axiom-api/1.2.14/axiom-api-1.2.14.pom
[INFO] Unable to find resource 'org.apache.ws.commons.axiom:axiom-api:pom:1.2.14' in repository mygrid-repository (http://www.mygrid.org.uk/maven/repository)
Downloading: http://repo2.maven.org/maven2/org/apache/ws/commons/axiom/axiom-api/1.2.14/axiom-api-1.2.14.pom
14K downloaded  (axiom-api-1.2.14.pom)
Downloading: http://www.mygrid.org.uk/maven/repository/org/apache/ws/commons/axiom/axiom-parent/1.2.14/axiom-parent-1.2.14.pom
[INFO] Unable to find resource 'org.apache.ws.commons.axiom:axiom-parent:pom:1.2.14' in repository mygrid-repository (http://www.mygrid.org.uk/maven/repository)
Downloading: http://repo2.maven.org/maven2/org/apache/ws/commons/axiom/axiom-parent/1.2.14/axiom-parent-1.2.14.pom
20K downloaded  (axiom-parent-1.2.14.pom)
Downloading: http://www.mygrid.org.uk/maven/repository/jaxen/jaxen/1.1.4/jaxen-1.1.4.pom
[INFO] Unable to find resource 'jaxen:jaxen:pom:1.1.4' in repository mygrid-repository (http://www.mygrid.org.uk/maven/repository)
Downloading: http://repo2.maven.org/maven2/jaxen/jaxen/1.1.4/jaxen-1.1.4.pom
12K downloaded  (jaxen-1.1.4.pom)
Downloading: http://www.mygrid.org.uk/maven/repository/org/apache/james/apache-mime4j-core/0.7.2/apache-mime4j-core-0.7.2.pom
[INFO] Unable to find resource 'org.apache.james:apache-mime4j-core:pom:0.7.2' in repository mygrid-repository (http://www.mygrid.org.uk/maven/repository)
Downloading: http://repo2.maven.org/maven2/org/apache/james/apache-mime4j-core/0.7.2/apache-mime4j-core-0.7.2.pom
2K downloaded  (apache-mime4j-core-0.7.2.pom)
Downloading: http://www.mygrid.org.uk/maven/repository/org/apache/james/apache-mime4j-project/0.7.2/apache-mime4j-project-0.7.2.pom
[INFO] Unable to find resource 'org.apache.james:apache-mime4j-project:pom:0.7.2' in repository mygrid-repository (http://www.mygrid.org.uk/maven/repository)
Downloading: http://repo2.maven.org/maven2/org/apache/james/apache-mime4j-project/0.7.2/apache-mime4j-project-0.7.2.pom
9K downloaded  (apache-mime4j-project-0.7.2.pom)
Downloading: http://www.mygrid.org.uk/maven/repository/org/apache/james/james-project/1.8/james-project-1.8.pom
[INFO] Unable to find resource 'org.apache.james:james-project:pom:1.8' in repository mygrid-repository (http://www.mygrid.org.uk/maven/repository)
Downloading: http://repo2.maven.org/maven2/org/apache/james/james-project/1.8/james-project-1.8.pom
52K downloaded  (james-project-1.8.pom)
Downloading: http://www.mygrid.org.uk/maven/repository/org/apache/ws/commons/axiom/axiom-impl/1.2.14/axiom-impl-1.2.14.pom
[INFO] Unable to find resource 'org.apache.ws.commons.axiom:axiom-impl:pom:1.2.14' in repository mygrid-repository (http://www.mygrid.org.uk/maven/repository)
Downloading: http://repo2.maven.org/maven2/org/apache/ws/commons/axiom/axiom-impl/1.2.14/axiom-impl-1.2.14.pom
7K downloaded  (axiom-impl-1.2.14.pom)
Downloading: http://www.mygrid.org.uk/maven/repository/org/codehaus/woodstox/wstx-asl/4.0.6/wstx-asl-4.0.6.pom
[INFO] Unable to find resource 'org.codehaus.woodstox:wstx-asl:pom:4.0.6' in repository mygrid-repository (http://www.mygrid.org.uk/maven/repository)
Downloading: http://repo2.maven.org/maven2/org/codehaus/woodstox/wstx-asl/4.0.6/wstx-asl-4.0.6.pom
419b downloaded  (wstx-asl-4.0.6.pom)
Downloading: http://www.mygrid.org.uk/maven/repository/org/codehaus/woodstox/woodstox-core-asl/4.0.6/woodstox-core-asl-4.0.6.pom
[INFO] Unable to find resource 'org.codehaus.woodstox:woodstox-core-asl:pom:4.0.6' in repository mygrid-repository (http://www.mygrid.org.uk/maven/repository)
Downloading: http://repo2.maven.org/maven2/org/codehaus/woodstox/woodstox-core-asl/4.0.6/woodstox-core-asl-4.0.6.pom
1K downloaded  (woodstox-core-asl-4.0.6.pom)
Downloading: http://www.mygrid.org.uk/maven/repository/org/bouncycastle/bcprov-jdk15on/1.49/bcprov-jdk15on-1.49.pom
[INFO] Unable to find resource 'org.bouncycastle:bcprov-jdk15on:pom:1.49' in repository mygrid-repository (http://www.mygrid.org.uk/maven/repository)
Downloading: http://repo2.maven.org/maven2/org/bouncycastle/bcprov-jdk15on/1.49/bcprov-jdk15on-1.49.pom
1K downloaded  (bcprov-jdk15on-1.49.pom)
Downloading: http://www.mygrid.org.uk/maven/repository/org/springframework/spring-context-support/3.2.5.RELEASE/spring-context-support-3.2.5.RELEASE.pom
[INFO] Unable to find resource 'org.springframework:spring-context-support:pom:3.2.5.RELEASE' in repository mygrid-repository (http://www.mygrid.org.uk/maven/repository)
Downloading: http://repo2.maven.org/maven2/org/springframework/spring-context-support/3.2.5.RELEASE/spring-context-support-3.2.5.RELEASE.pom
4K downloaded  (spring-context-support-3.2.5.RELEASE.pom)
Downloading: http://www.mygrid.org.uk/maven/repository/org/aspectj/aspectjweaver/1.7.4/aspectjweaver-1.7.4.pom
[INFO] Unable to find resource 'org.aspectj:aspectjweaver:pom:1.7.4' in repository mygrid-repository (http://www.mygrid.org.uk/maven/repository)
Downloading: http://repo2.maven.org/maven2/org/aspectj/aspectjweaver/1.7.4/aspectjweaver-1.7.4.pom
1K downloaded  (aspectjweaver-1.7.4.pom)
Downloading: http://www.mygrid.org.uk/maven/repository/org/apache/cxf/cxf-rt-rs-extension-providers/2.7.7/cxf-rt-rs-extension-providers-2.7.7.pom
[INFO] Unable to find resource 'org.apache.cxf:cxf-rt-rs-extension-providers:pom:2.7.7' in repository mygrid-repository (http://www.mygrid.org.uk/maven/repository)
Downloading: http://repo2.maven.org/maven2/org/apache/cxf/cxf-rt-rs-extension-providers/2.7.7/cxf-rt-rs-extension-providers-2.7.7.pom
6K downloaded  (cxf-rt-rs-extension-providers-2.7.7.pom)
Downloading: http://www.mygrid.org.uk/maven/repository/org/codehaus/jettison/jettison/1.3.4/jettison-1.3.4.pom
[INFO] Unable to find resource 'org.codehaus.jettison:jettison:pom:1.3.4' in repository mygrid-repository (http://www.mygrid.org.uk/maven/repository)
Downloading: http://repo2.maven.org/maven2/org/codehaus/jettison/jettison/1.3.4/jettison-1.3.4.pom
4K downloaded  (jettison-1.3.4.pom)
Downloading: http://www.mygrid.org.uk/maven/repository/stax/stax-api/1.0.1/stax-api-1.0.1.pom
[INFO] Unable to find resource 'stax:stax-api:pom:1.0.1' in repository mygrid-repository (http://www.mygrid.org.uk/maven/repository)
Downloading: http://repo2.maven.org/maven2/stax/stax-api/1.0.1/stax-api-1.0.1.pom
1K downloaded  (stax-api-1.0.1.pom)
Downloading: http://www.mygrid.org.uk/maven/repository/org/aspectj/aspectjrt/1.7.4/aspectjrt-1.7.4.jar
[INFO] Unable to find resource 'org.aspectj:aspectjrt:jar:1.7.4' in repository mygrid-repository (http://www.mygrid.org.uk/maven/repository)
Downloading: http://repo2.maven.org/maven2/org/aspectj/aspectjrt/1.7.4/aspectjrt-1.7.4.jar
Downloading: http://www.mygrid.org.uk/maven/repository/joda-time/joda-time/2.3/joda-time-2.3.jar
Downloading: http://www.mygrid.org.uk/maven/repository/org/springframework/security/spring-security-core/3.1.4.RELEASE/spring-security-core-3.1.4.RELEASE.jar
Downloading: http://www.mygrid.org.uk/maven/repository/javax/ws/rs/javax.ws.rs-api/2.0-m10/javax.ws.rs-api-2.0-m10.jar
Downloading: http://www.mygrid.org.uk/maven/repository/org/springframework/spring-beans/3.2.5.RELEASE/spring-beans-3.2.5.RELEASE.jar
[INFO] Unable to find resource 'org.springframework.security:spring-security-core:jar:3.1.4.RELEASE' in repository mygrid-repository (http://www.mygrid.org.uk/maven/repository)
Downloading: http://repo2.maven.org/maven2/org/springframework/security/spring-security-core/3.1.4.RELEASE/spring-security-core-3.1.4.RELEASE.jar
[INFO] Unable to find resource 'joda-time:joda-time:jar:2.3' in repository mygrid-repository (http://www.mygrid.org.uk/maven/repository)
Downloading: http://repo2.maven.org/maven2/joda-time/joda-time/2.3/joda-time-2.3.jar
[INFO] Unable to find resource 'org.springframework:spring-beans:jar:3.2.5.RELEASE' in repository mygrid-repository (http://www.mygrid.org.uk/maven/repository)
Downloading: http://repo2.maven.org/maven2/org/springframework/spring-beans/3.2.5.RELEASE/spring-beans-3.2.5.RELEASE.jar
[INFO] Unable to find resource 'javax.ws.rs:javax.ws.rs-api:jar:2.0-m10' in repository mygrid-repository (http://www.mygrid.org.uk/maven/repository)
Downloading: http://repo2.maven.org/maven2/javax/ws/rs/javax.ws.rs-api/2.0-m10/javax.ws.rs-api-2.0-m10.jar
116K downloaded  (aspectjrt-1.7.4.jar)
108K downloaded  (javax.ws.rs-api-2.0-m10.jar)
Downloading: http://www.mygrid.org.uk/maven/repository/org/apache/httpcomponents/httpclient/4.3.1/httpclient-4.3.1.jar
[INFO] Unable to find resource 'org.apache.httpcomponents:httpclient:jar:4.3.1' in repository mygrid-repository (http://www.mygrid.org.uk/maven/repository)
Downloading: http://repo2.maven.org/maven2/org/apache/httpcomponents/httpclient/4.3.1/httpclient-4.3.1.jar
Downloading: http://repo1.maven.org/maven2/org/twitter4j/twitter4j-core/4.0.1/twitter4j-core-4.0.1.jar
332K downloaded  (spring-security-core-3.1.4.RELEASE.jar)
Downloading: http://www.mygrid.org.uk/maven/repository/commons-logging/commons-logging/1.1.3/commons-logging-1.1.3.jar
[INFO] Unable to find resource 'commons-logging:commons-logging:jar:1.1.3' in repository mygrid-repository (http://www.mygrid.org.uk/maven/repository)
Downloading: http://repo2.maven.org/maven2/commons-logging/commons-logging/1.1.3/commons-logging-1.1.3.jar
281K downloaded  (twitter4j-core-4.0.1.jar)
Downloading: http://www.mygrid.org.uk/maven/repository/org/apache/neethi/neethi/3.0.2/neethi-3.0.2.jar
60K downloaded  (commons-logging-1.1.3.jar)
[INFO] Unable to find resource 'org.apache.neethi:neethi:jar:3.0.2' in repository mygrid-repository (http://www.mygrid.org.uk/maven/repository)
Downloading: http://repo2.maven.org/maven2/org/apache/neethi/neethi/3.0.2/neethi-3.0.2.jar
596K downloaded  (spring-beans-3.2.5.RELEASE.jar)
Downloading: http://www.mygrid.org.uk/maven/repository/org/apache/ws/xmlschema/xmlschema-core/2.0.3/xmlschema-core-2.0.3.jar
Downloading: http://www.mygrid.org.uk/maven/repository/org/apache/cxf/cxf-rt-frontend-jaxws/2.7.7/cxf-rt-frontend-jaxws-2.7.7.jar
[INFO] Unable to find resource 'org.apache.ws.xmlschema:xmlschema-core:jar:2.0.3' in repository mygrid-repository (http://www.mygrid.org.uk/maven/repository)
[INFO] Unable to find resource 'org.apache.cxf:cxf-rt-frontend-jaxws:jar:2.7.7' in repository mygrid-repository (http://www.mygrid.org.uk/maven/repository)
567K downloaded  (joda-time-2.3.jar)
69K downloaded  (neethi-3.0.2.jar)
Downloading: http://repo2.maven.org/maven2/org/apache/cxf/cxf-rt-frontend-jaxws/2.7.7/cxf-rt-frontend-jaxws-2.7.7.jar
Downloading: http://repo2.maven.org/maven2/org/apache/ws/xmlschema/xmlschema-core/2.0.3/xmlschema-core-2.0.3.jar
Downloading: http://www.mygrid.org.uk/maven/repository/org/apache/abdera/abdera-core/1.1.3/abdera-core-1.1.3.jar
Downloading: http://www.mygrid.org.uk/maven/repository/wsdl4j/wsdl4j/1.6.3/wsdl4j-1.6.3.jar
[INFO] Unable to find resource 'org.apache.abdera:abdera-core:jar:1.1.3' in repository mygrid-repository (http://www.mygrid.org.uk/maven/repository)
[INFO] Unable to find resource 'wsdl4j:wsdl4j:jar:1.6.3' in repository mygrid-repository (http://www.mygrid.org.uk/maven/repository)
Downloading: http://repo2.maven.org/maven2/wsdl4j/wsdl4j/1.6.3/wsdl4j-1.6.3.jar
Downloading: http://repo2.maven.org/maven2/org/apache/abdera/abdera-core/1.1.3/abdera-core-1.1.3.jar
159K downloaded  (xmlschema-core-2.0.3.jar)
182K downloaded  (wsdl4j-1.6.3.jar)
Downloading: http://www.mygrid.org.uk/maven/repository/org/datanucleus/datanucleus-core/3.2.10/datanucleus-core-3.2.10.jar
Downloading: http://www.mygrid.org.uk/maven/repository/org/bouncycastle/bcprov-jdk15on/1.49/bcprov-jdk15on-1.49.jar
[INFO] Unable to find resource 'org.datanucleus:datanucleus-core:jar:3.2.10' in repository mygrid-repository (http://www.mygrid.org.uk/maven/repository)
Downloading: http://repo2.maven.org/maven2/org/datanucleus/datanucleus-core/3.2.10/datanucleus-core-3.2.10.jar
[INFO] Unable to find resource 'org.bouncycastle:bcprov-jdk15on:jar:1.49' in repository mygrid-repository (http://www.mygrid.org.uk/maven/repository)
Downloading: http://repo2.maven.org/maven2/org/bouncycastle/bcprov-jdk15on/1.49/bcprov-jdk15on-1.49.jar
157K downloaded  (abdera-core-1.1.3.jar)
378K downloaded  (cxf-rt-frontend-jaxws-2.7.7.jar)
Downloading: http://www.mygrid.org.uk/maven/repository/commons-codec/commons-codec/1.8/commons-codec-1.8.jar
Downloading: http://www.mygrid.org.uk/maven/repository/org/apache/geronimo/specs/geronimo-activation_1.1_spec/1.1/geronimo-activation_1.1_spec-1.1.jar
[INFO] Unable to find resource 'commons-codec:commons-codec:jar:1.8' in repository mygrid-repository (http://www.mygrid.org.uk/maven/repository)
Downloading: http://repo2.maven.org/maven2/commons-codec/commons-codec/1.8/commons-codec-1.8.jar
[INFO] Unable to find resource 'org.apache.geronimo.specs:geronimo-activation_1.1_spec:jar:1.1' in repository mygrid-repository (http://www.mygrid.org.uk/maven/repository)
Downloading: http://repo2.maven.org/maven2/org/apache/geronimo/specs/geronimo-activation_1.1_spec/1.1/geronimo-activation_1.1_spec-1.1.jar
571K downloaded  (httpclient-4.3.1.jar)
46K downloaded  (geronimo-activation_1.1_spec-1.1.jar)
Downloading: http://www.mygrid.org.uk/maven/repository/org/springframework/spring-core/3.2.5.RELEASE/spring-core-3.2.5.RELEASE.jar
Downloading: http://www.mygrid.org.uk/maven/repository/org/springframework/security/spring-security-web/3.1.4.RELEASE/spring-security-web-3.1.4.RELEASE.jar
[INFO] Unable to find resource 'org.springframework:spring-core:jar:3.2.5.RELEASE' in repository mygrid-repository (http://www.mygrid.org.uk/maven/repository)
Downloading: http://repo2.maven.org/maven2/org/springframework/spring-core/3.2.5.RELEASE/spring-core-3.2.5.RELEASE.jar
[INFO] Unable to find resource 'org.springframework.security:spring-security-web:jar:3.1.4.RELEASE' in repository mygrid-repository (http://www.mygrid.org.uk/maven/repository)
Downloading: http://repo2.maven.org/maven2/org/springframework/security/spring-security-web/3.1.4.RELEASE/spring-security-web-3.1.4.RELEASE.jar
257K downloaded  (commons-codec-1.8.jar)
Downloading: http://www.mygrid.org.uk/maven/repository/org/apache/abdera/abdera-i18n/1.1.3/abdera-i18n-1.1.3.jar
[INFO] Unable to find resource 'org.apache.abdera:abdera-i18n:jar:1.1.3' in repository mygrid-repository (http://www.mygrid.org.uk/maven/repository)
Downloading: http://repo2.maven.org/maven2/org/apache/abdera/abdera-i18n/1.1.3/abdera-i18n-1.1.3.jar
247K downloaded  (spring-security-web-3.1.4.RELEASE.jar)
Downloading: http://www.mygrid.org.uk/maven/repository/org/apache/cxf/cxf-api/2.7.7/cxf-api-2.7.7.jar
[INFO] Unable to find resource 'org.apache.cxf:cxf-api:jar:2.7.7' in repository mygrid-repository (http://www.mygrid.org.uk/maven/repository)
Downloading: http://repo2.maven.org/maven2/org/apache/cxf/cxf-api/2.7.7/cxf-api-2.7.7.jar
607K downloaded  (abdera-i18n-1.1.3.jar)
Downloading: http://www.mygrid.org.uk/maven/repository/org/apache/httpcomponents/httpcore/4.3/httpcore-4.3.jar
[INFO] Unable to find resource 'org.apache.httpcomponents:httpcore:jar:4.3' in repository mygrid-repository (http://www.mygrid.org.uk/maven/repository)
Downloading: http://repo2.maven.org/maven2/org/apache/httpcomponents/httpcore/4.3/httpcore-4.3.jar
275K downloaded  (httpcore-4.3.jar)
Downloading: http://www.mygrid.org.uk/maven/repository/org/springframework/security/spring-security-config/3.1.4.RELEASE/spring-security-config-3.1.4.RELEASE.jar
[INFO] Unable to find resource 'org.springframework.security:spring-security-config:jar:3.1.4.RELEASE' in repository mygrid-repository (http://www.mygrid.org.uk/maven/repository)
Downloading: http://repo2.maven.org/maven2/org/springframework/security/spring-security-config/3.1.4.RELEASE/spring-security-config-3.1.4.RELEASE.jar
850K downloaded  (spring-core-3.2.5.RELEASE.jar)
Downloading: http://www.mygrid.org.uk/maven/repository/org/springframework/spring-context/3.2.5.RELEASE/spring-context-3.2.5.RELEASE.jar
[INFO] Unable to find resource 'org.springframework:spring-context:jar:3.2.5.RELEASE' in repository mygrid-repository (http://www.mygrid.org.uk/maven/repository)
Downloading: http://repo2.maven.org/maven2/org/springframework/spring-context/3.2.5.RELEASE/spring-context-3.2.5.RELEASE.jar
198K downloaded  (spring-security-config-3.1.4.RELEASE.jar)
1063K downloaded  (cxf-api-2.7.7.jar)
1845K downloaded  (datanucleus-core-3.2.10.jar)
Downloading: http://www.mygrid.org.uk/maven/repository/org/apache/cxf/cxf-rt-core/2.7.7/cxf-rt-core-2.7.7.jar
[INFO] Unable to find resource 'org.apache.cxf:cxf-rt-core:jar:2.7.7' in repository mygrid-repository (http://www.mygrid.org.uk/maven/repository)
Downloading: http://repo1.maven.org/maven2/org/datanucleus/datanucleus-rdbms/3.2.12/datanucleus-rdbms-3.2.12.jar
Downloading: http://repo2.maven.org/maven2/org/apache/cxf/cxf-rt-core/2.7.7/cxf-rt-core-2.7.7.jar
397K downloaded  (cxf-rt-core-2.7.7.jar)
Downloading: http://www.mygrid.org.uk/maven/repository/org/apache/cxf/cxf-rt-bindings-soap/2.7.7/cxf-rt-bindings-soap-2.7.7.jar
[INFO] Unable to find resource 'org.apache.cxf:cxf-rt-bindings-soap:jar:2.7.7' in repository mygrid-repository (http://www.mygrid.org.uk/maven/repository)
Downloading: http://repo2.maven.org/maven2/org/apache/cxf/cxf-rt-bindings-soap/2.7.7/cxf-rt-bindings-soap-2.7.7.jar
844K downloaded  (spring-context-3.2.5.RELEASE.jar)
Downloading: http://www.mygrid.org.uk/maven/repository/org/springframework/spring-expression/3.2.5.RELEASE/spring-expression-3.2.5.RELEASE.jar
[INFO] Unable to find resource 'org.springframework:spring-expression:jar:3.2.5.RELEASE' in repository mygrid-repository (http://www.mygrid.org.uk/maven/repository)
Downloading: http://repo2.maven.org/maven2/org/springframework/spring-expression/3.2.5.RELEASE/spring-expression-3.2.5.RELEASE.jar
198K downloaded  (cxf-rt-bindings-soap-2.7.7.jar)
Downloading: http://www.mygrid.org.uk/maven/repository/org/apache/cxf/cxf-rt-databinding-jaxb/2.7.7/cxf-rt-databinding-jaxb-2.7.7.jar
2418K downloaded  (bcprov-jdk15on-1.49.jar)
[INFO] Unable to find resource 'org.apache.cxf:cxf-rt-databinding-jaxb:jar:2.7.7' in repository mygrid-repository (http://www.mygrid.org.uk/maven/repository)
Downloading: http://repo2.maven.org/maven2/org/apache/cxf/cxf-rt-databinding-jaxb/2.7.7/cxf-rt-databinding-jaxb-2.7.7.jar
192K downloaded  (spring-expression-3.2.5.RELEASE.jar)
Downloading: http://www.mygrid.org.uk/maven/repository/org/springframework/spring-jdbc/3.2.5.RELEASE/spring-jdbc-3.2.5.RELEASE.jar
121K downloaded  (cxf-rt-databinding-jaxb-2.7.7.jar)
Downloading: http://www.mygrid.org.uk/maven/repository/org/apache/cxf/cxf-rt-bindings-xml/2.7.7/cxf-rt-bindings-xml-2.7.7.jar
1778K downloaded  (datanucleus-rdbms-3.2.12.jar)
[INFO] Unable to find resource 'org.springframework:spring-jdbc:jar:3.2.5.RELEASE' in repository mygrid-repository (http://www.mygrid.org.uk/maven/repository)
Downloading: http://repo2.maven.org/maven2/org/springframework/spring-jdbc/3.2.5.RELEASE/spring-jdbc-3.2.5.RELEASE.jar
[INFO] Unable to find resource 'org.apache.cxf:cxf-rt-bindings-xml:jar:2.7.7' in repository mygrid-repository (http://www.mygrid.org.uk/maven/repository)
Downloading: http://repo2.maven.org/maven2/org/apache/cxf/cxf-rt-bindings-xml/2.7.7/cxf-rt-bindings-xml-2.7.7.jar
37K downloaded  (cxf-rt-bindings-xml-2.7.7.jar)
Downloading: http://www.mygrid.org.uk/maven/repository/org/apache/cxf/cxf-rt-frontend-simple/2.7.7/cxf-rt-frontend-simple-2.7.7.jar
395K downloaded  (spring-jdbc-3.2.5.RELEASE.jar)
Downloading: http://www.mygrid.org.uk/maven/repository/org/springframework/spring-tx/3.2.5.RELEASE/spring-tx-3.2.5.RELEASE.jar
[INFO] Unable to find resource 'org.apache.cxf:cxf-rt-frontend-simple:jar:2.7.7' in repository mygrid-repository (http://www.mygrid.org.uk/maven/repository)
Downloading: http://repo2.maven.org/maven2/org/apache/cxf/cxf-rt-frontend-simple/2.7.7/cxf-rt-frontend-simple-2.7.7.jar
65K downloaded  (cxf-rt-frontend-simple-2.7.7.jar)
Downloading: http://www.mygrid.org.uk/maven/repository/org/apache/cxf/cxf-rt-transports-http/2.7.7/cxf-rt-transports-http-2.7.7.jar
[INFO] Unable to find resource 'org.springframework:spring-tx:jar:3.2.5.RELEASE' in repository mygrid-repository (http://www.mygrid.org.uk/maven/repository)
Downloading: http://repo2.maven.org/maven2/org/springframework/spring-tx/3.2.5.RELEASE/spring-tx-3.2.5.RELEASE.jar
[INFO] Unable to find resource 'org.apache.cxf:cxf-rt-transports-http:jar:2.7.7' in repository mygrid-repository (http://www.mygrid.org.uk/maven/repository)
Downloading: http://repo2.maven.org/maven2/org/apache/cxf/cxf-rt-transports-http/2.7.7/cxf-rt-transports-http-2.7.7.jar
236K downloaded  (spring-tx-3.2.5.RELEASE.jar)
Downloading: http://www.mygrid.org.uk/maven/repository/org/springframework/spring-web/3.2.5.RELEASE/spring-web-3.2.5.RELEASE.jar
[INFO] Unable to find resource 'org.springframework:spring-web:jar:3.2.5.RELEASE' in repository mygrid-repository (http://www.mygrid.org.uk/maven/repository)
Downloading: http://repo2.maven.org/maven2/org/springframework/spring-web/3.2.5.RELEASE/spring-web-3.2.5.RELEASE.jar
249K downloaded  (cxf-rt-transports-http-2.7.7.jar)
Downloading: http://www.mygrid.org.uk/maven/repository/org/apache/cxf/cxf-rt-ws-addr/2.7.7/cxf-rt-ws-addr-2.7.7.jar
[INFO] Unable to find resource 'org.apache.cxf:cxf-rt-ws-addr:jar:2.7.7' in repository mygrid-repository (http://www.mygrid.org.uk/maven/repository)
Downloading: http://repo2.maven.org/maven2/org/apache/cxf/cxf-rt-ws-addr/2.7.7/cxf-rt-ws-addr-2.7.7.jar
612K downloaded  (spring-web-3.2.5.RELEASE.jar)
Downloading: http://www.mygrid.org.uk/maven/repository/org/springframework/spring-context-support/3.2.5.RELEASE/spring-context-support-3.2.5.RELEASE.jar
77K downloaded  (cxf-rt-ws-addr-2.7.7.jar)
Downloading: http://www.mygrid.org.uk/maven/repository/org/apache/cxf/cxf-rt-ws-policy/2.7.7/cxf-rt-ws-policy-2.7.7.jar
[INFO] Unable to find resource 'org.springframework:spring-context-support:jar:3.2.5.RELEASE' in repository mygrid-repository (http://www.mygrid.org.uk/maven/repository)
Downloading: http://repo2.maven.org/maven2/org/springframework/spring-context-support/3.2.5.RELEASE/spring-context-support-3.2.5.RELEASE.jar
124K downloaded  (spring-context-support-3.2.5.RELEASE.jar)
[INFO] Unable to find resource 'org.apache.cxf:cxf-rt-ws-policy:jar:2.7.7' in repository mygrid-repository (http://www.mygrid.org.uk/maven/repository)
Downloading: http://repo2.maven.org/maven2/org/apache/cxf/cxf-rt-ws-policy/2.7.7/cxf-rt-ws-policy-2.7.7.jar
200K downloaded  (cxf-rt-ws-policy-2.7.7.jar)
Downloading: http://www.mygrid.org.uk/maven/repository/org/apache/cxf/cxf-rt-frontend-jaxrs/2.7.7/cxf-rt-frontend-jaxrs-2.7.7.jar
[INFO] Unable to find resource 'org.apache.cxf:cxf-rt-frontend-jaxrs:jar:2.7.7' in repository mygrid-repository (http://www.mygrid.org.uk/maven/repository)
Downloading: http://repo2.maven.org/maven2/org/apache/cxf/cxf-rt-frontend-jaxrs/2.7.7/cxf-rt-frontend-jaxrs-2.7.7.jar
621K downloaded  (cxf-rt-frontend-jaxrs-2.7.7.jar)
Downloading: http://www.mygrid.org.uk/maven/repository/org/apache/cxf/cxf-rt-rs-extension-providers/2.7.7/cxf-rt-rs-extension-providers-2.7.7.jar
[INFO] Unable to find resource 'org.apache.cxf:cxf-rt-rs-extension-providers:jar:2.7.7' in repository mygrid-repository (http://www.mygrid.org.uk/maven/repository)
Downloading: http://repo2.maven.org/maven2/org/apache/cxf/cxf-rt-rs-extension-providers/2.7.7/cxf-rt-rs-extension-providers-2.7.7.jar
74K downloaded  (cxf-rt-rs-extension-providers-2.7.7.jar)
[INFO] [compiler:compile {execution: default-compile}]
[INFO] Compiling 203 source files to /local/jenkins/jobs/taverna-server-2.5.4/workspace/server-webapp/target/classes
Downloading: http://www.mygrid.org.uk/maven/repository/org/datanucleus/datanucleus-enhancer/3.1.1/datanucleus-enhancer-3.1.1.pom
[INFO] Unable to find resource 'org.datanucleus:datanucleus-enhancer:pom:3.1.1' in repository mygrid-repository (http://www.mygrid.org.uk/maven/repository)
Downloading: http://www.datanucleus.org/downloads/maven2//org/datanucleus/datanucleus-enhancer/3.1.1/datanucleus-enhancer-3.1.1.pom
[INFO] Unable to find resource 'org.datanucleus:datanucleus-enhancer:pom:3.1.1' in repository DN_M2_Repo (http://www.datanucleus.org/downloads/maven2/)
Downloading: http://repo1.maven.org/maven2/org/datanucleus/datanucleus-enhancer/3.1.1/datanucleus-enhancer-3.1.1.pom
7K downloaded  (datanucleus-enhancer-3.1.1.pom)
Downloading: http://www.mygrid.org.uk/maven/repository/org/datanucleus/datanucleus-api-jdo/3.2.5/datanucleus-api-jdo-3.2.5.pom
[INFO] Unable to find resource 'org.datanucleus:datanucleus-api-jdo:pom:3.2.5' in repository mygrid-repository (http://www.mygrid.org.uk/maven/repository)
Downloading: http://www.datanucleus.org/downloads/maven2//org/datanucleus/datanucleus-api-jdo/3.2.5/datanucleus-api-jdo-3.2.5.pom
[INFO] Unable to find resource 'org.datanucleus:datanucleus-api-jdo:pom:3.2.5' in repository DN_M2_Repo (http://www.datanucleus.org/downloads/maven2/)
Downloading: http://repo1.maven.org/maven2/org/datanucleus/datanucleus-api-jdo/3.2.5/datanucleus-api-jdo-3.2.5.pom
9K downloaded  (datanucleus-api-jdo-3.2.5.pom)
Downloading: http://www.mygrid.org.uk/maven/repository/org/apache/maven/maven-artifact/3.0.4/maven-artifact-3.0.4.pom
[INFO] Unable to find resource 'org.apache.maven:maven-artifact:pom:3.0.4' in repository mygrid-repository (http://www.mygrid.org.uk/maven/repository)
Downloading: http://www.datanucleus.org/downloads/maven2//org/apache/maven/maven-artifact/3.0.4/maven-artifact-3.0.4.pom
[INFO] Unable to find resource 'org.apache.maven:maven-artifact:pom:3.0.4' in repository DN_M2_Repo (http://www.datanucleus.org/downloads/maven2/)
Downloading: http://repo1.maven.org/maven2/org/apache/maven/maven-artifact/3.0.4/maven-artifact-3.0.4.pom
1K downloaded  (maven-artifact-3.0.4.pom)
Downloading: http://www.mygrid.org.uk/maven/repository/org/apache/maven/maven/3.0.4/maven-3.0.4.pom
[INFO] Unable to find resource 'org.apache.maven:maven:pom:3.0.4' in repository mygrid-repository (http://www.mygrid.org.uk/maven/repository)
Downloading: http://www.datanucleus.org/downloads/maven2//org/apache/maven/maven/3.0.4/maven-3.0.4.pom
[INFO] Unable to find resource 'org.apache.maven:maven:pom:3.0.4' in repository DN_M2_Repo (http://www.datanucleus.org/downloads/maven2/)
Downloading: http://repo1.maven.org/maven2/org/apache/maven/maven/3.0.4/maven-3.0.4.pom
21K downloaded  (maven-3.0.4.pom)
Downloading: http://www.mygrid.org.uk/maven/repository/org/codehaus/plexus/plexus-utils/2.0.6/plexus-utils-2.0.6.pom
[INFO] Unable to find resource 'org.codehaus.plexus:plexus-utils:pom:2.0.6' in repository mygrid-repository (http://www.mygrid.org.uk/maven/repository)
Downloading: http://www.datanucleus.org/downloads/maven2//org/codehaus/plexus/plexus-utils/2.0.6/plexus-utils-2.0.6.pom
[INFO] Unable to find resource 'org.codehaus.plexus:plexus-utils:pom:2.0.6' in repository DN_M2_Repo (http://www.datanucleus.org/downloads/maven2/)
Downloading: http://www.mygrid.org.uk/maven/repository/org/codehaus/plexus/plexus-utils/2.0.6/plexus-utils-2.0.6.pom
[INFO] Unable to find resource 'org.codehaus.plexus:plexus-utils:pom:2.0.6' in repository mygrid-repository (http://www.mygrid.org.uk/maven/repository)
Downloading: http://repo2.maven.org/maven2/org/codehaus/plexus/plexus-utils/2.0.6/plexus-utils-2.0.6.pom
2K downloaded  (plexus-utils-2.0.6.pom)
Downloading: http://www.mygrid.org.uk/maven/repository/org/apache/maven/maven-plugin-api/3.0.4/maven-plugin-api-3.0.4.pom
[INFO] Unable to find resource 'org.apache.maven:maven-plugin-api:pom:3.0.4' in repository mygrid-repository (http://www.mygrid.org.uk/maven/repository)
Downloading: http://www.datanucleus.org/downloads/maven2//org/apache/maven/maven-plugin-api/3.0.4/maven-plugin-api-3.0.4.pom
[INFO] Unable to find resource 'org.apache.maven:maven-plugin-api:pom:3.0.4' in repository DN_M2_Repo (http://www.datanucleus.org/downloads/maven2/)
Downloading: http://repo1.maven.org/maven2/org/apache/maven/maven-plugin-api/3.0.4/maven-plugin-api-3.0.4.pom
2K downloaded  (maven-plugin-api-3.0.4.pom)
Downloading: http://www.mygrid.org.uk/maven/repository/org/apache/maven/maven-model/3.0.4/maven-model-3.0.4.pom
[INFO] Unable to find resource 'org.apache.maven:maven-model:pom:3.0.4' in repository mygrid-repository (http://www.mygrid.org.uk/maven/repository)
Downloading: http://www.datanucleus.org/downloads/maven2//org/apache/maven/maven-model/3.0.4/maven-model-3.0.4.pom
[INFO] Unable to find resource 'org.apache.maven:maven-model:pom:3.0.4' in repository DN_M2_Repo (http://www.datanucleus.org/downloads/maven2/)
Downloading: http://www.mygrid.org.uk/maven/repository/org/apache/maven/maven-model/3.0.4/maven-model-3.0.4.pom
[INFO] Unable to find resource 'org.apache.maven:maven-model:pom:3.0.4' in repository mygrid-repository (http://www.mygrid.org.uk/maven/repository)
Downloading: http://repo2.maven.org/maven2/org/apache/maven/maven-model/3.0.4/maven-model-3.0.4.pom
3K downloaded  (maven-model-3.0.4.pom)
Downloading: http://www.mygrid.org.uk/maven/repository/org/sonatype/sisu/sisu-inject-plexus/2.3.0/sisu-inject-plexus-2.3.0.pom
[INFO] Unable to find resource 'org.sonatype.sisu:sisu-inject-plexus:pom:2.3.0' in repository mygrid-repository (http://www.mygrid.org.uk/maven/repository)
Downloading: http://www.datanucleus.org/downloads/maven2//org/sonatype/sisu/sisu-inject-plexus/2.3.0/sisu-inject-plexus-2.3.0.pom
[INFO] Unable to find resource 'org.sonatype.sisu:sisu-inject-plexus:pom:2.3.0' in repository DN_M2_Repo (http://www.datanucleus.org/downloads/maven2/)
Downloading: http://www.mygrid.org.uk/maven/repository/org/sonatype/sisu/sisu-inject-plexus/2.3.0/sisu-inject-plexus-2.3.0.pom
[INFO] Unable to find resource 'org.sonatype.sisu:sisu-inject-plexus:pom:2.3.0' in repository mygrid-repository (http://www.mygrid.org.uk/maven/repository)
Downloading: http://repo2.maven.org/maven2/org/sonatype/sisu/sisu-inject-plexus/2.3.0/sisu-inject-plexus-2.3.0.pom
5K downloaded  (sisu-inject-plexus-2.3.0.pom)
Downloading: http://www.mygrid.org.uk/maven/repository/org/sonatype/sisu/inject/guice-plexus/2.3.0/guice-plexus-2.3.0.pom
[INFO] Unable to find resource 'org.sonatype.sisu.inject:guice-plexus:pom:2.3.0' in repository mygrid-repository (http://www.mygrid.org.uk/maven/repository)
Downloading: http://www.datanucleus.org/downloads/maven2//org/sonatype/sisu/inject/guice-plexus/2.3.0/guice-plexus-2.3.0.pom
[INFO] Unable to find resource 'org.sonatype.sisu.inject:guice-plexus:pom:2.3.0' in repository DN_M2_Repo (http://www.datanucleus.org/downloads/maven2/)
Downloading: http://www.mygrid.org.uk/maven/repository/org/sonatype/sisu/inject/guice-plexus/2.3.0/guice-plexus-2.3.0.pom
[INFO] Unable to find resource 'org.sonatype.sisu.inject:guice-plexus:pom:2.3.0' in repository mygrid-repository (http://www.mygrid.org.uk/maven/repository)
Downloading: http://repo2.maven.org/maven2/org/sonatype/sisu/inject/guice-plexus/2.3.0/guice-plexus-2.3.0.pom
3K downloaded  (guice-plexus-2.3.0.pom)
Downloading: http://www.mygrid.org.uk/maven/repository/org/sonatype/sisu/inject/guice-bean/2.3.0/guice-bean-2.3.0.pom
[INFO] Unable to find resource 'org.sonatype.sisu.inject:guice-bean:pom:2.3.0' in repository mygrid-repository (http://www.mygrid.org.uk/maven/repository)
Downloading: http://www.datanucleus.org/downloads/maven2//org/sonatype/sisu/inject/guice-bean/2.3.0/guice-bean-2.3.0.pom
[INFO] Unable to find resource 'org.sonatype.sisu.inject:guice-bean:pom:2.3.0' in repository DN_M2_Repo (http://www.datanucleus.org/downloads/maven2/)
Downloading: http://www.mygrid.org.uk/maven/repository/org/sonatype/sisu/inject/guice-bean/2.3.0/guice-bean-2.3.0.pom
[INFO] Unable to find resource 'org.sonatype.sisu.inject:guice-bean:pom:2.3.0' in repository mygrid-repository (http://www.mygrid.org.uk/maven/repository)
Downloading: http://repo2.maven.org/maven2/org/sonatype/sisu/inject/guice-bean/2.3.0/guice-bean-2.3.0.pom
2K downloaded  (guice-bean-2.3.0.pom)
Downloading: http://www.mygrid.org.uk/maven/repository/org/sonatype/sisu/inject/containers/2.3.0/containers-2.3.0.pom
[INFO] Unable to find resource 'org.sonatype.sisu.inject:containers:pom:2.3.0' in repository mygrid-repository (http://www.mygrid.org.uk/maven/repository)
Downloading: http://www.datanucleus.org/downloads/maven2//org/sonatype/sisu/inject/containers/2.3.0/containers-2.3.0.pom
[INFO] Unable to find resource 'org.sonatype.sisu.inject:containers:pom:2.3.0' in repository DN_M2_Repo (http://www.datanucleus.org/downloads/maven2/)
Downloading: http://www.mygrid.org.uk/maven/repository/org/sonatype/sisu/inject/containers/2.3.0/containers-2.3.0.pom
[INFO] Unable to find resource 'org.sonatype.sisu.inject:containers:pom:2.3.0' in repository mygrid-repository (http://www.mygrid.org.uk/maven/repository)
Downloading: http://repo2.maven.org/maven2/org/sonatype/sisu/inject/containers/2.3.0/containers-2.3.0.pom
1K downloaded  (containers-2.3.0.pom)
Downloading: http://www.mygrid.org.uk/maven/repository/org/sonatype/sisu/sisu-inject/2.3.0/sisu-inject-2.3.0.pom
[INFO] Unable to find resource 'org.sonatype.sisu:sisu-inject:pom:2.3.0' in repository mygrid-repository (http://www.mygrid.org.uk/maven/repository)
Downloading: http://www.datanucleus.org/downloads/maven2//org/sonatype/sisu/sisu-inject/2.3.0/sisu-inject-2.3.0.pom
[INFO] Unable to find resource 'org.sonatype.sisu:sisu-inject:pom:2.3.0' in repository DN_M2_Repo (http://www.datanucleus.org/downloads/maven2/)
Downloading: http://www.mygrid.org.uk/maven/repository/org/sonatype/sisu/sisu-inject/2.3.0/sisu-inject-2.3.0.pom
[INFO] Unable to find resource 'org.sonatype.sisu:sisu-inject:pom:2.3.0' in repository mygrid-repository (http://www.mygrid.org.uk/maven/repository)
Downloading: http://repo2.maven.org/maven2/org/sonatype/sisu/sisu-inject/2.3.0/sisu-inject-2.3.0.pom
3K downloaded  (sisu-inject-2.3.0.pom)
Downloading: http://www.mygrid.org.uk/maven/repository/org/sonatype/sisu/sisu-parent/2.3.0/sisu-parent-2.3.0.pom
[INFO] Unable to find resource 'org.sonatype.sisu:sisu-parent:pom:2.3.0' in repository mygrid-repository (http://www.mygrid.org.uk/maven/repository)
Downloading: http://www.datanucleus.org/downloads/maven2//org/sonatype/sisu/sisu-parent/2.3.0/sisu-parent-2.3.0.pom
[INFO] Unable to find resource 'org.sonatype.sisu:sisu-parent:pom:2.3.0' in repository DN_M2_Repo (http://www.datanucleus.org/downloads/maven2/)
Downloading: http://www.mygrid.org.uk/maven/repository/org/sonatype/sisu/sisu-parent/2.3.0/sisu-parent-2.3.0.pom
[INFO] Unable to find resource 'org.sonatype.sisu:sisu-parent:pom:2.3.0' in repository mygrid-repository (http://www.mygrid.org.uk/maven/repository)
Downloading: http://repo2.maven.org/maven2/org/sonatype/sisu/sisu-parent/2.3.0/sisu-parent-2.3.0.pom
10K downloaded  (sisu-parent-2.3.0.pom)
Downloading: http://www.mygrid.org.uk/maven/repository/org/codehaus/plexus/plexus-component-annotations/1.5.5/plexus-component-annotations-1.5.5.pom
[INFO] Unable to find resource 'org.codehaus.plexus:plexus-component-annotations:pom:1.5.5' in repository mygrid-repository (http://www.mygrid.org.uk/maven/repository)
Downloading: http://www.datanucleus.org/downloads/maven2//org/codehaus/plexus/plexus-component-annotations/1.5.5/plexus-component-annotations-1.5.5.pom
[INFO] Unable to find resource 'org.codehaus.plexus:plexus-component-annotations:pom:1.5.5' in repository DN_M2_Repo (http://www.datanucleus.org/downloads/maven2/)
Downloading: http://www.mygrid.org.uk/maven/repository/org/codehaus/plexus/plexus-component-annotations/1.5.5/plexus-component-annotations-1.5.5.pom
[INFO] Unable to find resource 'org.codehaus.plexus:plexus-component-annotations:pom:1.5.5' in repository mygrid-repository (http://www.mygrid.org.uk/maven/repository)
Downloading: http://repo2.maven.org/maven2/org/codehaus/plexus/plexus-component-annotations/1.5.5/plexus-component-annotations-1.5.5.pom
815b downloaded  (plexus-component-annotations-1.5.5.pom)
Downloading: http://www.mygrid.org.uk/maven/repository/org/codehaus/plexus/plexus-classworlds/2.4/plexus-classworlds-2.4.pom
[INFO] Unable to find resource 'org.codehaus.plexus:plexus-classworlds:pom:2.4' in repository mygrid-repository (http://www.mygrid.org.uk/maven/repository)
Downloading: http://www.datanucleus.org/downloads/maven2//org/codehaus/plexus/plexus-classworlds/2.4/plexus-classworlds-2.4.pom
[INFO] Unable to find resource 'org.codehaus.plexus:plexus-classworlds:pom:2.4' in repository DN_M2_Repo (http://www.datanucleus.org/downloads/maven2/)
Downloading: http://www.mygrid.org.uk/maven/repository/org/codehaus/plexus/plexus-classworlds/2.4/plexus-classworlds-2.4.pom
[INFO] Unable to find resource 'org.codehaus.plexus:plexus-classworlds:pom:2.4' in repository mygrid-repository (http://www.mygrid.org.uk/maven/repository)
Downloading: http://repo2.maven.org/maven2/org/codehaus/plexus/plexus-classworlds/2.4/plexus-classworlds-2.4.pom
3K downloaded  (plexus-classworlds-2.4.pom)
Downloading: http://www.mygrid.org.uk/maven/repository/org/sonatype/sisu/sisu-inject-bean/2.3.0/sisu-inject-bean-2.3.0.pom
[INFO] Unable to find resource 'org.sonatype.sisu:sisu-inject-bean:pom:2.3.0' in repository mygrid-repository (http://www.mygrid.org.uk/maven/repository)
Downloading: http://www.datanucleus.org/downloads/maven2//org/sonatype/sisu/sisu-inject-bean/2.3.0/sisu-inject-bean-2.3.0.pom
[INFO] Unable to find resource 'org.sonatype.sisu:sisu-inject-bean:pom:2.3.0' in repository DN_M2_Repo (http://www.datanucleus.org/downloads/maven2/)
Downloading: http://www.mygrid.org.uk/maven/repository/org/sonatype/sisu/sisu-inject-bean/2.3.0/sisu-inject-bean-2.3.0.pom
[INFO] Unable to find resource 'org.sonatype.sisu:sisu-inject-bean:pom:2.3.0' in repository mygrid-repository (http://www.mygrid.org.uk/maven/repository)
Downloading: http://repo2.maven.org/maven2/org/sonatype/sisu/sisu-inject-bean/2.3.0/sisu-inject-bean-2.3.0.pom
6K downloaded  (sisu-inject-bean-2.3.0.pom)
Downloading: http://www.mygrid.org.uk/maven/repository/org/sonatype/sisu/sisu-guice/3.1.0/sisu-guice-3.1.0.pom
[INFO] Unable to find resource 'org.sonatype.sisu:sisu-guice:pom:3.1.0' in repository mygrid-repository (http://www.mygrid.org.uk/maven/repository)
Downloading: http://www.datanucleus.org/downloads/maven2//org/sonatype/sisu/sisu-guice/3.1.0/sisu-guice-3.1.0.pom
[INFO] Unable to find resource 'org.sonatype.sisu:sisu-guice:pom:3.1.0' in repository DN_M2_Repo (http://www.datanucleus.org/downloads/maven2/)
Downloading: http://www.mygrid.org.uk/maven/repository/org/sonatype/sisu/sisu-guice/3.1.0/sisu-guice-3.1.0.pom
[INFO] Unable to find resource 'org.sonatype.sisu:sisu-guice:pom:3.1.0' in repository mygrid-repository (http://www.mygrid.org.uk/maven/repository)
Downloading: http://repo2.maven.org/maven2/org/sonatype/sisu/sisu-guice/3.1.0/sisu-guice-3.1.0.pom
9K downloaded  (sisu-guice-3.1.0.pom)
Downloading: http://www.mygrid.org.uk/maven/repository/org/sonatype/sisu/inject/guice-parent/3.1.0/guice-parent-3.1.0.pom
[INFO] Unable to find resource 'org.sonatype.sisu.inject:guice-parent:pom:3.1.0' in repository mygrid-repository (http://www.mygrid.org.uk/maven/repository)
Downloading: http://www.datanucleus.org/downloads/maven2//org/sonatype/sisu/inject/guice-parent/3.1.0/guice-parent-3.1.0.pom
[INFO] Unable to find resource 'org.sonatype.sisu.inject:guice-parent:pom:3.1.0' in repository DN_M2_Repo (http://www.datanucleus.org/downloads/maven2/)
Downloading: http://www.mygrid.org.uk/maven/repository/org/sonatype/sisu/inject/guice-parent/3.1.0/guice-parent-3.1.0.pom
[INFO] Unable to find resource 'org.sonatype.sisu.inject:guice-parent:pom:3.1.0' in repository mygrid-repository (http://www.mygrid.org.uk/maven/repository)
Downloading: http://repo2.maven.org/maven2/org/sonatype/sisu/inject/guice-parent/3.1.0/guice-parent-3.1.0.pom
10K downloaded  (guice-parent-3.1.0.pom)
Downloading: http://www.mygrid.org.uk/maven/repository/org/sonatype/sisu/sisu-guava/0.9.9/sisu-guava-0.9.9.pom
[INFO] Unable to find resource 'org.sonatype.sisu:sisu-guava:pom:0.9.9' in repository mygrid-repository (http://www.mygrid.org.uk/maven/repository)
Downloading: http://www.datanucleus.org/downloads/maven2//org/sonatype/sisu/sisu-guava/0.9.9/sisu-guava-0.9.9.pom
[INFO] Unable to find resource 'org.sonatype.sisu:sisu-guava:pom:0.9.9' in repository DN_M2_Repo (http://www.datanucleus.org/downloads/maven2/)
Downloading: http://www.mygrid.org.uk/maven/repository/org/sonatype/sisu/sisu-guava/0.9.9/sisu-guava-0.9.9.pom
[INFO] Unable to find resource 'org.sonatype.sisu:sisu-guava:pom:0.9.9' in repository mygrid-repository (http://www.mygrid.org.uk/maven/repository)
Downloading: http://repo2.maven.org/maven2/org/sonatype/sisu/sisu-guava/0.9.9/sisu-guava-0.9.9.pom
1K downloaded  (sisu-guava-0.9.9.pom)
Downloading: http://www.mygrid.org.uk/maven/repository/org/sonatype/sisu/inject/guava-parent/0.9.9/guava-parent-0.9.9.pom
[INFO] Unable to find resource 'org.sonatype.sisu.inject:guava-parent:pom:0.9.9' in repository mygrid-repository (http://www.mygrid.org.uk/maven/repository)
Downloading: http://www.datanucleus.org/downloads/maven2//org/sonatype/sisu/inject/guava-parent/0.9.9/guava-parent-0.9.9.pom
[INFO] Unable to find resource 'org.sonatype.sisu.inject:guava-parent:pom:0.9.9' in repository DN_M2_Repo (http://www.datanucleus.org/downloads/maven2/)
Downloading: http://www.mygrid.org.uk/maven/repository/org/sonatype/sisu/inject/guava-parent/0.9.9/guava-parent-0.9.9.pom
[INFO] Unable to find resource 'org.sonatype.sisu.inject:guava-parent:pom:0.9.9' in repository mygrid-repository (http://www.mygrid.org.uk/maven/repository)
Downloading: http://repo2.maven.org/maven2/org/sonatype/sisu/inject/guava-parent/0.9.9/guava-parent-0.9.9.pom
10K downloaded  (guava-parent-0.9.9.pom)
Downloading: http://www.mygrid.org.uk/maven/repository/org/codehaus/plexus/plexus-classworlds/2.2.2/plexus-classworlds-2.2.2.pom
[INFO] Unable to find resource 'org.codehaus.plexus:plexus-classworlds:pom:2.2.2' in repository mygrid-repository (http://www.mygrid.org.uk/maven/repository)
Downloading: http://www.datanucleus.org/downloads/maven2//org/codehaus/plexus/plexus-classworlds/2.2.2/plexus-classworlds-2.2.2.pom
[INFO] Unable to find resource 'org.codehaus.plexus:plexus-classworlds:pom:2.2.2' in repository DN_M2_Repo (http://www.datanucleus.org/downloads/maven2/)
Downloading: http://www.mygrid.org.uk/maven/repository/org/codehaus/plexus/plexus-classworlds/2.2.2/plexus-classworlds-2.2.2.pom
[INFO] Unable to find resource 'org.codehaus.plexus:plexus-classworlds:pom:2.2.2' in repository mygrid-repository (http://www.mygrid.org.uk/maven/repository)
Downloading: http://repo2.maven.org/maven2/org/codehaus/plexus/plexus-classworlds/2.2.2/plexus-classworlds-2.2.2.pom
3K downloaded  (plexus-classworlds-2.2.2.pom)
Downloading: http://www.mygrid.org.uk/maven/repository/org/apache/xbean/xbean-reflect/3.4/xbean-reflect-3.4.pom
[INFO] Unable to find resource 'org.apache.xbean:xbean-reflect:pom:3.4' in repository mygrid-repository (http://www.mygrid.org.uk/maven/repository)
Downloading: http://www.datanucleus.org/downloads/maven2//org/apache/xbean/xbean-reflect/3.4/xbean-reflect-3.4.pom
[INFO] Unable to find resource 'org.apache.xbean:xbean-reflect:pom:3.4' in repository DN_M2_Repo (http://www.datanucleus.org/downloads/maven2/)
Downloading: http://www.mygrid.org.uk/maven/repository/org/apache/xbean/xbean-reflect/3.4/xbean-reflect-3.4.pom
[INFO] Unable to find resource 'org.apache.xbean:xbean-reflect:pom:3.4' in repository mygrid-repository (http://www.mygrid.org.uk/maven/repository)
Downloading: http://repo2.maven.org/maven2/org/apache/xbean/xbean-reflect/3.4/xbean-reflect-3.4.pom
2K downloaded  (xbean-reflect-3.4.pom)
Downloading: http://www.mygrid.org.uk/maven/repository/org/apache/xbean/xbean/3.4/xbean-3.4.pom
[INFO] Unable to find resource 'org.apache.xbean:xbean:pom:3.4' in repository mygrid-repository (http://www.mygrid.org.uk/maven/repository)
Downloading: http://www.datanucleus.org/downloads/maven2//org/apache/xbean/xbean/3.4/xbean-3.4.pom
[INFO] Unable to find resource 'org.apache.xbean:xbean:pom:3.4' in repository DN_M2_Repo (http://www.datanucleus.org/downloads/maven2/)
Downloading: http://www.mygrid.org.uk/maven/repository/org/apache/xbean/xbean/3.4/xbean-3.4.pom
[INFO] Unable to find resource 'org.apache.xbean:xbean:pom:3.4' in repository mygrid-repository (http://www.mygrid.org.uk/maven/repository)
Downloading: http://repo2.maven.org/maven2/org/apache/xbean/xbean/3.4/xbean-3.4.pom
18K downloaded  (xbean-3.4.pom)
Downloading: http://www.mygrid.org.uk/maven/repository/log4j/log4j/1.2.12/log4j-1.2.12.pom
[INFO] Unable to find resource 'log4j:log4j:pom:1.2.12' in repository mygrid-repository (http://www.mygrid.org.uk/maven/repository)
Downloading: http://www.datanucleus.org/downloads/maven2//log4j/log4j/1.2.12/log4j-1.2.12.pom
[INFO] Unable to find resource 'log4j:log4j:pom:1.2.12' in repository DN_M2_Repo (http://www.datanucleus.org/downloads/maven2/)
Downloading: http://www.mygrid.org.uk/maven/repository/log4j/log4j/1.2.12/log4j-1.2.12.pom
[INFO] Unable to find resource 'log4j:log4j:pom:1.2.12' in repository mygrid-repository (http://www.mygrid.org.uk/maven/repository)
Downloading: http://repo2.maven.org/maven2/log4j/log4j/1.2.12/log4j-1.2.12.pom
145b downloaded  (log4j-1.2.12.pom)
Downloading: http://www.mygrid.org.uk/maven/repository/commons-logging/commons-logging-api/1.1/commons-logging-api-1.1.pom
[INFO] Unable to find resource 'commons-logging:commons-logging-api:pom:1.1' in repository mygrid-repository (http://www.mygrid.org.uk/maven/repository)
Downloading: http://www.datanucleus.org/downloads/maven2//commons-logging/commons-logging-api/1.1/commons-logging-api-1.1.pom
[INFO] Unable to find resource 'commons-logging:commons-logging-api:pom:1.1' in repository DN_M2_Repo (http://www.datanucleus.org/downloads/maven2/)
Downloading: http://www.mygrid.org.uk/maven/repository/commons-logging/commons-logging-api/1.1/commons-logging-api-1.1.pom
[INFO] Unable to find resource 'commons-logging:commons-logging-api:pom:1.1' in repository mygrid-repository (http://www.mygrid.org.uk/maven/repository)
Downloading: http://repo2.maven.org/maven2/commons-logging/commons-logging-api/1.1/commons-logging-api-1.1.pom
5K downloaded  (commons-logging-api-1.1.pom)
Downloading: http://www.mygrid.org.uk/maven/repository/com/google/collections/google-collections/1.0/google-collections-1.0.pom
[INFO] Unable to find resource 'com.google.collections:google-collections:pom:1.0' in repository mygrid-repository (http://www.mygrid.org.uk/maven/repository)
Downloading: http://www.datanucleus.org/downloads/maven2//com/google/collections/google-collections/1.0/google-collections-1.0.pom
[INFO] Unable to find resource 'com.google.collections:google-collections:pom:1.0' in repository DN_M2_Repo (http://www.datanucleus.org/downloads/maven2/)
Downloading: http://www.mygrid.org.uk/maven/repository/com/google/collections/google-collections/1.0/google-collections-1.0.pom
[INFO] Unable to find resource 'com.google.collections:google-collections:pom:1.0' in repository mygrid-repository (http://www.mygrid.org.uk/maven/repository)
Downloading: http://repo2.maven.org/maven2/com/google/collections/google-collections/1.0/google-collections-1.0.pom
2K downloaded  (google-collections-1.0.pom)
Downloading: http://www.mygrid.org.uk/maven/repository/com/google/google/1/google-1.pom
[INFO] Unable to find resource 'com.google:google:pom:1' in repository mygrid-repository (http://www.mygrid.org.uk/maven/repository)
Downloading: http://www.datanucleus.org/downloads/maven2//com/google/google/1/google-1.pom
[INFO] Unable to find resource 'com.google:google:pom:1' in repository DN_M2_Repo (http://www.datanucleus.org/downloads/maven2/)
Downloading: http://www.mygrid.org.uk/maven/repository/com/google/google/1/google-1.pom
[INFO] Unable to find resource 'com.google:google:pom:1' in repository mygrid-repository (http://www.mygrid.org.uk/maven/repository)
Downloading: http://repo2.maven.org/maven2/com/google/google/1/google-1.pom
1K downloaded  (google-1.pom)
Downloading: http://www.mygrid.org.uk/maven/repository/org/codehaus/plexus/plexus-utils/3.0.8/plexus-utils-3.0.8.jar
Downloading: http://www.mygrid.org.uk/maven/repository/org/ow2/asm/asm/4.0/asm-4.0.jar
[INFO] Unable to find resource 'org.ow2.asm:asm:jar:4.0' in repository mygrid-repository (http://www.mygrid.org.uk/maven/repository)
Downloading: http://www.datanucleus.org/downloads/maven2//org/ow2/asm/asm/4.0/asm-4.0.jar
Downloading: http://www.mygrid.org.uk/maven/repository/org/datanucleus/datanucleus-enhancer/3.1.1/datanucleus-enhancer-3.1.1.jar
[INFO] Unable to find resource 'org.ow2.asm:asm:jar:4.0' in repository DN_M2_Repo (http://www.datanucleus.org/downloads/maven2/)
Downloading: http://www.mygrid.org.uk/maven/repository/org/ow2/asm/asm/4.0/asm-4.0.jar
[INFO] Unable to find resource 'org.codehaus.plexus:plexus-utils:jar:3.0.8' in repository mygrid-repository (http://www.mygrid.org.uk/maven/repository)
Downloading: http://www.datanucleus.org/downloads/maven2//org/codehaus/plexus/plexus-utils/3.0.8/plexus-utils-3.0.8.jar
[INFO] Unable to find resource 'org.codehaus.plexus:plexus-utils:jar:3.0.8' in repository DN_M2_Repo (http://www.datanucleus.org/downloads/maven2/)
Downloading: http://repo1.maven.org/maven2/org/codehaus/plexus/plexus-utils/3.0.8/plexus-utils-3.0.8.jar
226K downloaded  (plexus-utils-3.0.8.jar)
[INFO] Unable to find resource 'org.datanucleus:datanucleus-enhancer:jar:3.1.1' in repository mygrid-repository (http://www.mygrid.org.uk/maven/repository)
Downloading: http://www.datanucleus.org/downloads/maven2//org/datanucleus/datanucleus-enhancer/3.1.1/datanucleus-enhancer-3.1.1.jar
[INFO] Unable to find resource 'org.datanucleus:datanucleus-enhancer:jar:3.1.1' in repository DN_M2_Repo (http://www.datanucleus.org/downloads/maven2/)
Downloading: http://repo1.maven.org/maven2/org/datanucleus/datanucleus-enhancer/3.1.1/datanucleus-enhancer-3.1.1.jar
[INFO] Unable to find resource 'org.ow2.asm:asm:jar:4.0' in repository mygrid-repository (http://www.mygrid.org.uk/maven/repository)
Downloading: http://repo2.maven.org/maven2/org/ow2/asm/asm/4.0/asm-4.0.jar
44K downloaded  (asm-4.0.jar)
188K downloaded  (datanucleus-enhancer-3.1.1.jar)
Downloading: http://www.mygrid.org.uk/maven/repository/org/datanucleus/datanucleus-api-jdo/3.2.5/datanucleus-api-jdo-3.2.5.jar
[INFO] Unable to find resource 'org.datanucleus:datanucleus-api-jdo:jar:3.2.5' in repository mygrid-repository (http://www.mygrid.org.uk/maven/repository)
Downloading: http://www.datanucleus.org/downloads/maven2//org/datanucleus/datanucleus-api-jdo/3.2.5/datanucleus-api-jdo-3.2.5.jar
[INFO] Unable to find resource 'org.datanucleus:datanucleus-api-jdo:jar:3.2.5' in repository DN_M2_Repo (http://www.datanucleus.org/downloads/maven2/)
Downloading: http://repo1.maven.org/maven2/org/datanucleus/datanucleus-api-jdo/3.2.5/datanucleus-api-jdo-3.2.5.jar
331K downloaded  (datanucleus-api-jdo-3.2.5.jar)
[INFO] [datanucleus:enhance {execution: enhance}]
[INFO]   CP: /local/jenkins/.m2/repository/org/datanucleus/datanucleus-core/3.2.10/datanucleus-core-3.2.10.jar
[INFO]   CP: /local/jenkins/.m2/repository/org/datanucleus/datanucleus-enhancer/3.1.1/datanucleus-enhancer-3.1.1.jar
[INFO]   CP: /local/jenkins/.m2/repository/org/ow2/asm/asm/4.0/asm-4.0.jar
[INFO]   CP: /local/jenkins/.m2/repository/org/datanucleus/datanucleus-api-jdo/3.2.5/datanucleus-api-jdo-3.2.5.jar
[INFO]   CP: /local/jenkins/.m2/repository/javax/jdo/jdo-api/3.0.1/jdo-api-3.0.1.jar
[INFO]   CP: /local/jenkins/.m2/repository/javax/transaction/jta/1.1/jta-1.1.jar
[INFO]   CP: /local/jenkins/.m2/repository/org/codehaus/plexus/plexus-utils/3.0.8/plexus-utils-3.0.8.jar
[INFO]   CP: /local/jenkins/tools/hudson.tasks.Maven_MavenInstallation/maven/lib/maven-2.2.1-uber.jar
[INFO]   CP: /local/jenkins/jobs/taverna-server-2.5.4/workspace/server-webapp/target/classes
[INFO]   CP: /local/jenkins/.m2/repository/org/apache/cxf/cxf-rt-frontend-jaxws/2.7.7/cxf-rt-frontend-jaxws-2.7.7.jar
[INFO]   CP: /local/jenkins/.m2/repository/xml-resolver/xml-resolver/1.2/xml-resolver-1.2.jar
[INFO]   CP: /local/jenkins/.m2/repository/org/apache/cxf/cxf-api/2.7.7/cxf-api-2.7.7.jar
[INFO]   CP: /local/jenkins/.m2/repository/org/apache/ws/xmlschema/xmlschema-core/2.0.3/xmlschema-core-2.0.3.jar
[INFO]   CP: /local/jenkins/.m2/repository/org/apache/geronimo/specs/geronimo-javamail_1.4_spec/1.7.1/geronimo-javamail_1.4_spec-1.7.1.jar
[INFO]   CP: /local/jenkins/.m2/repository/wsdl4j/wsdl4j/1.6.3/wsdl4j-1.6.3.jar
[INFO]   CP: /local/jenkins/.m2/repository/org/apache/cxf/cxf-rt-core/2.7.7/cxf-rt-core-2.7.7.jar
[INFO]   CP: /local/jenkins/.m2/repository/org/apache/cxf/cxf-rt-bindings-soap/2.7.7/cxf-rt-bindings-soap-2.7.7.jar
[INFO]   CP: /local/jenkins/.m2/repository/org/apache/cxf/cxf-rt-databinding-jaxb/2.7.7/cxf-rt-databinding-jaxb-2.7.7.jar
[INFO]   CP: /local/jenkins/.m2/repository/org/apache/cxf/cxf-rt-bindings-xml/2.7.7/cxf-rt-bindings-xml-2.7.7.jar
[INFO]   CP: /local/jenkins/.m2/repository/org/apache/cxf/cxf-rt-frontend-simple/2.7.7/cxf-rt-frontend-simple-2.7.7.jar
[INFO]   CP: /local/jenkins/.m2/repository/org/apache/cxf/cxf-rt-transports-http/2.7.7/cxf-rt-transports-http-2.7.7.jar
[INFO]   CP: /local/jenkins/.m2/repository/org/apache/cxf/cxf-rt-ws-addr/2.7.7/cxf-rt-ws-addr-2.7.7.jar
[INFO]   CP: /local/jenkins/.m2/repository/org/apache/cxf/cxf-rt-ws-policy/2.7.7/cxf-rt-ws-policy-2.7.7.jar
[INFO]   CP: /local/jenkins/.m2/repository/org/apache/neethi/neethi/3.0.2/neethi-3.0.2.jar
[INFO]   CP: /local/jenkins/.m2/repository/org/apache/cxf/cxf-rt-frontend-jaxrs/2.7.7/cxf-rt-frontend-jaxrs-2.7.7.jar
[INFO]   CP: /local/jenkins/.m2/repository/javax/ws/rs/javax.ws.rs-api/2.0-m10/javax.ws.rs-api-2.0-m10.jar
[INFO]   CP: /local/jenkins/.m2/repository/commons-logging/commons-logging/1.1.3/commons-logging-1.1.3.jar
[INFO]   CP: /local/jenkins/.m2/repository/commons-io/commons-io/2.3/commons-io-2.3.jar
[INFO]   CP: /local/jenkins/.m2/repository/aopalliance/aopalliance/1.0/aopalliance-1.0.jar
[INFO]   CP: /local/jenkins/.m2/repository/org/springframework/spring-beans/3.2.5.RELEASE/spring-beans-3.2.5.RELEASE.jar
[INFO]   CP: /local/jenkins/.m2/repository/org/springframework/spring-core/3.2.5.RELEASE/spring-core-3.2.5.RELEASE.jar
[INFO]   CP: /local/jenkins/.m2/repository/org/springframework/security/spring-security-core/3.1.4.RELEASE/spring-security-core-3.1.4.RELEASE.jar
[INFO]   CP: /local/jenkins/.m2/repository/org/springframework/spring-context/3.2.5.RELEASE/spring-context-3.2.5.RELEASE.jar
[INFO]   CP: /local/jenkins/.m2/repository/org/springframework/spring-expression/3.2.5.RELEASE/spring-expression-3.2.5.RELEASE.jar
[INFO]   CP: /local/jenkins/.m2/repository/org/springframework/security/spring-security-web/3.1.4.RELEASE/spring-security-web-3.1.4.RELEASE.jar
[INFO]   CP: /local/jenkins/.m2/repository/org/springframework/spring-jdbc/3.2.5.RELEASE/spring-jdbc-3.2.5.RELEASE.jar
[INFO]   CP: /local/jenkins/.m2/repository/org/springframework/spring-tx/3.2.5.RELEASE/spring-tx-3.2.5.RELEASE.jar
[INFO]   CP: /local/jenkins/.m2/repository/org/springframework/spring-web/3.2.5.RELEASE/spring-web-3.2.5.RELEASE.jar
[INFO]   CP: /local/jenkins/.m2/repository/org/springframework/security/spring-security-config/3.1.4.RELEASE/spring-security-config-3.1.4.RELEASE.jar
[INFO]   CP: /local/jenkins/jobs/taverna-server-2.5.4/workspace/server-port-description/target/server-port-description-2.5.4.jar
[INFO]   CP: /local/jenkins/.m2/repository/com/google/code/findbugs/jsr305/1.3.7/jsr305-1.3.7.jar
[INFO]   CP: /local/jenkins/jobs/taverna-server-2.5.4/workspace/server-runinterface/target/server-runinterface-2.5.4.jar
[INFO]   CP: /local/jenkins/jobs/taverna-server-2.5.4/workspace/server-usagerecord/target/server-usagerecord-2.5.4.jar
[INFO]   CP: /local/jenkins/jobs/taverna-server-2.5.4/workspace/server-worker/target/server-worker-2.5.4-jar-with-dependencies.jar
[INFO]   CP: /local/jenkins/.m2/repository/commons-collections/commons-collections/3.2.1/commons-collections-3.2.1.jar
[INFO]   CP: /local/jenkins/jobs/taverna-server-2.5.4/workspace/server-unix-forker/target/server-unix-forker-2.5.4-jar-with-dependencies.jar
[INFO]   CP: /local/jenkins/jobs/taverna-server-2.5.4/workspace/server-rmidaemon/target/server-rmidaemon-2.5.4-jar-with-dependencies.jar
[INFO]   CP: /local/jenkins/.m2/repository/javax/servlet/servlet-api/2.5/servlet-api-2.5.jar
[INFO]   CP: /local/jenkins/.m2/repository/commons-dbcp/commons-dbcp/1.4/commons-dbcp-1.4.jar
[INFO]   CP: /local/jenkins/.m2/repository/commons-pool/commons-pool/1.5.4/commons-pool-1.5.4.jar
[INFO]   CP: /local/jenkins/.m2/repository/org/datanucleus/datanucleus-rdbms/3.2.12/datanucleus-rdbms-3.2.12.jar
[INFO]   CP: /local/jenkins/.m2/repository/org/apache/jdo/jdo2-core/2.0/jdo2-core-2.0.jar
[INFO]   CP: /local/jenkins/.m2/repository/joda-time/joda-time/2.3/joda-time-2.3.jar
[INFO]   CP: /local/jenkins/.m2/repository/net/sf/mime-util/mime-util/1.2/mime-util-1.2.jar
[INFO]   CP: /local/jenkins/.m2/repository/org/twitter4j/twitter4j-core/4.0.1/twitter4j-core-4.0.1.jar
[INFO]   CP: /local/jenkins/.m2/repository/org/aspectj/aspectjrt/1.7.4/aspectjrt-1.7.4.jar
[INFO]   CP: /local/jenkins/.m2/repository/org/igniterealtime/smack/smack/3.2.1/smack-3.2.1.jar
[INFO]   CP: /local/jenkins/.m2/repository/org/apache/httpcomponents/httpclient/4.3.1/httpclient-4.3.1.jar
[INFO]   CP: /local/jenkins/.m2/repository/org/apache/httpcomponents/httpcore/4.3/httpcore-4.3.jar
[INFO]   CP: /local/jenkins/.m2/repository/commons-codec/commons-codec/1.8/commons-codec-1.8.jar
[INFO]   CP: /local/jenkins/.m2/repository/javax/annotation/jsr250-api/1.0/jsr250-api-1.0.jar
[INFO]   CP: /local/jenkins/.m2/repository/org/apache/abdera/abdera-core/1.1.3/abdera-core-1.1.3.jar
[INFO]   CP: /local/jenkins/.m2/repository/org/apache/abdera/abdera-i18n/1.1.3/abdera-i18n-1.1.3.jar
[INFO]   CP: /local/jenkins/.m2/repository/org/apache/geronimo/specs/geronimo-activation_1.1_spec/1.1/geronimo-activation_1.1_spec-1.1.jar
[INFO]   CP: /local/jenkins/.m2/repository/org/apache/geronimo/specs/geronimo-stax-api_1.0_spec/1.0.1/geronimo-stax-api_1.0_spec-1.0.1.jar
[INFO]   CP: /local/jenkins/.m2/repository/org/bouncycastle/bcprov-jdk15on/1.49/bcprov-jdk15on-1.49.jar
[INFO]   CP: /local/jenkins/.m2/repository/org/springframework/spring-context-support/3.2.5.RELEASE/spring-context-support-3.2.5.RELEASE.jar
[INFO]   CP: /local/jenkins/.m2/repository/org/apache/velocity/velocity/1.7/velocity-1.7.jar
[INFO]   CP: /local/jenkins/.m2/repository/commons-lang/commons-lang/2.6/commons-lang-2.6.jar
[INFO]   CP: /local/jenkins/.m2/repository/org/apache/cxf/cxf-rt-rs-extension-providers/2.7.7/cxf-rt-rs-extension-providers-2.7.7.jar
May 07, 2014 9:28:04 AM org.datanucleus.plugin.NonManagedPluginRegistry registerExtensions
WARNING: Extension Point "org.datanucleus.implementation_creator" not registered, but plugin "org.datanucleus.enhancer" defined in file:/local/jenkins/.m2/repository/org/datanucleus/datanucleus-enhancer/3.1.1/datanucleus-enhancer-3.1.1.jar refers to it.
May 07, 2014 9:28:05 AM org.datanucleus.enhancer.DataNucleusEnhancer main
INFO: DataNucleus Enhancer (version 3.2.10) for API "JDO" using JRE "1.7"
DataNucleus Enhancer (version 3.2.10) for API "JDO" using JRE "1.7"
DataNucleus Enhancer : Classpath
>>  /local/jenkins/plugins/maven-plugin/WEB-INF/lib/maven-agent-1.5.jar
>>  /local/jenkins/tools/hudson.tasks.Maven_MavenInstallation/maven/boot/classworlds-1.1.jar
May 07, 2014 9:28:05 AM org.datanucleus.enhancer.AbstractClassEnhancer save
INFO: Writing class file "/local/jenkins/jobs/taverna-server-2.5.4/workspace/server-webapp/target/classes/org/taverna/server/master/usage/UsageRecord.class" with enhanced definition
May 07, 2014 9:28:05 AM org.datanucleus.enhancer.DataNucleusEnhancer addMessage
INFO: ENHANCED (PersistenceCapable) : org.taverna.server.master.usage.UsageRecord
ENHANCED (PersistenceCapable) : org.taverna.server.master.usage.UsageRecord
May 07, 2014 9:28:05 AM org.datanucleus.enhancer.AbstractClassEnhancer save
INFO: Writing class file "/local/jenkins/jobs/taverna-server-2.5.4/workspace/server-webapp/target/classes/org/taverna/server/master/ManagementState.class" with enhanced definition
May 07, 2014 9:28:05 AM org.datanucleus.enhancer.DataNucleusEnhancer addMessage
INFO: ENHANCED (PersistenceAware) : org.taverna.server.master.ManagementState
ENHANCED (PersistenceAware) : org.taverna.server.master.ManagementState
May 07, 2014 9:28:05 AM org.datanucleus.enhancer.AbstractClassEnhancer save
INFO: Writing class file "/local/jenkins/jobs/taverna-server-2.5.4/workspace/server-webapp/target/classes/org/taverna/server/master/identity/User.class" with enhanced definition
May 07, 2014 9:28:05 AM org.datanucleus.enhancer.DataNucleusEnhancer addMessage
INFO: ENHANCED (PersistenceCapable) : org.taverna.server.master.identity.User
ENHANCED (PersistenceCapable) : org.taverna.server.master.identity.User
May 07, 2014 9:28:05 AM org.datanucleus.enhancer.AbstractClassEnhancer save
INFO: Writing class file "/local/jenkins/jobs/taverna-server-2.5.4/workspace/server-webapp/target/classes/org/taverna/server/master/identity/UserStore.class" with enhanced definition
May 07, 2014 9:28:05 AM org.datanucleus.enhancer.DataNucleusEnhancer addMessage
INFO: ENHANCED (PersistenceAware) : org.taverna.server.master.identity.UserStore
ENHANCED (PersistenceAware) : org.taverna.server.master.identity.UserStore
May 07, 2014 9:28:06 AM org.datanucleus.enhancer.AbstractClassEnhancer save
INFO: Writing class file "/local/jenkins/jobs/taverna-server-2.5.4/workspace/server-webapp/target/classes/org/taverna/server/master/localworker/PersistedState.class" with enhanced definition
May 07, 2014 9:28:06 AM org.datanucleus.enhancer.DataNucleusEnhancer addMessage
INFO: ENHANCED (PersistenceCapable) : org.taverna.server.master.localworker.PersistedState
ENHANCED (PersistenceCapable) : org.taverna.server.master.localworker.PersistedState
May 07, 2014 9:28:06 AM org.datanucleus.enhancer.AbstractClassEnhancer save
INFO: Writing class file "/local/jenkins/jobs/taverna-server-2.5.4/workspace/server-webapp/target/classes/org/taverna/server/master/localworker/LocalWorkerState.class" with enhanced definition
May 07, 2014 9:28:06 AM org.datanucleus.enhancer.DataNucleusEnhancer addMessage
INFO: ENHANCED (PersistenceAware) : org.taverna.server.master.localworker.LocalWorkerState
ENHANCED (PersistenceAware) : org.taverna.server.master.localworker.LocalWorkerState
May 07, 2014 9:28:06 AM org.datanucleus.enhancer.AbstractClassEnhancer save
INFO: Writing class file "/local/jenkins/jobs/taverna-server-2.5.4/workspace/server-webapp/target/classes/org/taverna/server/master/notification/atom/Event.class" with enhanced definition
May 07, 2014 9:28:06 AM org.datanucleus.enhancer.DataNucleusEnhancer addMessage
INFO: ENHANCED (PersistenceCapable) : org.taverna.server.master.notification.atom.Event
ENHANCED (PersistenceCapable) : org.taverna.server.master.notification.atom.Event
May 07, 2014 9:28:06 AM org.datanucleus.enhancer.AbstractClassEnhancer save
INFO: Writing class file "/local/jenkins/jobs/taverna-server-2.5.4/workspace/server-webapp/target/classes/org/taverna/server/master/notification/atom/EventDAO.class" with enhanced definition
May 07, 2014 9:28:06 AM org.datanucleus.enhancer.DataNucleusEnhancer addMessage
INFO: ENHANCED (PersistenceAware) : org.taverna.server.master.notification.atom.EventDAO
ENHANCED (PersistenceAware) : org.taverna.server.master.notification.atom.EventDAO
May 07, 2014 9:28:06 AM org.datanucleus.enhancer.AbstractClassEnhancer save
INFO: Writing class file "/local/jenkins/jobs/taverna-server-2.5.4/workspace/server-webapp/target/classes/org/taverna/server/master/worker/RunConnection.class" with enhanced definition
May 07, 2014 9:28:06 AM org.datanucleus.enhancer.DataNucleusEnhancer addMessage
INFO: ENHANCED (PersistenceCapable) : org.taverna.server.master.worker.RunConnection
ENHANCED (PersistenceCapable) : org.taverna.server.master.worker.RunConnection
May 07, 2014 9:28:06 AM org.datanucleus.enhancer.AbstractClassEnhancer save
INFO: Writing class file "/local/jenkins/jobs/taverna-server-2.5.4/workspace/server-webapp/target/classes/org/taverna/server/master/worker/RunDatabaseDAO.class" with enhanced definition
May 07, 2014 9:28:06 AM org.datanucleus.enhancer.DataNucleusEnhancer addMessage
INFO: ENHANCED (PersistenceAware) : org.taverna.server.master.worker.RunDatabaseDAO
ENHANCED (PersistenceAware) : org.taverna.server.master.worker.RunDatabaseDAO
May 07, 2014 9:28:06 AM org.datanucleus.enhancer.AbstractClassEnhancer save
INFO: Writing class file "/local/jenkins/jobs/taverna-server-2.5.4/workspace/server-webapp/target/classes/org/taverna/server/master/WebappState.class" with enhanced definition
May 07, 2014 9:28:06 AM org.datanucleus.enhancer.DataNucleusEnhancer addMessage
INFO: ENHANCED (PersistenceCapable) : org.taverna.server.master.WebappState
ENHANCED (PersistenceCapable) : org.taverna.server.master.WebappState
May 07, 2014 9:28:06 AM org.datanucleus.enhancer.DataNucleusEnhancer addMessage
INFO: DataNucleus Enhancer completed with success for 11 classes. Timings : input=577 ms, enhance=181 ms, total=758 ms. Consult the log for full details
DataNucleus Enhancer completed with success for 11 classes. Timings : input=577 ms, enhance=181 ms, total=758 ms. Consult the log for full details
[INFO] [resources:testResources {execution: default-testResources}]
[INFO] Using 'US-ASCII' encoding to copy filtered resources.
[INFO] Copying 2 resources
Downloading: http://www.mygrid.org.uk/maven/repository/org/aspectj/aspectjweaver/1.7.4/aspectjweaver-1.7.4.jar
Downloading: http://www.mygrid.org.uk/maven/repository/org/springframework/spring-aop/3.2.5.RELEASE/spring-aop-3.2.5.RELEASE.jar
[INFO] Unable to find resource 'org.aspectj:aspectjweaver:jar:1.7.4' in repository mygrid-repository (http://www.mygrid.org.uk/maven/repository)
Downloading: http://repo2.maven.org/maven2/org/aspectj/aspectjweaver/1.7.4/aspectjweaver-1.7.4.jar
[INFO] Unable to find resource 'org.springframework:spring-aop:jar:3.2.5.RELEASE' in repository mygrid-repository (http://www.mygrid.org.uk/maven/repository)
Downloading: http://repo2.maven.org/maven2/org/springframework/spring-aop/3.2.5.RELEASE/spring-aop-3.2.5.RELEASE.jar
Downloading: http://www.mygrid.org.uk/maven/repository/stax/stax-api/1.0.1/stax-api-1.0.1.jar
Downloading: http://www.mygrid.org.uk/maven/repository/org/apache/derby/derby/10.10.1.1/derby-10.10.1.1.jar
Downloading: http://www.mygrid.org.uk/maven/repository/org/codehaus/jettison/jettison/1.3.4/jettison-1.3.4.jar
[INFO] Unable to find resource 'org.codehaus.jettison:jettison:jar:1.3.4' in repository mygrid-repository (http://www.mygrid.org.uk/maven/repository)
Downloading: http://repo2.maven.org/maven2/org/codehaus/jettison/jettison/1.3.4/jettison-1.3.4.jar
[INFO] Unable to find resource 'stax:stax-api:jar:1.0.1' in repository mygrid-repository (http://www.mygrid.org.uk/maven/repository)
Downloading: http://repo2.maven.org/maven2/stax/stax-api/1.0.1/stax-api-1.0.1.jar
[INFO] Unable to find resource 'org.apache.derby:derby:jar:10.10.1.1' in repository mygrid-repository (http://www.mygrid.org.uk/maven/repository)
Downloading: http://repo2.maven.org/maven2/org/apache/derby/derby/10.10.1.1/derby-10.10.1.1.jar
25K downloaded  (stax-api-1.0.1.jar)
79K downloaded  (jettison-1.3.4.jar)
Downloading: http://www.mygrid.org.uk/maven/repository/org/apache/james/apache-mime4j-core/0.7.2/apache-mime4j-core-0.7.2.jar
[INFO] Unable to find resource 'org.apache.james:apache-mime4j-core:jar:0.7.2' in repository mygrid-repository (http://www.mygrid.org.uk/maven/repository)
Downloading: http://repo2.maven.org/maven2/org/apache/james/apache-mime4j-core/0.7.2/apache-mime4j-core-0.7.2.jar
Downloading: http://www.mygrid.org.uk/maven/repository/org/codehaus/woodstox/woodstox-core-asl/4.2.0/woodstox-core-asl-4.2.0.jar
[INFO] Unable to find resource 'org.codehaus.woodstox:woodstox-core-asl:jar:4.2.0' in repository mygrid-repository (http://www.mygrid.org.uk/maven/repository)
Downloading: http://repo2.maven.org/maven2/org/codehaus/woodstox/woodstox-core-asl/4.2.0/woodstox-core-asl-4.2.0.jar
93K downloaded  (apache-mime4j-core-0.7.2.jar)
327K downloaded  (spring-aop-3.2.5.RELEASE.jar)
Downloading: http://repo1.maven.org/maven2/org/datanucleus/datanucleus-api-jdo/3.2.8/datanucleus-api-jdo-3.2.8.jar
Downloading: http://www.mygrid.org.uk/maven/repository/org/apache/ws/commons/axiom/axiom-api/1.2.14/axiom-api-1.2.14.jar
[INFO] Unable to find resource 'org.apache.ws.commons.axiom:axiom-api:jar:1.2.14' in repository mygrid-repository (http://www.mygrid.org.uk/maven/repository)
Downloading: http://repo2.maven.org/maven2/org/apache/ws/commons/axiom/axiom-api/1.2.14/axiom-api-1.2.14.jar
470K downloaded  (woodstox-core-asl-4.2.0.jar)
Downloading: http://www.mygrid.org.uk/maven/repository/jaxen/jaxen/1.1.4/jaxen-1.1.4.jar
[INFO] Unable to find resource 'jaxen:jaxen:jar:1.1.4' in repository mygrid-repository (http://www.mygrid.org.uk/maven/repository)
Downloading: http://repo2.maven.org/maven2/jaxen/jaxen/1.1.4/jaxen-1.1.4.jar
411K downloaded  (axiom-api-1.2.14.jar)
220K downloaded  (jaxen-1.1.4.jar)
Downloading: http://www.mygrid.org.uk/maven/repository/org/apache/ws/commons/axiom/axiom-impl/1.2.14/axiom-impl-1.2.14.jar
Downloading: http://www.mygrid.org.uk/maven/repository/cglib/cglib/3.0/cglib-3.0.jar
[INFO] Unable to find resource 'org.apache.ws.commons.axiom:axiom-impl:jar:1.2.14' in repository mygrid-repository (http://www.mygrid.org.uk/maven/repository)
Downloading: http://repo2.maven.org/maven2/org/apache/ws/commons/axiom/axiom-impl/1.2.14/axiom-impl-1.2.14.jar
[INFO] Unable to find resource 'cglib:cglib:jar:3.0' in repository mygrid-repository (http://www.mygrid.org.uk/maven/repository)
Downloading: http://repo2.maven.org/maven2/cglib/cglib/3.0/cglib-3.0.jar
166K downloaded  (axiom-impl-1.2.14.jar)
Downloading: http://www.mygrid.org.uk/maven/repository/org/apache/abdera/abdera-parser/1.1.3/abdera-parser-1.1.3.jar
[INFO] Unable to find resource 'org.apache.abdera:abdera-parser:jar:1.1.3' in repository mygrid-repository (http://www.mygrid.org.uk/maven/repository)
Downloading: http://repo2.maven.org/maven2/org/apache/abdera/abdera-parser/1.1.3/abdera-parser-1.1.3.jar
2764K downloaded  (derby-10.10.1.1.jar)
Downloading: http://www.mygrid.org.uk/maven/repository/org/springframework/spring-test/3.2.5.RELEASE/spring-test-3.2.5.RELEASE.jar
[INFO] Unable to find resource 'org.springframework:spring-test:jar:3.2.5.RELEASE' in repository mygrid-repository (http://www.mygrid.org.uk/maven/repository)
Downloading: http://repo2.maven.org/maven2/org/springframework/spring-test/3.2.5.RELEASE/spring-test-3.2.5.RELEASE.jar
276K downloaded  (cglib-3.0.jar)
341K downloaded  (datanucleus-api-jdo-3.2.8.jar)
1807K downloaded  (aspectjweaver-1.7.4.jar)
446K downloaded  (spring-test-3.2.5.RELEASE.jar)
1346K downloaded  (abdera-parser-1.1.3.jar)
[INFO] [compiler:testCompile {execution: default-testCompile}]
[INFO] Compiling 8 source files to /local/jenkins/jobs/taverna-server-2.5.4/workspace/server-webapp/target/test-classes
[WARNING] DEPRECATED [systemProperties]: Use systemPropertyVariables instead.
[INFO] [surefire:test {execution: default-test}]
[INFO] Surefire report directory: /local/jenkins/jobs/taverna-server-2.5.4/workspace/server-webapp/target/surefire-reports

-------------------------------------------------------
 T E S T S
-------------------------------------------------------
Running org.taverna.server.master.TavernaServerImplTest
Tests run: 7, Failures: 0, Errors: 0, Skipped: 0, Time elapsed: 0.8 sec
Running org.taverna.server.master.WorkflowSerializationTest
Tests run: 1, Failures: 0, Errors: 0, Skipped: 0, Time elapsed: 0.341 sec
Running org.taverna.server.master.JaxbSanityTest
Tests run: 38, Failures: 0, Errors: 0, Skipped: 0, Time elapsed: 1.494 sec

Results :

Tests run: 46, Failures: 0, Errors: 0, Skipped: 0

[JENKINS] Recording test results
Downloading: http://www.mygrid.org.uk/maven/repository/org/codehaus/plexus/plexus-archiver/2.3/plexus-archiver-2.3.pom
[INFO] Unable to find resource 'org.codehaus.plexus:plexus-archiver:pom:2.3' in repository mygrid-repository (http://www.mygrid.org.uk/maven/repository)
Downloading: http://repo1.maven.org/maven2/org/codehaus/plexus/plexus-archiver/2.3/plexus-archiver-2.3.pom
3K downloaded  (plexus-archiver-2.3.pom)
Downloading: http://www.mygrid.org.uk/maven/repository/org/codehaus/plexus/plexus-components/1.3/plexus-components-1.3.pom
[INFO] Unable to find resource 'org.codehaus.plexus:plexus-components:pom:1.3' in repository mygrid-repository (http://www.mygrid.org.uk/maven/repository)
Downloading: http://repo1.maven.org/maven2/org/codehaus/plexus/plexus-components/1.3/plexus-components-1.3.pom
2K downloaded  (plexus-components-1.3.pom)
Downloading: http://www.mygrid.org.uk/maven/repository/org/codehaus/plexus/plexus/3.3/plexus-3.3.pom
[INFO] Unable to find resource 'org.codehaus.plexus:plexus:pom:3.3' in repository mygrid-repository (http://www.mygrid.org.uk/maven/repository)
Downloading: http://repo1.maven.org/maven2/org/codehaus/plexus/plexus/3.3/plexus-3.3.pom
19K downloaded  (plexus-3.3.pom)
Downloading: http://www.mygrid.org.uk/maven/repository/org/codehaus/plexus/plexus-utils/3.0.10/plexus-utils-3.0.10.pom
[INFO] Unable to find resource 'org.codehaus.plexus:plexus-utils:pom:3.0.10' in repository mygrid-repository (http://www.mygrid.org.uk/maven/repository)
Downloading: http://www.mygrid.org.uk/maven/repository/org/codehaus/plexus/plexus-utils/3.0.10/plexus-utils-3.0.10.pom
[INFO] Unable to find resource 'org.codehaus.plexus:plexus-utils:pom:3.0.10' in repository mygrid-repository (http://www.mygrid.org.uk/maven/repository)
Downloading: http://repo2.maven.org/maven2/org/codehaus/plexus/plexus-utils/3.0.10/plexus-utils-3.0.10.pom
3K downloaded  (plexus-utils-3.0.10.pom)
Downloading: http://www.mygrid.org.uk/maven/repository/org/codehaus/plexus/plexus-utils/3.0.9/plexus-utils-3.0.9.pom
[INFO] Unable to find resource 'org.codehaus.plexus:plexus-utils:pom:3.0.9' in repository mygrid-repository (http://www.mygrid.org.uk/maven/repository)
Downloading: http://repo1.maven.org/maven2/org/codehaus/plexus/plexus-utils/3.0.9/plexus-utils-3.0.9.pom
3K downloaded  (plexus-utils-3.0.9.pom)
Downloading: http://www.mygrid.org.uk/maven/repository/org/apache/maven/shared/maven-dependency-analyzer/1.4/maven-dependency-analyzer-1.4.pom
[INFO] Unable to find resource 'org.apache.maven.shared:maven-dependency-analyzer:pom:1.4' in repository mygrid-repository (http://www.mygrid.org.uk/maven/repository)
Downloading: http://repo1.maven.org/maven2/org/apache/maven/shared/maven-dependency-analyzer/1.4/maven-dependency-analyzer-1.4.pom
5K downloaded  (maven-dependency-analyzer-1.4.pom)
Downloading: http://www.mygrid.org.uk/maven/repository/org/apache/maven/shared/maven-shared-components/19/maven-shared-components-19.pom
[INFO] Unable to find resource 'org.apache.maven.shared:maven-shared-components:pom:19' in repository mygrid-repository (http://www.mygrid.org.uk/maven/repository)
Downloading: http://repo1.maven.org/maven2/org/apache/maven/shared/maven-shared-components/19/maven-shared-components-19.pom
6K downloaded  (maven-shared-components-19.pom)
Downloading: http://www.mygrid.org.uk/maven/repository/org/apache/maven/shared/maven-dependency-tree/2.1/maven-dependency-tree-2.1.pom
[INFO] Unable to find resource 'org.apache.maven.shared:maven-dependency-tree:pom:2.1' in repository mygrid-repository (http://www.mygrid.org.uk/maven/repository)
Downloading: http://repo1.maven.org/maven2/org/apache/maven/shared/maven-dependency-tree/2.1/maven-dependency-tree-2.1.pom
6K downloaded  (maven-dependency-tree-2.1.pom)
Downloading: http://www.mygrid.org.uk/maven/repository/org/apache/maven/maven-project/2.2.0/maven-project-2.2.0.pom
[INFO] Unable to find resource 'org.apache.maven:maven-project:pom:2.2.0' in repository mygrid-repository (http://www.mygrid.org.uk/maven/repository)
Downloading: http://www.mygrid.org.uk/maven/repository/org/apache/maven/maven-project/2.2.0/maven-project-2.2.0.pom
[INFO] Unable to find resource 'org.apache.maven:maven-project:pom:2.2.0' in repository mygrid-repository (http://www.mygrid.org.uk/maven/repository)
Downloading: http://repo2.maven.org/maven2/org/apache/maven/maven-project/2.2.0/maven-project-2.2.0.pom
2K downloaded  (maven-project-2.2.0.pom)
Downloading: http://www.mygrid.org.uk/maven/repository/org/apache/maven/maven/2.2.0/maven-2.2.0.pom
[INFO] Unable to find resource 'org.apache.maven:maven:pom:2.2.0' in repository mygrid-repository (http://www.mygrid.org.uk/maven/repository)
Downloading: http://www.mygrid.org.uk/maven/repository/org/apache/maven/maven/2.2.0/maven-2.2.0.pom
[INFO] Unable to find resource 'org.apache.maven:maven:pom:2.2.0' in repository mygrid-repository (http://www.mygrid.org.uk/maven/repository)
Downloading: http://repo2.maven.org/maven2/org/apache/maven/maven/2.2.0/maven-2.2.0.pom
21K downloaded  (maven-2.2.0.pom)
Downloading: http://www.mygrid.org.uk/maven/repository/org/eclipse/aether/aether-util/0.9.0.M2/aether-util-0.9.0.M2.pom
[INFO] Unable to find resource 'org.eclipse.aether:aether-util:pom:0.9.0.M2' in repository mygrid-repository (http://www.mygrid.org.uk/maven/repository)
Downloading: http://www.mygrid.org.uk/maven/repository/org/eclipse/aether/aether-util/0.9.0.M2/aether-util-0.9.0.M2.pom
[INFO] Unable to find resource 'org.eclipse.aether:aether-util:pom:0.9.0.M2' in repository mygrid-repository (http://www.mygrid.org.uk/maven/repository)
Downloading: http://repo2.maven.org/maven2/org/eclipse/aether/aether-util/0.9.0.M2/aether-util-0.9.0.M2.pom
1K downloaded  (aether-util-0.9.0.M2.pom)
Downloading: http://www.mygrid.org.uk/maven/repository/org/eclipse/aether/aether/0.9.0.M2/aether-0.9.0.M2.pom
[INFO] Unable to find resource 'org.eclipse.aether:aether:pom:0.9.0.M2' in repository mygrid-repository (http://www.mygrid.org.uk/maven/repository)
Downloading: http://www.mygrid.org.uk/maven/repository/org/eclipse/aether/aether/0.9.0.M2/aether-0.9.0.M2.pom
[INFO] Unable to find resource 'org.eclipse.aether:aether:pom:0.9.0.M2' in repository mygrid-repository (http://www.mygrid.org.uk/maven/repository)
Downloading: http://repo2.maven.org/maven2/org/eclipse/aether/aether/0.9.0.M2/aether-0.9.0.M2.pom
27K downloaded  (aether-0.9.0.M2.pom)
Downloading: http://www.mygrid.org.uk/maven/repository/org/codehaus/plexus/plexus-utils/3.0.9/plexus-utils-3.0.9.jar
Downloading: http://www.mygrid.org.uk/maven/repository/org/eclipse/aether/aether-util/0.9.0.M2/aether-util-0.9.0.M2.jar
[INFO] Unable to find resource 'org.codehaus.plexus:plexus-utils:jar:3.0.9' in repository mygrid-repository (http://www.mygrid.org.uk/maven/repository)
Downloading: http://repo1.maven.org/maven2/org/codehaus/plexus/plexus-utils/3.0.9/plexus-utils-3.0.9.jar
Downloading: http://www.mygrid.org.uk/maven/repository/org/apache/maven/shared/maven-dependency-analyzer/1.4/maven-dependency-analyzer-1.4.jar
[INFO] Unable to find resource 'org.apache.maven.shared:maven-dependency-analyzer:jar:1.4' in repository mygrid-repository (http://www.mygrid.org.uk/maven/repository)
Downloading: http://repo1.maven.org/maven2/org/apache/maven/shared/maven-dependency-analyzer/1.4/maven-dependency-analyzer-1.4.jar
[INFO] Unable to find resource 'org.eclipse.aether:aether-util:jar:0.9.0.M2' in repository mygrid-repository (http://www.mygrid.org.uk/maven/repository)
Downloading: http://www.mygrid.org.uk/maven/repository/org/eclipse/aether/aether-util/0.9.0.M2/aether-util-0.9.0.M2.jar
26K downloaded  (maven-dependency-analyzer-1.4.jar)
[INFO] Unable to find resource 'org.eclipse.aether:aether-util:jar:0.9.0.M2' in repository mygrid-repository (http://www.mygrid.org.uk/maven/repository)
Downloading: http://repo2.maven.org/maven2/org/eclipse/aether/aether-util/0.9.0.M2/aether-util-0.9.0.M2.jar
Downloading: http://www.mygrid.org.uk/maven/repository/org/apache/maven/shared/maven-dependency-tree/2.1/maven-dependency-tree-2.1.jar
226K downloaded  (plexus-utils-3.0.9.jar)
130K downloaded  (aether-util-0.9.0.M2.jar)
Downloading: http://www.mygrid.org.uk/maven/repository/org/codehaus/plexus/plexus-archiver/2.3/plexus-archiver-2.3.jar
[INFO] Unable to find resource 'org.apache.maven.shared:maven-dependency-tree:jar:2.1' in repository mygrid-repository (http://www.mygrid.org.uk/maven/repository)
Downloading: http://repo1.maven.org/maven2/org/apache/maven/shared/maven-dependency-tree/2.1/maven-dependency-tree-2.1.jar
[INFO] Unable to find resource 'org.codehaus.plexus:plexus-archiver:jar:2.3' in repository mygrid-repository (http://www.mygrid.org.uk/maven/repository)
Downloading: http://repo1.maven.org/maven2/org/codehaus/plexus/plexus-archiver/2.3/plexus-archiver-2.3.jar
58K downloaded  (maven-dependency-tree-2.1.jar)
182K downloaded  (plexus-archiver-2.3.jar)
Downloading: http://www.mygrid.org.uk/maven/repository/org/codehaus/plexus/plexus-component-annotations/1.5.5/plexus-component-annotations-1.5.5.jar
[INFO] Unable to find resource 'org.codehaus.plexus:plexus-component-annotations:jar:1.5.5' in repository mygrid-repository (http://www.mygrid.org.uk/maven/repository)
Downloading: http://www.mygrid.org.uk/maven/repository/org/codehaus/plexus/plexus-component-annotations/1.5.5/plexus-component-annotations-1.5.5.jar
[INFO] Unable to find resource 'org.codehaus.plexus:plexus-component-annotations:jar:1.5.5' in repository mygrid-repository (http://www.mygrid.org.uk/maven/repository)
Downloading: http://repo2.maven.org/maven2/org/codehaus/plexus/plexus-component-annotations/1.5.5/plexus-component-annotations-1.5.5.jar
4K downloaded  (plexus-component-annotations-1.5.5.jar)
[INFO] [dependency:copy {execution: copy-executable-library-jars}]
[INFO] Configured Artifact: uk.org.taverna.server:server-worker:jar-with-dependencies:2.5.4:jar
[INFO] Configured Artifact: uk.org.taverna.server:server-unix-forker:jar-with-dependencies:2.5.4:jar
[INFO] Configured Artifact: uk.org.taverna.server:server-rmidaemon:jar-with-dependencies:2.5.4:jar
[INFO] Copying server-worker-2.5.4-jar-with-dependencies.jar to /local/jenkins/jobs/taverna-server-2.5.4/workspace/server-webapp/target/TavernaServer.2.5.4/WEB-INF/classes/util/server.worker.jar
[INFO] Copying server-unix-forker-2.5.4-jar-with-dependencies.jar to /local/jenkins/jobs/taverna-server-2.5.4/workspace/server-webapp/target/TavernaServer.2.5.4/WEB-INF/classes/util/secure.fork.jar
[INFO] Copying server-rmidaemon-2.5.4-jar-with-dependencies.jar to /local/jenkins/jobs/taverna-server-2.5.4/workspace/server-webapp/target/TavernaServer.2.5.4/WEB-INF/classes/util/rmi.daemon.jar
[INFO] [dependency:unpack {execution: unpack-taverna-commandline}]
[INFO] Configured Artifact: net.sf.taverna.t2.taverna-commandline:taverna-commandline-enterprise:bin:2.5.0:zip
Downloading: http://www.mygrid.org.uk/maven/repository/net/sf/taverna/t2/taverna-commandline/taverna-commandline-enterprise/2.5.0/taverna-commandline-enterprise-2.5.0-bin.zip
199985K downloaded  (taverna-commandline-enterprise-2.5.0-bin.zip)
[INFO] Unpacking /local/jenkins/.m2/repository/net/sf/taverna/t2/taverna-commandline/taverna-commandline-enterprise/2.5.0/taverna-commandline-enterprise-2.5.0-bin.zip to /local/jenkins/jobs/taverna-server-2.5.4/workspace/server-webapp/target/TavernaServer.2.5.4/WEB-INF/classes/util with includes "" and excludes ""
[INFO] [resources:copy-resources {execution: override-executeworkflow-scripts}]
[INFO] Using 'US-ASCII' encoding to copy filtered resources.
[INFO] Copying 2 resources
Downloading: http://www.mygrid.org.uk/maven/repository/org/apache/commons/commons-exec/1.1/commons-exec-1.1.pom
[INFO] Unable to find resource 'org.apache.commons:commons-exec:pom:1.1' in repository mygrid-repository (http://www.mygrid.org.uk/maven/repository)
Downloading: http://repo1.maven.org/maven2/org/apache/commons/commons-exec/1.1/commons-exec-1.1.pom
10K downloaded  (commons-exec-1.1.pom)
Downloading: http://www.mygrid.org.uk/maven/repository/org/apache/commons/commons-exec/1.1/commons-exec-1.1.jar
[INFO] Unable to find resource 'org.apache.commons:commons-exec:jar:1.1' in repository mygrid-repository (http://www.mygrid.org.uk/maven/repository)
Downloading: http://repo1.maven.org/maven2/org/apache/commons/commons-exec/1.1/commons-exec-1.1.jar
51K downloaded  (commons-exec-1.1.jar)
[INFO] [exec:exec {execution: improve-registry-coverage}]
pid:31142
usage: executeworkflow [options] [workflow]
 -clientserver                           Connect as a client to a derby
                                         server instance.
 -cmdir <directory path>                 Absolute path to a directory
                                         where Credential Manager's files
                                         (keystore and truststore) are
                                         located.
 -cmpassword                             Indicate that the master password
                                         for Credential Manager will be
                                         provided on standard input.
 -dbproperties <filename>                Load a properties file to
                                         configure the database.
 -embedded                               Connect to an embedded Derby
                                         database. This can prevent
                                         mulitple invocations.
 -help                                   Display comprehensive help
                                         information.
 -inmemory                               Run the workflow with data stored
                                         in-memory rather than in a
                                         database. This can give
                                         performance inprovements, at the
                                         cost of overall memory usage.
 -inputdelimiter <inputname delimiter>   Cause an inputvalue or inputfile
                                         to be split into a list according
                                         to the delimiter. The associated
                                         workflow input must be expected
                                         to receive a list.
 -inputdoc <document>                    Load inputs from a Baclava
                                         document.
 -inputfile <inputname filename>         Load the named input from file or
                                         URL.
 -inputvalue <inputname value>           Directly use the value for the
                                         named input.
 -logfile <filename>                     The logfile to which more verbose
                                         logging will be written to.
 -outputdir <directory>                  Save outputs as files in
                                         directory, default is to make a
                                         new directory
                                         workflowName_output.
 -outputdoc <document>                   Save outputs to a new Baclava
                                         document.
 -port <portnumber>                      The port that the database is
                                         running on. If set requested to
                                         start its own internal server,
                                         this is the start port that will
                                         be used.
 -provbundle <file>                      Save provenance/trace of workflow
                                         execution as Research Object zip
                                         bundle to <file> specified.
 -provenance                             Generate provenance information
                                         and store it in the database.
 -startdb                                Automatically start an internal
                                         Derby database server.
By default, the workflow is executed using the -inmemory option, and the
results are written out to a directory named after the workflow name.

If this directory already exists then a new directory is created, and
appended with _<n>, where n is incremented to the next available index.

Results are written out to files named after the output port for that result.
If a result is composed of lists, then a directory is created for the output
port and individual list items are named after the list element index (with 1
being the first index). The the output is the result of an error, the filename
is appended with '.error'.

You can provide your own output directory with the -outputdir option. There
will be an error if the directory already exists.

You can also record your results to a Baclava document using -outputdoc
option. The document will be overwritten if it already exists.

Inputs can be provided in three ways. Both -inputfile and -inputvalue options
can be used together; -inputdoc option must be used on its own. -inputfile and
-inputvalue options both take two additional arguments, the name of the port
for the input, and either a file containing the input data, or the input value
itself respectively.

If one of more of your workflow inputs is a list, you can create a list
input by using the -inputdelimiter option, which may be used with either
-inputfile or -inputvalue. This option takes two parameters - an input name
and the delimiter by which to split the input into a list.

The delimiter may be a simple character, such as a comma or a new-line
character, or a regular expression. The input string, or file, will then be
converted into a list being split by the delimiter specified. Make sure to 
put the delimiter character in quotes as it may be interpreted by the shell 
as a special character, e.g. ;.

If a list of greater depth (i.e. a list or lists or deeper) is required then
you will need to use the -inputdoc option.  However, if you provide an input
of lower depth to that required, then it will automatically be wrapped in one
or more lists up to the required depth. Providing an input of greater depth
than that required will result in an error.

If a workflow has a high memory requirement, then it may be better to run it
using a database to store data rather than storing it in memory, which is the
default option. There are three options for using a database:

-embedded option, runs with an embedded database. This is slightly faster than
the -clientserver option (below), but has the limitation that only one
executeworkflow script may be executed simultaneously.

-clientserver option allows the workflow to be executed backed by the database
running as a server. By default a database is not started for you, but may be
started using -startdb option.

-startdb option starts a database. It may be used without providing a workflow
to allow a database to be started separately, allowing multiple simultaneous
executeworkflow script runs.

More advanced database configurations can be specified using -dbproperties
option, allowing you to take full control over the database used. This takes a
second argument, the filename of the properties file, for which the following
example contains the default settings used:

in_memory = true
provenance = false
connector = derby
port = 1527
dialect = org.hibernate.dialect.DerbyDialect
start_derby = false
driver = org.apache.derby.jdbc.EmbeddedDriver
jdbcuri = jdbc:derby:t2-database;create=true;upgrade=true

Note that when using -dbproperties together with other options, the other
options take precedence.

-cmdir option lets you specify an absolute path to a directory where 
Credential Manager's files (keystore and truststore - containing user's 
credentials and trusted certificates for accessing secure services) are stored.
If not specified and the workflow requires access to these files, Taverna will 
try to find them in the default location in <TAVERNA_HOME>/security somewhere 
inside user's home directory (depending on the platform).

-cmpassword option can be used to tell Taverna to expect the password for the 
Credential Manager on standard input. If the password is not piped in, Taverna 
will prompt you for it in the terminal and block until it is entered. Do not 
enter your password in the command line! If -cmpassword option is not specified 
and -cmdir option is used, Taverna will try to find the password in a special 
file password.txt in the directory specified with -cmdir option. Failing that, 
it will try the default password.

-provbundle option lets you specify an absolute path to a file where workflow run 
provenance is going to be exported as a Research Object (RO) bundle. RO bundle is 
a zip file containing workflow file, inputs, outputs, intermediate values, etc. 
This option is normally used in conjunction with option -provenance and one of the 
provenance database options: -embedded, -clientserver or -startdb.

[INFO] [war:war {execution: default-war}]
[INFO] Packaging webapp
[INFO] Assembling webapp[server-webapp] in [/local/jenkins/jobs/taverna-server-2.5.4/workspace/server-webapp/target/TavernaServer.2.5.4]
[INFO] Processing war project
[INFO] Copying webapp resources[/local/jenkins/jobs/taverna-server-2.5.4/workspace/server-webapp/src/main/webapp]
[INFO] Webapp assembled in[773 msecs]
[INFO] Building war: /local/jenkins/jobs/taverna-server-2.5.4/workspace/server-webapp/target/TavernaServer.2.5.4.war
[INFO] Preparing source:jar
[WARNING] Removing: jar from forked lifecycle, to prevent recursive invocation.
[INFO] No goals needed for project - skipping
[INFO] [source:jar {execution: default}]
[INFO] Building jar: /local/jenkins/jobs/taverna-server-2.5.4/workspace/server-webapp/target/TavernaServer.2.5.4-sources.jar
[INFO] Preparing source:test-jar
[WARNING] Removing: jar from forked lifecycle, to prevent recursive invocation.
[WARNING] Removing: test-jar from forked lifecycle, to prevent recursive invocation.
[INFO] No goals needed for project - skipping
[INFO] [source:test-jar {execution: default}]
[INFO] Building jar: /local/jenkins/jobs/taverna-server-2.5.4/workspace/server-webapp/target/TavernaServer.2.5.4-test-sources.jar
[INFO] [jar:test-jar {execution: default}]
[INFO] Building jar: /local/jenkins/jobs/taverna-server-2.5.4/workspace/server-webapp/target/TavernaServer.2.5.4-tests.jar
[INFO] [git-commit-id:revision {execution: buildinfo}]
[info] Tag refs [[Ref[refs/tags/2.5.0=93a38b9bdc5881c9973c0e458854a38b16d62911], Ref[refs/tags/2.5.1=8852ba1edb7043a5bb8b4a2e29f7d758652561d0], Ref[refs/tags/2.5.2=cf873cc87a98e8f3629bcd53609933cd47495a13], Ref[refs/tags/2.5.3=39f577fee08fe573da50f6caa79c9c2c1e6a053a], Ref[refs/tags/2.5.4=3e04c1544e22059291f4742adb4d8cd6c9a2b24f], Ref[refs/tags/2.5alpha=d78b0cf3cce529c2496bfe9b35e1b3bac1fd0f6b], Ref[refs/tags/origin/2.5.0=93a38b9bdc5881c9973c0e458854a38b16d62911], Ref[refs/tags/origin/2.5.1=8852ba1edb7043a5bb8b4a2e29f7d758652561d0], Ref[refs/tags/origin/2.5.2=cf873cc87a98e8f3629bcd53609933cd47495a13], Ref[refs/tags/origin/2.5.3=39f577fee08fe573da50f6caa79c9c2c1e6a053a], Ref[refs/tags/origin/2.5.4=3e04c1544e22059291f4742adb4d8cd6c9a2b24f], Ref[refs/tags/origin/2.5alpha=d78b0cf3cce529c2496bfe9b35e1b3bac1fd0f6b]]]
[info] Resolved tag [2.5.0] [PersonIdent[Donal Fellows, donal.k.fellows@manchester.ac.uk, Fri Oct 18 14:10:51 2013 +0100]], points at [commit 643c6121de9d31c99a9b0f021faee6927ebf64a6 0 ------] 
[info] Resolved tag [2.5.1] [PersonIdent[Donal Fellows, donal.k.fellows@manchester.ac.uk, Wed Dec 11 14:22:54 2013 +0000]], points at [commit 3f874d3c7de338bf745c362430ed92cc8d948a66 0 ------] 
[info] Resolved tag [2.5.2] [PersonIdent[Donal Fellows, donal.k.fellows@manchester.ac.uk, Thu Dec 19 15:43:25 2013 +0000]], points at [commit 7ab9599211f6a4f067801cc674b422adfaf7b603 0 ------] 
[info] Resolved tag [2.5.3] [PersonIdent[Donal Fellows, donal.k.fellows@manchester.ac.uk, Fri Feb 14 10:13:43 2014 +0000]], points at [commit 89d4b86b75637b41e74a556d6088a52b0ef4c10d 0 ------] 
[info] Resolved tag [2.5.4] [PersonIdent[Donal Fellows, donal.k.fellows@manchester.ac.uk, Sun May 4 12:05:05 2014 +0100]], points at [commit d285a5fbfa86b6e7e8e33baffb54830ecec256af 1398419054 -----p] 
[info] Resolved tag [2.5alpha] [PersonIdent[dkf, donal.k.fellows@manchester.ac.uk, Fri May 31 15:38:19 2013 +0100]], points at [commit 56df2e2f0ff0173a13ab90860007fbcc93272b6a 0 ------] 
[info] Resolved tag [2.5.0] [PersonIdent[Donal Fellows, donal.k.fellows@manchester.ac.uk, Fri Oct 18 14:10:51 2013 +0100]], points at [commit 643c6121de9d31c99a9b0f021faee6927ebf64a6 0 ------] 
[info] Resolved tag [2.5.1] [PersonIdent[Donal Fellows, donal.k.fellows@manchester.ac.uk, Wed Dec 11 14:22:54 2013 +0000]], points at [commit 3f874d3c7de338bf745c362430ed92cc8d948a66 0 ------] 
[info] Resolved tag [2.5.2] [PersonIdent[Donal Fellows, donal.k.fellows@manchester.ac.uk, Thu Dec 19 15:43:25 2013 +0000]], points at [commit 7ab9599211f6a4f067801cc674b422adfaf7b603 0 ------] 
[info] Resolved tag [2.5.3] [PersonIdent[Donal Fellows, donal.k.fellows@manchester.ac.uk, Fri Feb 14 10:13:43 2014 +0000]], points at [commit 89d4b86b75637b41e74a556d6088a52b0ef4c10d 0 ------] 
[info] Resolved tag [2.5.4] [PersonIdent[Donal Fellows, donal.k.fellows@manchester.ac.uk, Sun May 4 12:05:05 2014 +0100]], points at [commit d285a5fbfa86b6e7e8e33baffb54830ecec256af 1398419054 -----p] 
[info] Resolved tag [2.5alpha] [PersonIdent[dkf, donal.k.fellows@manchester.ac.uk, Fri May 31 15:38:19 2013 +0100]], points at [commit 56df2e2f0ff0173a13ab90860007fbcc93272b6a 0 ------] 
[info] key [commit d285a5fbfa86b6e7e8e33baffb54830ecec256af 1398419054 -----p], tags => [[DatedRevTag{id=3e04c1544e22059291f4742adb4d8cd6c9a2b24f, tagName='2.5.4', date=May 4, 2014 12:05:05 PM BST}, DatedRevTag{id=3e04c1544e22059291f4742adb4d8cd6c9a2b24f, tagName='2.5.4', date=May 4, 2014 12:05:05 PM BST}]] 
[info] key [commit 3f874d3c7de338bf745c362430ed92cc8d948a66 0 ------], tags => [[DatedRevTag{id=8852ba1edb7043a5bb8b4a2e29f7d758652561d0, tagName='2.5.1', date=December 11, 2013 2:22:54 PM GMT}, DatedRevTag{id=8852ba1edb7043a5bb8b4a2e29f7d758652561d0, tagName='2.5.1', date=December 11, 2013 2:22:54 PM GMT}]] 
[info] key [commit 89d4b86b75637b41e74a556d6088a52b0ef4c10d 0 ------], tags => [[DatedRevTag{id=39f577fee08fe573da50f6caa79c9c2c1e6a053a, tagName='2.5.3', date=February 14, 2014 10:13:43 AM GMT}, DatedRevTag{id=39f577fee08fe573da50f6caa79c9c2c1e6a053a, tagName='2.5.3', date=February 14, 2014 10:13:43 AM GMT}]] 
[info] key [commit 643c6121de9d31c99a9b0f021faee6927ebf64a6 0 ------], tags => [[DatedRevTag{id=93a38b9bdc5881c9973c0e458854a38b16d62911, tagName='2.5.0', date=October 18, 2013 2:10:51 PM BST}, DatedRevTag{id=93a38b9bdc5881c9973c0e458854a38b16d62911, tagName='2.5.0', date=October 18, 2013 2:10:51 PM BST}]] 
[info] key [commit 7ab9599211f6a4f067801cc674b422adfaf7b603 0 ------], tags => [[DatedRevTag{id=cf873cc87a98e8f3629bcd53609933cd47495a13, tagName='2.5.2', date=December 19, 2013 3:43:25 PM GMT}, DatedRevTag{id=cf873cc87a98e8f3629bcd53609933cd47495a13, tagName='2.5.2', date=December 19, 2013 3:43:25 PM GMT}]] 
[info] key [commit 56df2e2f0ff0173a13ab90860007fbcc93272b6a 0 ------], tags => [[DatedRevTag{id=d78b0cf3cce529c2496bfe9b35e1b3bac1fd0f6b, tagName='2.5alpha', date=May 31, 2013 3:38:19 PM BST}, DatedRevTag{id=d78b0cf3cce529c2496bfe9b35e1b3bac1fd0f6b, tagName='2.5alpha', date=May 31, 2013 3:38:19 PM BST}]] 
[info] Created map: [{commit d285a5fbfa86b6e7e8e33baffb54830ecec256af 1398419054 -----p=[2.5.4, 2.5.4], commit 3f874d3c7de338bf745c362430ed92cc8d948a66 0 ------=[2.5.1, 2.5.1], commit 89d4b86b75637b41e74a556d6088a52b0ef4c10d 0 ------=[2.5.3, 2.5.3], commit 643c6121de9d31c99a9b0f021faee6927ebf64a6 0 ------=[2.5.0, 2.5.0], commit 7ab9599211f6a4f067801cc674b422adfaf7b603 0 ------=[2.5.2, 2.5.2], commit 56df2e2f0ff0173a13ab90860007fbcc93272b6a 0 ------=[2.5alpha, 2.5alpha]}] 
[info] HEAD is [d285a5fbfa86b6e7e8e33baffb54830ecec256af] 
[info] Repo is in dirty state [false] 
[info] The commit we're on is a Tag ([2.5.4]), returning.
[info] [GitCommitIdMojo] Storing: git.commit.id.describe = 2.5.4
[info] [GitCommitIdMojo] Storing: git.commit.id = d285a5fbfa86b6e7e8e33baffb54830ecec256af
[info] [GitCommitIdMojo] Storing: git.commit.id.abbrev = d285a5f
[info] [GitCommitIdMojo] Storing: git.commit.user.name = Donal Fellows
[info] [GitCommitIdMojo] Storing: git.commit.user.email = donal.k.fellows@manchester.ac.uk
[info] [GitCommitIdMojo] Storing: git.commit.message.full = Ensure that we apply patches to the correct directory.
[info] [GitCommitIdMojo] Storing: git.commit.message.short = Ensure that we apply patches to the correct directory.
[info] [GitCommitIdMojo] Storing: git.commit.time = 25.04.2014 @ 10:44:14 BST
[info] [GitCommitIdMojo] Storing: git.build.time = 07.05.2014 @ 09:29:00 BST
[info] [GitCommitIdMojo] ------------------git properties loaded------------------
[info] [GitCommitIdMojo] git.build.user.email = jenkins@mygrid.org.uk
[info] [GitCommitIdMojo] git.commit.user.email = donal.k.fellows@manchester.ac.uk
[info] [GitCommitIdMojo] git.commit.time = 25.04.2014 @ 10:44:14 BST
[info] [GitCommitIdMojo] git.commit.message.full = Ensure that we apply patches to the correct directory.
[info] [GitCommitIdMojo] git.commit.message.short = Ensure that we apply patches to the correct directory.
[info] [GitCommitIdMojo] git.commit.id.abbrev = d285a5f
[info] [GitCommitIdMojo] git.branch = d285a5fbfa86b6e7e8e33baffb54830ecec256af
[info] [GitCommitIdMojo] git.build.user.name = myGrid Jenkins
[info] [GitCommitIdMojo] git.commit.id.describe = 2.5.4
[info] [GitCommitIdMojo] git.commit.id = d285a5fbfa86b6e7e8e33baffb54830ecec256af
[info] [GitCommitIdMojo] git.build.time = 07.05.2014 @ 09:29:00 BST
[info] [GitCommitIdMojo] git.commit.user.name = Donal Fellows
[info] [GitCommitIdMojo] ---------------------------------------------------------
[info] [GitCommitIdMojo] Appending to Maven properties
[info] [GitCommitIdMojo] Injecting Git properties to "Taverna Server" project
[info] [GitCommitIdMojo] Injecting Git properties to "Workflow Port Descriptor Types" project
[info] [GitCommitIdMojo] Injecting Git properties to "RMI Interface: Webapp <-> Worker" project
[info] [GitCommitIdMojo] Injecting Git properties to "Usage Record Support" project
[info] [GitCommitIdMojo] Injecting Git properties to "Workflow Executor/File System Access Process Implementation" project
[info] [GitCommitIdMojo] Injecting Git properties to "Impersonation Module (Unix)" project
[info] [GitCommitIdMojo] Injecting Git properties to "RMI registry daemon" project
[info] [GitCommitIdMojo] Injecting Git properties to "Web Application Core" project
[info] [GitCommitIdMojo] Injecting Git properties to "Distribution Packaging" project
[info] [GitCommitIdMojo] Finished running.
[INFO] [resources:resources {execution: default-resources}]
[INFO] Using 'US-ASCII' encoding to copy filtered resources.
[INFO] Copying 24 resources
[INFO] Copying 15 resources
[INFO] [compiler:compile {execution: default-compile}]
[INFO] Compiling 13 source files to /local/jenkins/jobs/taverna-server-2.5.4/workspace/server-webapp/target/classes
[INFO] [datanucleus:enhance {execution: enhance}]
[INFO]   CP: /local/jenkins/.m2/repository/org/datanucleus/datanucleus-core/3.2.10/datanucleus-core-3.2.10.jar
[INFO]   CP: /local/jenkins/.m2/repository/org/datanucleus/datanucleus-enhancer/3.1.1/datanucleus-enhancer-3.1.1.jar
[INFO]   CP: /local/jenkins/.m2/repository/org/ow2/asm/asm/4.0/asm-4.0.jar
[INFO]   CP: /local/jenkins/.m2/repository/org/datanucleus/datanucleus-api-jdo/3.2.5/datanucleus-api-jdo-3.2.5.jar
[INFO]   CP: /local/jenkins/.m2/repository/javax/jdo/jdo-api/3.0.1/jdo-api-3.0.1.jar
[INFO]   CP: /local/jenkins/.m2/repository/javax/transaction/jta/1.1/jta-1.1.jar
[INFO]   CP: /local/jenkins/.m2/repository/org/codehaus/plexus/plexus-utils/3.0.8/plexus-utils-3.0.8.jar
[INFO]   CP: /local/jenkins/tools/hudson.tasks.Maven_MavenInstallation/maven/lib/maven-2.2.1-uber.jar
[INFO]   CP: /local/jenkins/jobs/taverna-server-2.5.4/workspace/server-webapp/target/classes
[INFO]   CP: /local/jenkins/.m2/repository/org/apache/cxf/cxf-rt-frontend-jaxws/2.7.7/cxf-rt-frontend-jaxws-2.7.7.jar
[INFO]   CP: /local/jenkins/.m2/repository/xml-resolver/xml-resolver/1.2/xml-resolver-1.2.jar
[INFO]   CP: /local/jenkins/.m2/repository/org/apache/cxf/cxf-api/2.7.7/cxf-api-2.7.7.jar
[INFO]   CP: /local/jenkins/.m2/repository/org/apache/ws/xmlschema/xmlschema-core/2.0.3/xmlschema-core-2.0.3.jar
[INFO]   CP: /local/jenkins/.m2/repository/org/apache/geronimo/specs/geronimo-javamail_1.4_spec/1.7.1/geronimo-javamail_1.4_spec-1.7.1.jar
[INFO]   CP: /local/jenkins/.m2/repository/wsdl4j/wsdl4j/1.6.3/wsdl4j-1.6.3.jar
[INFO]   CP: /local/jenkins/.m2/repository/org/apache/cxf/cxf-rt-core/2.7.7/cxf-rt-core-2.7.7.jar
[INFO]   CP: /local/jenkins/.m2/repository/org/apache/cxf/cxf-rt-bindings-soap/2.7.7/cxf-rt-bindings-soap-2.7.7.jar
[INFO]   CP: /local/jenkins/.m2/repository/org/apache/cxf/cxf-rt-databinding-jaxb/2.7.7/cxf-rt-databinding-jaxb-2.7.7.jar
[INFO]   CP: /local/jenkins/.m2/repository/org/apache/cxf/cxf-rt-bindings-xml/2.7.7/cxf-rt-bindings-xml-2.7.7.jar
[INFO]   CP: /local/jenkins/.m2/repository/org/apache/cxf/cxf-rt-frontend-simple/2.7.7/cxf-rt-frontend-simple-2.7.7.jar
[INFO]   CP: /local/jenkins/.m2/repository/org/apache/cxf/cxf-rt-transports-http/2.7.7/cxf-rt-transports-http-2.7.7.jar
[INFO]   CP: /local/jenkins/.m2/repository/org/apache/cxf/cxf-rt-ws-addr/2.7.7/cxf-rt-ws-addr-2.7.7.jar
[INFO]   CP: /local/jenkins/.m2/repository/org/apache/cxf/cxf-rt-ws-policy/2.7.7/cxf-rt-ws-policy-2.7.7.jar
[INFO]   CP: /local/jenkins/.m2/repository/org/apache/neethi/neethi/3.0.2/neethi-3.0.2.jar
[INFO]   CP: /local/jenkins/.m2/repository/org/apache/cxf/cxf-rt-frontend-jaxrs/2.7.7/cxf-rt-frontend-jaxrs-2.7.7.jar
[INFO]   CP: /local/jenkins/.m2/repository/javax/ws/rs/javax.ws.rs-api/2.0-m10/javax.ws.rs-api-2.0-m10.jar
[INFO]   CP: /local/jenkins/.m2/repository/commons-logging/commons-logging/1.1.3/commons-logging-1.1.3.jar
[INFO]   CP: /local/jenkins/.m2/repository/commons-io/commons-io/2.3/commons-io-2.3.jar
[INFO]   CP: /local/jenkins/.m2/repository/aopalliance/aopalliance/1.0/aopalliance-1.0.jar
[INFO]   CP: /local/jenkins/.m2/repository/org/springframework/spring-beans/3.2.5.RELEASE/spring-beans-3.2.5.RELEASE.jar
[INFO]   CP: /local/jenkins/.m2/repository/org/springframework/spring-core/3.2.5.RELEASE/spring-core-3.2.5.RELEASE.jar
[INFO]   CP: /local/jenkins/.m2/repository/org/springframework/security/spring-security-core/3.1.4.RELEASE/spring-security-core-3.1.4.RELEASE.jar
[INFO]   CP: /local/jenkins/.m2/repository/org/springframework/spring-context/3.2.5.RELEASE/spring-context-3.2.5.RELEASE.jar
[INFO]   CP: /local/jenkins/.m2/repository/org/springframework/spring-expression/3.2.5.RELEASE/spring-expression-3.2.5.RELEASE.jar
[INFO]   CP: /local/jenkins/.m2/repository/org/springframework/security/spring-security-web/3.1.4.RELEASE/spring-security-web-3.1.4.RELEASE.jar
[INFO]   CP: /local/jenkins/.m2/repository/org/springframework/spring-jdbc/3.2.5.RELEASE/spring-jdbc-3.2.5.RELEASE.jar
[INFO]   CP: /local/jenkins/.m2/repository/org/springframework/spring-tx/3.2.5.RELEASE/spring-tx-3.2.5.RELEASE.jar
[INFO]   CP: /local/jenkins/.m2/repository/org/springframework/spring-web/3.2.5.RELEASE/spring-web-3.2.5.RELEASE.jar
[INFO]   CP: /local/jenkins/.m2/repository/org/springframework/security/spring-security-config/3.1.4.RELEASE/spring-security-config-3.1.4.RELEASE.jar
[INFO]   CP: /local/jenkins/jobs/taverna-server-2.5.4/workspace/server-port-description/target/server-port-description-2.5.4.jar
[INFO]   CP: /local/jenkins/.m2/repository/com/google/code/findbugs/jsr305/1.3.7/jsr305-1.3.7.jar
[INFO]   CP: /local/jenkins/jobs/taverna-server-2.5.4/workspace/server-runinterface/target/server-runinterface-2.5.4.jar
[INFO]   CP: /local/jenkins/jobs/taverna-server-2.5.4/workspace/server-usagerecord/target/server-usagerecord-2.5.4.jar
[INFO]   CP: /local/jenkins/jobs/taverna-server-2.5.4/workspace/server-worker/target/server-worker-2.5.4-jar-with-dependencies.jar
[INFO]   CP: /local/jenkins/.m2/repository/commons-collections/commons-collections/3.2.1/commons-collections-3.2.1.jar
[INFO]   CP: /local/jenkins/jobs/taverna-server-2.5.4/workspace/server-unix-forker/target/server-unix-forker-2.5.4-jar-with-dependencies.jar
[INFO]   CP: /local/jenkins/jobs/taverna-server-2.5.4/workspace/server-rmidaemon/target/server-rmidaemon-2.5.4-jar-with-dependencies.jar
[INFO]   CP: /local/jenkins/.m2/repository/javax/servlet/servlet-api/2.5/servlet-api-2.5.jar
[INFO]   CP: /local/jenkins/.m2/repository/commons-dbcp/commons-dbcp/1.4/commons-dbcp-1.4.jar
[INFO]   CP: /local/jenkins/.m2/repository/commons-pool/commons-pool/1.5.4/commons-pool-1.5.4.jar
[INFO]   CP: /local/jenkins/.m2/repository/org/datanucleus/datanucleus-rdbms/3.2.12/datanucleus-rdbms-3.2.12.jar
[INFO]   CP: /local/jenkins/.m2/repository/org/apache/jdo/jdo2-core/2.0/jdo2-core-2.0.jar
[INFO]   CP: /local/jenkins/.m2/repository/joda-time/joda-time/2.3/joda-time-2.3.jar
[INFO]   CP: /local/jenkins/.m2/repository/net/sf/mime-util/mime-util/1.2/mime-util-1.2.jar
[INFO]   CP: /local/jenkins/.m2/repository/org/twitter4j/twitter4j-core/4.0.1/twitter4j-core-4.0.1.jar
[INFO]   CP: /local/jenkins/.m2/repository/org/aspectj/aspectjrt/1.7.4/aspectjrt-1.7.4.jar
[INFO]   CP: /local/jenkins/.m2/repository/org/igniterealtime/smack/smack/3.2.1/smack-3.2.1.jar
[INFO]   CP: /local/jenkins/.m2/repository/org/apache/httpcomponents/httpclient/4.3.1/httpclient-4.3.1.jar
[INFO]   CP: /local/jenkins/.m2/repository/org/apache/httpcomponents/httpcore/4.3/httpcore-4.3.jar
[INFO]   CP: /local/jenkins/.m2/repository/commons-codec/commons-codec/1.8/commons-codec-1.8.jar
[INFO]   CP: /local/jenkins/.m2/repository/javax/annotation/jsr250-api/1.0/jsr250-api-1.0.jar
[INFO]   CP: /local/jenkins/.m2/repository/org/apache/abdera/abdera-core/1.1.3/abdera-core-1.1.3.jar
[INFO]   CP: /local/jenkins/.m2/repository/org/apache/abdera/abdera-i18n/1.1.3/abdera-i18n-1.1.3.jar
[INFO]   CP: /local/jenkins/.m2/repository/org/apache/geronimo/specs/geronimo-activation_1.1_spec/1.1/geronimo-activation_1.1_spec-1.1.jar
[INFO]   CP: /local/jenkins/.m2/repository/org/apache/geronimo/specs/geronimo-stax-api_1.0_spec/1.0.1/geronimo-stax-api_1.0_spec-1.0.1.jar
[INFO]   CP: /local/jenkins/.m2/repository/org/bouncycastle/bcprov-jdk15on/1.49/bcprov-jdk15on-1.49.jar
[INFO]   CP: /local/jenkins/.m2/repository/org/springframework/spring-context-support/3.2.5.RELEASE/spring-context-support-3.2.5.RELEASE.jar
[INFO]   CP: /local/jenkins/.m2/repository/org/apache/velocity/velocity/1.7/velocity-1.7.jar
[INFO]   CP: /local/jenkins/.m2/repository/commons-lang/commons-lang/2.6/commons-lang-2.6.jar
[INFO]   CP: /local/jenkins/.m2/repository/org/apache/cxf/cxf-rt-rs-extension-providers/2.7.7/cxf-rt-rs-extension-providers-2.7.7.jar
May 07, 2014 9:29:01 AM org.datanucleus.plugin.NonManagedPluginRegistry registerExtensions
WARNING: Extension Point "org.datanucleus.implementation_creator" not registered, but plugin "org.datanucleus.enhancer" defined in file:/local/jenkins/.m2/repository/org/datanucleus/datanucleus-enhancer/3.1.1/datanucleus-enhancer-3.1.1.jar refers to it.
May 07, 2014 9:29:01 AM org.datanucleus.enhancer.DataNucleusEnhancer main
INFO: DataNucleus Enhancer (version 3.2.10) for API "JDO" using JRE "1.7"
DataNucleus Enhancer (version 3.2.10) for API "JDO" using JRE "1.7"
DataNucleus Enhancer : Classpath
>>  /local/jenkins/plugins/maven-plugin/WEB-INF/lib/maven-agent-1.5.jar
>>  /local/jenkins/tools/hudson.tasks.Maven_MavenInstallation/maven/boot/classworlds-1.1.jar
May 07, 2014 9:29:02 AM org.datanucleus.enhancer.jdo.JDOClassEnhancer enhance
INFO: Class "org.taverna.server.master.usage.UsageRecord" is already enhanced.
May 07, 2014 9:29:02 AM org.datanucleus.enhancer.DataNucleusEnhancer addMessage
INFO: ENHANCED (PersistenceCapable) : org.taverna.server.master.usage.UsageRecord
ENHANCED (PersistenceCapable) : org.taverna.server.master.usage.UsageRecord
May 07, 2014 9:29:02 AM org.datanucleus.enhancer.AbstractClassEnhancer save
INFO: Writing class file "/local/jenkins/jobs/taverna-server-2.5.4/workspace/server-webapp/target/classes/org/taverna/server/master/ManagementState.class" with enhanced definition
May 07, 2014 9:29:02 AM org.datanucleus.enhancer.DataNucleusEnhancer addMessage
INFO: ENHANCED (PersistenceAware) : org.taverna.server.master.ManagementState
ENHANCED (PersistenceAware) : org.taverna.server.master.ManagementState
May 07, 2014 9:29:02 AM org.datanucleus.enhancer.jdo.JDOClassEnhancer enhance
INFO: Class "org.taverna.server.master.identity.User" is already enhanced.
May 07, 2014 9:29:02 AM org.datanucleus.enhancer.DataNucleusEnhancer addMessage
INFO: ENHANCED (PersistenceCapable) : org.taverna.server.master.identity.User
ENHANCED (PersistenceCapable) : org.taverna.server.master.identity.User
May 07, 2014 9:29:02 AM org.datanucleus.enhancer.AbstractClassEnhancer save
INFO: Writing class file "/local/jenkins/jobs/taverna-server-2.5.4/workspace/server-webapp/target/classes/org/taverna/server/master/identity/UserStore.class" with enhanced definition
May 07, 2014 9:29:02 AM org.datanucleus.enhancer.DataNucleusEnhancer addMessage
INFO: ENHANCED (PersistenceAware) : org.taverna.server.master.identity.UserStore
ENHANCED (PersistenceAware) : org.taverna.server.master.identity.UserStore
May 07, 2014 9:29:02 AM org.datanucleus.enhancer.jdo.JDOClassEnhancer enhance
INFO: Class "org.taverna.server.master.localworker.PersistedState" is already enhanced.
May 07, 2014 9:29:02 AM org.datanucleus.enhancer.DataNucleusEnhancer addMessage
INFO: ENHANCED (PersistenceCapable) : org.taverna.server.master.localworker.PersistedState
ENHANCED (PersistenceCapable) : org.taverna.server.master.localworker.PersistedState
May 07, 2014 9:29:02 AM org.datanucleus.enhancer.AbstractClassEnhancer save
INFO: Writing class file "/local/jenkins/jobs/taverna-server-2.5.4/workspace/server-webapp/target/classes/org/taverna/server/master/localworker/LocalWorkerState.class" with enhanced definition
May 07, 2014 9:29:02 AM org.datanucleus.enhancer.DataNucleusEnhancer addMessage
INFO: ENHANCED (PersistenceAware) : org.taverna.server.master.localworker.LocalWorkerState
ENHANCED (PersistenceAware) : org.taverna.server.master.localworker.LocalWorkerState
May 07, 2014 9:29:02 AM org.datanucleus.enhancer.jdo.JDOClassEnhancer enhance
INFO: Class "org.taverna.server.master.notification.atom.Event" is already enhanced.
May 07, 2014 9:29:02 AM org.datanucleus.enhancer.DataNucleusEnhancer addMessage
INFO: ENHANCED (PersistenceCapable) : org.taverna.server.master.notification.atom.Event
ENHANCED (PersistenceCapable) : org.taverna.server.master.notification.atom.Event
May 07, 2014 9:29:02 AM org.datanucleus.enhancer.AbstractClassEnhancer save
INFO: Writing class file "/local/jenkins/jobs/taverna-server-2.5.4/workspace/server-webapp/target/classes/org/taverna/server/master/notification/atom/EventDAO.class" with enhanced definition
May 07, 2014 9:29:02 AM org.datanucleus.enhancer.DataNucleusEnhancer addMessage
INFO: ENHANCED (PersistenceAware) : org.taverna.server.master.notification.atom.EventDAO
ENHANCED (PersistenceAware) : org.taverna.server.master.notification.atom.EventDAO
May 07, 2014 9:29:02 AM org.datanucleus.enhancer.jdo.JDOClassEnhancer enhance
INFO: Class "org.taverna.server.master.worker.RunConnection" is already enhanced.
May 07, 2014 9:29:02 AM org.datanucleus.enhancer.DataNucleusEnhancer addMessage
INFO: ENHANCED (PersistenceCapable) : org.taverna.server.master.worker.RunConnection
ENHANCED (PersistenceCapable) : org.taverna.server.master.worker.RunConnection
May 07, 2014 9:29:02 AM org.datanucleus.enhancer.AbstractClassEnhancer save
INFO: Writing class file "/local/jenkins/jobs/taverna-server-2.5.4/workspace/server-webapp/target/classes/org/taverna/server/master/worker/RunDatabaseDAO.class" with enhanced definition
May 07, 2014 9:29:02 AM org.datanucleus.enhancer.DataNucleusEnhancer addMessage
INFO: ENHANCED (PersistenceAware) : org.taverna.server.master.worker.RunDatabaseDAO
ENHANCED (PersistenceAware) : org.taverna.server.master.worker.RunDatabaseDAO
May 07, 2014 9:29:02 AM org.datanucleus.enhancer.jdo.JDOClassEnhancer enhance
INFO: Class "org.taverna.server.master.WebappState" is already enhanced.
May 07, 2014 9:29:02 AM org.datanucleus.enhancer.DataNucleusEnhancer addMessage
INFO: ENHANCED (PersistenceCapable) : org.taverna.server.master.WebappState
ENHANCED (PersistenceCapable) : org.taverna.server.master.WebappState
May 07, 2014 9:29:02 AM org.datanucleus.enhancer.DataNucleusEnhancer addMessage
INFO: DataNucleus Enhancer completed with success for 11 classes. Timings : input=402 ms, enhance=501 ms, total=903 ms. Consult the log for full details
DataNucleus Enhancer completed with success for 11 classes. Timings : input=402 ms, enhance=501 ms, total=903 ms. Consult the log for full details
[INFO] [resources:testResources {execution: default-testResources}]
[INFO] Using 'US-ASCII' encoding to copy filtered resources.
[INFO] Copying 2 resources
[INFO] [compiler:testCompile {execution: default-testCompile}]
[INFO] Nothing to compile - all classes are up to date
[WARNING] DEPRECATED [systemProperties]: Use systemPropertyVariables instead.
[INFO] [surefire:test {execution: default-test}]
[INFO] Surefire report directory: /local/jenkins/jobs/taverna-server-2.5.4/workspace/server-webapp/target/surefire-reports

-------------------------------------------------------
 T E S T S
-------------------------------------------------------
Running org.taverna.server.master.TavernaServerImplTest
Tests run: 7, Failures: 0, Errors: 0, Skipped: 0, Time elapsed: 0.714 sec
Running org.taverna.server.master.WorkflowSerializationTest
Tests run: 1, Failures: 0, Errors: 0, Skipped: 0, Time elapsed: 0.143 sec
Running org.taverna.server.master.JaxbSanityTest
Tests run: 38, Failures: 0, Errors: 0, Skipped: 0, Time elapsed: 1.365 sec

Results :

Tests run: 46, Failures: 0, Errors: 0, Skipped: 0

[JENKINS] Recording test results
[INFO] [dependency:copy {execution: copy-executable-library-jars}]
[INFO] Configured Artifact: uk.org.taverna.server:server-worker:jar-with-dependencies:2.5.4:jar
[INFO] Configured Artifact: uk.org.taverna.server:server-unix-forker:jar-with-dependencies:2.5.4:jar
[INFO] Configured Artifact: uk.org.taverna.server:server-rmidaemon:jar-with-dependencies:2.5.4:jar
[INFO] uk.org.taverna.server:server-worker:jar-with-dependencies:2.5.4:jar already exists in /local/jenkins/jobs/taverna-server-2.5.4/workspace/server-webapp/target/TavernaServer.2.5.4/WEB-INF/classes/util
[INFO] uk.org.taverna.server:server-unix-forker:jar-with-dependencies:2.5.4:jar already exists in /local/jenkins/jobs/taverna-server-2.5.4/workspace/server-webapp/target/TavernaServer.2.5.4/WEB-INF/classes/util
[INFO] uk.org.taverna.server:server-rmidaemon:jar-with-dependencies:2.5.4:jar already exists in /local/jenkins/jobs/taverna-server-2.5.4/workspace/server-webapp/target/TavernaServer.2.5.4/WEB-INF/classes/util
[INFO] [dependency:unpack {execution: unpack-taverna-commandline}]
[INFO] Configured Artifact: net.sf.taverna.t2.taverna-commandline:taverna-commandline-enterprise:bin:2.5.0:zip
[INFO] taverna-commandline-enterprise-2.5.0-bin.zip already unpacked.
[INFO] [resources:copy-resources {execution: override-executeworkflow-scripts}]
[INFO] Using 'US-ASCII' encoding to copy filtered resources.
[INFO] Copying 2 resources
[INFO] [exec:exec {execution: improve-registry-coverage}]
pid:31260
usage: executeworkflow [options] [workflow]
 -clientserver                           Connect as a client to a derby
                                         server instance.
 -cmdir <directory path>                 Absolute path to a directory
                                         where Credential Manager's files
                                         (keystore and truststore) are
                                         located.
 -cmpassword                             Indicate that the master password
                                         for Credential Manager will be
                                         provided on standard input.
 -dbproperties <filename>                Load a properties file to
                                         configure the database.
 -embedded                               Connect to an embedded Derby
                                         database. This can prevent
                                         mulitple invocations.
 -help                                   Display comprehensive help
                                         information.
 -inmemory                               Run the workflow with data stored
                                         in-memory rather than in a
                                         database. This can give
                                         performance inprovements, at the
                                         cost of overall memory usage.
 -inputdelimiter <inputname delimiter>   Cause an inputvalue or inputfile
                                         to be split into a list according
                                         to the delimiter. The associated
                                         workflow input must be expected
                                         to receive a list.
 -inputdoc <document>                    Load inputs from a Baclava
                                         document.
 -inputfile <inputname filename>         Load the named input from file or
                                         URL.
 -inputvalue <inputname value>           Directly use the value for the
                                         named input.
 -logfile <filename>                     The logfile to which more verbose
                                         logging will be written to.
 -outputdir <directory>                  Save outputs as files in
                                         directory, default is to make a
                                         new directory
                                         workflowName_output.
 -outputdoc <document>                   Save outputs to a new Baclava
                                         document.
 -port <portnumber>                      The port that the database is
                                         running on. If set requested to
                                         start its own internal server,
                                         this is the start port that will
                                         be used.
 -provbundle <file>                      Save provenance/trace of workflow
                                         execution as Research Object zip
                                         bundle to <file> specified.
 -provenance                             Generate provenance information
                                         and store it in the database.
 -startdb                                Automatically start an internal
                                         Derby database server.
By default, the workflow is executed using the -inmemory option, and the
results are written out to a directory named after the workflow name.

If this directory already exists then a new directory is created, and
appended with _<n>, where n is incremented to the next available index.

Results are written out to files named after the output port for that result.
If a result is composed of lists, then a directory is created for the output
port and individual list items are named after the list element index (with 1
being the first index). The the output is the result of an error, the filename
is appended with '.error'.

You can provide your own output directory with the -outputdir option. There
will be an error if the directory already exists.

You can also record your results to a Baclava document using -outputdoc
option. The document will be overwritten if it already exists.

Inputs can be provided in three ways. Both -inputfile and -inputvalue options
can be used together; -inputdoc option must be used on its own. -inputfile and
-inputvalue options both take two additional arguments, the name of the port
for the input, and either a file containing the input data, or the input value
itself respectively.

If one of more of your workflow inputs is a list, you can create a list
input by using the -inputdelimiter option, which may be used with either
-inputfile or -inputvalue. This option takes two parameters - an input name
and the delimiter by which to split the input into a list.

The delimiter may be a simple character, such as a comma or a new-line
character, or a regular expression. The input string, or file, will then be
converted into a list being split by the delimiter specified. Make sure to 
put the delimiter character in quotes as it may be interpreted by the shell 
as a special character, e.g. ;.

If a list of greater depth (i.e. a list or lists or deeper) is required then
you will need to use the -inputdoc option.  However, if you provide an input
of lower depth to that required, then it will automatically be wrapped in one
or more lists up to the required depth. Providing an input of greater depth
than that required will result in an error.

If a workflow has a high memory requirement, then it may be better to run it
using a database to store data rather than storing it in memory, which is the
default option. There are three options for using a database:

-embedded option, runs with an embedded database. This is slightly faster than
the -clientserver option (below), but has the limitation that only one
executeworkflow script may be executed simultaneously.

-clientserver option allows the workflow to be executed backed by the database
running as a server. By default a database is not started for you, but may be
started using -startdb option.

-startdb option starts a database. It may be used without providing a workflow
to allow a database to be started separately, allowing multiple simultaneous
executeworkflow script runs.

More advanced database configurations can be specified using -dbproperties
option, allowing you to take full control over the database used. This takes a
second argument, the filename of the properties file, for which the following
example contains the default settings used:

in_memory = true
provenance = false
connector = derby
port = 1527
dialect = org.hibernate.dialect.DerbyDialect
start_derby = false
driver = org.apache.derby.jdbc.EmbeddedDriver
jdbcuri = jdbc:derby:t2-database;create=true;upgrade=true

Note that when using -dbproperties together with other options, the other
options take precedence.

-cmdir option lets you specify an absolute path to a directory where 
Credential Manager's files (keystore and truststore - containing user's 
credentials and trusted certificates for accessing secure services) are stored.
If not specified and the workflow requires access to these files, Taverna will 
try to find them in the default location in <TAVERNA_HOME>/security somewhere 
inside user's home directory (depending on the platform).

-cmpassword option can be used to tell Taverna to expect the password for the 
Credential Manager on standard input. If the password is not piped in, Taverna 
will prompt you for it in the terminal and block until it is entered. Do not 
enter your password in the command line! If -cmpassword option is not specified 
and -cmdir option is used, Taverna will try to find the password in a special 
file password.txt in the directory specified with -cmdir option. Failing that, 
it will try the default password.

-provbundle option lets you specify an absolute path to a file where workflow run 
provenance is going to be exported as a Research Object (RO) bundle. RO bundle is 
a zip file containing workflow file, inputs, outputs, intermediate values, etc. 
This option is normally used in conjunction with option -provenance and one of the 
provenance database options: -embedded, -clientserver or -startdb.

[INFO] [war:war {execution: default-war}]
[INFO] Packaging webapp
[INFO] ------------------------------------------------------------------------
[ERROR] FATAL ERROR
[INFO] ------------------------------------------------------------------------
[INFO] Cannot construct org.apache.maven.plugin.war.util.WebappStructure as it does not have a no-args constructor
---- Debugging information ----
message             : Cannot construct org.apache.maven.plugin.war.util.WebappStructure as it does not have a no-args constructor
cause-exception     : com.thoughtworks.xstream.converters.reflection.ObjectAccessException
cause-message       : Cannot construct org.apache.maven.plugin.war.util.WebappStructure as it does not have a no-args constructor
class               : org.apache.maven.plugin.war.util.WebappStructure
required-type       : org.apache.maven.plugin.war.util.WebappStructure
path                : /webapp-structure
line number         : 1
-------------------------------
[INFO] ------------------------------------------------------------------------
[INFO] Trace
com.thoughtworks.xstream.converters.ConversionException: Cannot construct org.apache.maven.plugin.war.util.WebappStructure as it does not have a no-args constructor
---- Debugging information ----
message             : Cannot construct org.apache.maven.plugin.war.util.WebappStructure as it does not have a no-args constructor
cause-exception     : com.thoughtworks.xstream.converters.reflection.ObjectAccessException
cause-message       : Cannot construct org.apache.maven.plugin.war.util.WebappStructure as it does not have a no-args constructor
class               : org.apache.maven.plugin.war.util.WebappStructure
required-type       : org.apache.maven.plugin.war.util.WebappStructure
path                : /webapp-structure
line number         : 1
-------------------------------
	at com.thoughtworks.xstream.core.TreeUnmarshaller.convert(TreeUnmarshaller.java:63)
	at com.thoughtworks.xstream.core.AbstractReferenceUnmarshaller.convert(AbstractReferenceUnmarshaller.java:45)
	at com.thoughtworks.xstream.core.TreeUnmarshaller.convertAnother(TreeUnmarshaller.java:46)
	at com.thoughtworks.xstream.core.TreeUnmarshaller.start(TreeUnmarshaller.java:117)
	at com.thoughtworks.xstream.core.ReferenceByXPathMarshallingStrategy.unmarshal(ReferenceByXPathMarshallingStrategy.java:29)
	at com.thoughtworks.xstream.XStream.unmarshal(XStream.java:846)
	at com.thoughtworks.xstream.XStream.unmarshal(XStream.java:833)
	at com.thoughtworks.xstream.XStream.fromXML(XStream.java:781)
	at org.apache.maven.plugin.war.util.WebappStructureSerializer.fromXml(WebappStructureSerializer.java:73)
	at org.apache.maven.plugin.war.AbstractWarMojo.buildWebapp(AbstractWarMojo.java:404)
	at org.apache.maven.plugin.war.AbstractWarMojo.buildExplodedWebapp(AbstractWarMojo.java:375)
	at org.apache.maven.plugin.war.WarMojo.performPackaging(WarMojo.java:181)
	at org.apache.maven.plugin.war.WarMojo.execute(WarMojo.java:143)
	at org.apache.maven.plugin.DefaultPluginManager.executeMojo(DefaultPluginManager.java:490)
	at hudson.maven.agent.PluginManagerInterceptor.executeMojo(PluginManagerInterceptor.java:182)
	at org.apache.maven.lifecycle.DefaultLifecycleExecutor.executeGoals(DefaultLifecycleExecutor.java:694)
	at org.apache.maven.lifecycle.DefaultLifecycleExecutor.executeGoalWithLifecycle(DefaultLifecycleExecutor.java:556)
	at org.apache.maven.lifecycle.DefaultLifecycleExecutor.executeGoal(DefaultLifecycleExecutor.java:535)
	at org.apache.maven.lifecycle.DefaultLifecycleExecutor.executeGoalAndHandleFailures(DefaultLifecycleExecutor.java:387)
	at org.apache.maven.lifecycle.DefaultLifecycleExecutor.executeTaskSegments(DefaultLifecycleExecutor.java:348)
	at org.apache.maven.lifecycle.DefaultLifecycleExecutor.execute(DefaultLifecycleExecutor.java:180)
	at org.apache.maven.lifecycle.LifecycleExecutorInterceptor.execute(LifecycleExecutorInterceptor.java:65)
	at org.apache.maven.DefaultMaven.doExecute(DefaultMaven.java:328)
	at org.apache.maven.DefaultMaven.execute(DefaultMaven.java:138)
	at org.apache.maven.cli.MavenCli.main(MavenCli.java:362)
	at sun.reflect.NativeMethodAccessorImpl.invoke0(Native Method)
	at sun.reflect.NativeMethodAccessorImpl.invoke(NativeMethodAccessorImpl.java:57)
	at sun.reflect.DelegatingMethodAccessorImpl.invoke(DelegatingMethodAccessorImpl.java:43)
	at java.lang.reflect.Method.invoke(Method.java:606)
	at org.codehaus.classworlds.Launcher.launchEnhanced(Launcher.java:315)
	at org.codehaus.classworlds.Launcher.launch(Launcher.java:255)
	at hudson.maven.agent.Main.launch(Main.java:205)
	at hudson.maven.MavenBuilder.call(MavenBuilder.java:154)
	at hudson.maven.Maven2Builder.call(Maven2Builder.java:79)
	at hudson.maven.Maven2Builder.call(Maven2Builder.java:55)
	at hudson.remoting.UserRequest.perform(UserRequest.java:118)
	at hudson.remoting.UserRequest.perform(UserRequest.java:48)
	at hudson.remoting.Request$2.run(Request.java:328)
	at hudson.remoting.InterceptingExecutorService$1.call(InterceptingExecutorService.java:72)
	at java.util.concurrent.FutureTask$Sync.innerRun(FutureTask.java:334)
	at java.util.concurrent.FutureTask.run(FutureTask.java:166)
	at java.util.concurrent.ThreadPoolExecutor.runWorker(ThreadPoolExecutor.java:1145)
	at java.util.concurrent.ThreadPoolExecutor$Worker.run(ThreadPoolExecutor.java:615)
	at java.lang.Thread.run(Thread.java:724)
Caused by: com.thoughtworks.xstream.converters.reflection.ObjectAccessException: Cannot construct org.apache.maven.plugin.war.util.WebappStructure as it does not have a no-args constructor
	at com.thoughtworks.xstream.converters.reflection.PureJavaReflectionProvider.newInstance(PureJavaReflectionProvider.java:59)
	at com.thoughtworks.xstream.converters.reflection.AbstractReflectionConverter.instantiateNewInstance(AbstractReflectionConverter.java:257)
	at com.thoughtworks.xstream.converters.reflection.AbstractReflectionConverter.unmarshal(AbstractReflectionConverter.java:124)
	at com.thoughtworks.xstream.core.TreeUnmarshaller.convert(TreeUnmarshaller.java:56)
	... 43 more
[INFO] ------------------------------------------------------------------------
[INFO] Total time: 2 minutes 56 seconds
[INFO] Finished at: Wed May 07 09:29:14 BST 2014
[INFO] Final Memory: 139M/333M
[INFO] ------------------------------------------------------------------------
Waiting for Jenkins to finish collecting data
[JENKINS] Archiving /local/jenkins/jobs/taverna-server-2.5.4/workspace/server-rmidaemon/pom.xml to uk.org.taverna.server/server-rmidaemon/2.5.4/server-rmidaemon-2.5.4.pom
[JENKINS] Archiving /local/jenkins/jobs/taverna-server-2.5.4/workspace/server-rmidaemon/target/server-rmidaemon-2.5.4.jar to uk.org.taverna.server/server-rmidaemon/2.5.4/server-rmidaemon-2.5.4.jar
[JENKINS] Archiving /local/jenkins/jobs/taverna-server-2.5.4/workspace/server-rmidaemon/target/server-rmidaemon-2.5.4-sources.jar to uk.org.taverna.server/server-rmidaemon/2.5.4/server-rmidaemon-2.5.4-sources.jar
[JENKINS] Archiving /local/jenkins/jobs/taverna-server-2.5.4/workspace/server-rmidaemon/target/server-rmidaemon-2.5.4-tests.jar to uk.org.taverna.server/server-rmidaemon/2.5.4/server-rmidaemon-2.5.4-tests.jar
[JENKINS] Archiving /local/jenkins/jobs/taverna-server-2.5.4/workspace/server-rmidaemon/target/server-rmidaemon-2.5.4-jar-with-dependencies.jar to uk.org.taverna.server/server-rmidaemon/2.5.4/server-rmidaemon-2.5.4-jar-with-dependencies.jar
[JENKINS] Archiving /local/jenkins/.m2/repository/uk/org/taverna/server/server/2.5.4/server-2.5.4.pom to uk.org.taverna.server/server/2.5.4/server-2.5.4.pom
[JENKINS] Archiving /local/jenkins/jobs/taverna-server-2.5.4/workspace/target/server-2.5.4-tests.jar to uk.org.taverna.server/server/2.5.4/server-2.5.4-tests.jar
/local/jenkins/.m2/repository/uk/org/taverna/server/server/2.5.4/server-2.5.4.pom is not inside /local/jenkins/jobs/taverna-server-2.5.4/workspace/; will archive in a separate pass
[JENKINS] Archiving /local/jenkins/jobs/taverna-server-2.5.4/workspace/server-runinterface/pom.xml to uk.org.taverna.server/server-runinterface/2.5.4/server-runinterface-2.5.4.pom
[JENKINS] Archiving /local/jenkins/jobs/taverna-server-2.5.4/workspace/server-runinterface/target/server-runinterface-2.5.4.jar to uk.org.taverna.server/server-runinterface/2.5.4/server-runinterface-2.5.4.jar
[JENKINS] Archiving /local/jenkins/jobs/taverna-server-2.5.4/workspace/server-runinterface/target/server-runinterface-2.5.4-sources.jar to uk.org.taverna.server/server-runinterface/2.5.4/server-runinterface-2.5.4-sources.jar
[JENKINS] Archiving /local/jenkins/jobs/taverna-server-2.5.4/workspace/server-runinterface/target/server-runinterface-2.5.4-tests.jar to uk.org.taverna.server/server-runinterface/2.5.4/server-runinterface-2.5.4-tests.jar
[JENKINS] Archiving /local/jenkins/jobs/taverna-server-2.5.4/workspace/server-webapp/pom.xml to uk.org.taverna.server/server-webapp/2.5.4/server-webapp-2.5.4.pom
[JENKINS] Archiving /local/jenkins/jobs/taverna-server-2.5.4/workspace/server-webapp/target/TavernaServer.2.5.4-sources.jar to uk.org.taverna.server/server-webapp/2.5.4/server-webapp-2.5.4-sources.jar
[JENKINS] Archiving /local/jenkins/jobs/taverna-server-2.5.4/workspace/server-webapp/target/TavernaServer.2.5.4-test-sources.jar to uk.org.taverna.server/server-webapp/2.5.4/server-webapp-2.5.4-test-sources.jar
[JENKINS] Archiving /local/jenkins/jobs/taverna-server-2.5.4/workspace/server-webapp/target/TavernaServer.2.5.4-tests.jar to uk.org.taverna.server/server-webapp/2.5.4/server-webapp-2.5.4-tests.jar
[JENKINS] Archiving /local/jenkins/jobs/taverna-server-2.5.4/workspace/server-port-description/pom.xml to uk.org.taverna.server/server-port-description/2.5.4/server-port-description-2.5.4.pom
[JENKINS] Archiving /local/jenkins/jobs/taverna-server-2.5.4/workspace/server-port-description/target/server-port-description-2.5.4.jar to uk.org.taverna.server/server-port-description/2.5.4/server-port-description-2.5.4.jar
[JENKINS] Archiving /local/jenkins/jobs/taverna-server-2.5.4/workspace/server-port-description/target/server-port-description-2.5.4-sources.jar to uk.org.taverna.server/server-port-description/2.5.4/server-port-description-2.5.4-sources.jar
[JENKINS] Archiving /local/jenkins/jobs/taverna-server-2.5.4/workspace/server-port-description/target/server-port-description-2.5.4-test-sources.jar to uk.org.taverna.server/server-port-description/2.5.4/server-port-description-2.5.4-test-sources.jar
[JENKINS] Archiving /local/jenkins/jobs/taverna-server-2.5.4/workspace/server-port-description/target/server-port-description-2.5.4-tests.jar to uk.org.taverna.server/server-port-description/2.5.4/server-port-description-2.5.4-tests.jar
[JENKINS] Archiving /local/jenkins/jobs/taverna-server-2.5.4/workspace/server-unix-forker/pom.xml to uk.org.taverna.server/server-unix-forker/2.5.4/server-unix-forker-2.5.4.pom
[JENKINS] Archiving /local/jenkins/jobs/taverna-server-2.5.4/workspace/server-unix-forker/target/server-unix-forker-2.5.4.jar to uk.org.taverna.server/server-unix-forker/2.5.4/server-unix-forker-2.5.4.jar
[JENKINS] Archiving /local/jenkins/jobs/taverna-server-2.5.4/workspace/server-unix-forker/target/server-unix-forker-2.5.4-sources.jar to uk.org.taverna.server/server-unix-forker/2.5.4/server-unix-forker-2.5.4-sources.jar
[JENKINS] Archiving /local/jenkins/jobs/taverna-server-2.5.4/workspace/server-unix-forker/target/server-unix-forker-2.5.4-tests.jar to uk.org.taverna.server/server-unix-forker/2.5.4/server-unix-forker-2.5.4-tests.jar
[JENKINS] Archiving /local/jenkins/jobs/taverna-server-2.5.4/workspace/server-unix-forker/target/server-unix-forker-2.5.4-jar-with-dependencies.jar to uk.org.taverna.server/server-unix-forker/2.5.4/server-unix-forker-2.5.4-jar-with-dependencies.jar
[JENKINS] Archiving /local/jenkins/jobs/taverna-server-2.5.4/workspace/server-usagerecord/pom.xml to uk.org.taverna.server/server-usagerecord/2.5.4/server-usagerecord-2.5.4.pom
[JENKINS] Archiving /local/jenkins/jobs/taverna-server-2.5.4/workspace/server-usagerecord/target/server-usagerecord-2.5.4.jar to uk.org.taverna.server/server-usagerecord/2.5.4/server-usagerecord-2.5.4.jar
[JENKINS] Archiving /local/jenkins/jobs/taverna-server-2.5.4/workspace/server-usagerecord/target/server-usagerecord-2.5.4-sources.jar to uk.org.taverna.server/server-usagerecord/2.5.4/server-usagerecord-2.5.4-sources.jar
[JENKINS] Archiving /local/jenkins/jobs/taverna-server-2.5.4/workspace/server-usagerecord/target/server-usagerecord-2.5.4-test-sources.jar to uk.org.taverna.server/server-usagerecord/2.5.4/server-usagerecord-2.5.4-test-sources.jar
[JENKINS] Archiving /local/jenkins/jobs/taverna-server-2.5.4/workspace/server-usagerecord/target/server-usagerecord-2.5.4-tests.jar to uk.org.taverna.server/server-usagerecord/2.5.4/server-usagerecord-2.5.4-tests.jar
[JENKINS] Archiving /local/jenkins/jobs/taverna-server-2.5.4/workspace/server-worker/pom.xml to uk.org.taverna.server/server-worker/2.5.4/server-worker-2.5.4.pom
[JENKINS] Archiving /local/jenkins/jobs/taverna-server-2.5.4/workspace/server-worker/target/server-worker-2.5.4.jar to uk.org.taverna.server/server-worker/2.5.4/server-worker-2.5.4.jar
[JENKINS] Archiving /local/jenkins/jobs/taverna-server-2.5.4/workspace/server-worker/target/server-worker-2.5.4-sources.jar to uk.org.taverna.server/server-worker/2.5.4/server-worker-2.5.4-sources.jar
[JENKINS] Archiving /local/jenkins/jobs/taverna-server-2.5.4/workspace/server-worker/target/server-worker-2.5.4-test-sources.jar to uk.org.taverna.server/server-worker/2.5.4/server-worker-2.5.4-test-sources.jar
[JENKINS] Archiving /local/jenkins/jobs/taverna-server-2.5.4/workspace/server-worker/target/server-worker-2.5.4-tests.jar to uk.org.taverna.server/server-worker/2.5.4/server-worker-2.5.4-tests.jar
[JENKINS] Archiving /local/jenkins/jobs/taverna-server-2.5.4/workspace/server-worker/target/server-worker-2.5.4-jar-with-dependencies.jar to uk.org.taverna.server/server-worker/2.5.4/server-worker-2.5.4-jar-with-dependencies.jar
Sending e-mails to: donal.k.fellows@manchester.ac.uk
channel stopped
Sending e-mails to: donal.k.fellows@manchester.ac.uk
Finished: FAILURE