SuccessConsole Output

maven31-agent.jar already up to date
maven31-interceptor.jar already up to date
maven3-interceptor-commons.jar already up to date
<===[JENKINS REMOTING CAPACITY]===>channel started
Executing Maven:  -B -f /var/lib/jenkins/workspace/taverna-localworker-activity-ui-maintenance/pom.xml -Dmaven.repo.local=/var/lib/jenkins/workspace/taverna-localworker-activity-ui-maintenance/.repository clean install -U
[INFO] Scanning for projects...
[INFO] Downloading: http://repository.mygrid.org.uk/artifactory/repo/net/sf/taverna/taverna-parent/2.6-SNAPSHOT/maven-metadata.xml
[INFO] Downloaded: http://repository.mygrid.org.uk/artifactory/repo/net/sf/taverna/taverna-parent/2.6-SNAPSHOT/maven-metadata.xml (799 B at 2.1 KB/sec)
[INFO] Initializing Artifactory Build-Info Recording
[HUDSON] Collecting dependencies info
[INFO] 
[INFO] Using the builder org.apache.maven.lifecycle.internal.builder.singlethreaded.SingleThreadedBuilder with a thread count of 1
[INFO]                                                                         
[INFO] ------------------------------------------------------------------------
[INFO] Building Taverna 2 Localworker Activity UI 1.6-SNAPSHOT
[INFO] ------------------------------------------------------------------------
[INFO] Downloading: http://repository.mygrid.org.uk/artifactory/repo/net/sf/taverna/t2/ui-api/activity-icons-api/1.6-SNAPSHOT/maven-metadata.xml
[INFO] Downloaded: http://repository.mygrid.org.uk/artifactory/repo/net/sf/taverna/t2/ui-api/activity-icons-api/1.6-SNAPSHOT/maven-metadata.xml (2 KB at 31.7 KB/sec)
[INFO] Downloading: http://repository.mygrid.org.uk/artifactory/repo/net/sf/taverna/t2/ui-api/1.6-SNAPSHOT/maven-metadata.xml
[INFO] Downloaded: http://repository.mygrid.org.uk/artifactory/repo/net/sf/taverna/t2/ui-api/1.6-SNAPSHOT/maven-metadata.xml (797 B at 21.6 KB/sec)
[INFO] Downloading: http://repository.mygrid.org.uk/artifactory/repo/net/sf/taverna/t2/ui-api/activity-palette-api/1.6-SNAPSHOT/maven-metadata.xml
[INFO] Downloaded: http://repository.mygrid.org.uk/artifactory/repo/net/sf/taverna/t2/ui-api/activity-palette-api/1.6-SNAPSHOT/maven-metadata.xml (2 KB at 36.7 KB/sec)
[INFO] Downloading: http://repository.mygrid.org.uk/artifactory/repo/net/sf/taverna/t2/infrastructure/spi-discovery-api/2.6-SNAPSHOT/maven-metadata.xml
[INFO] Downloaded: http://repository.mygrid.org.uk/artifactory/repo/net/sf/taverna/t2/infrastructure/spi-discovery-api/2.6-SNAPSHOT/maven-metadata.xml (2 KB at 11.8 KB/sec)
[INFO] Downloading: http://repository.mygrid.org.uk/artifactory/repo/net/sf/taverna/t2/infrastructure/2.6-SNAPSHOT/maven-metadata.xml
[INFO] Downloaded: http://repository.mygrid.org.uk/artifactory/repo/net/sf/taverna/t2/infrastructure/2.6-SNAPSHOT/maven-metadata.xml (802 B at 25.3 KB/sec)
[INFO] Downloading: http://repository.mygrid.org.uk/artifactory/repo/net/sf/taverna/t2/lang/observer/1.6-SNAPSHOT/maven-metadata.xml
[INFO] Downloaded: http://repository.mygrid.org.uk/artifactory/repo/net/sf/taverna/t2/lang/observer/1.6-SNAPSHOT/maven-metadata.xml (2 KB at 15.7 KB/sec)
[INFO] Downloading: http://repository.mygrid.org.uk/artifactory/repo/net/sf/taverna/t2/lang/1.6-SNAPSHOT/maven-metadata.xml
[INFO] Downloaded: http://repository.mygrid.org.uk/artifactory/repo/net/sf/taverna/t2/lang/1.6-SNAPSHOT/maven-metadata.xml (792 B at 17.6 KB/sec)
[INFO] Downloading: http://repository.mygrid.org.uk/artifactory/repo/net/sf/taverna/t2/infrastructure/raven/2.6-SNAPSHOT/maven-metadata.xml
[INFO] Downloaded: http://repository.mygrid.org.uk/artifactory/repo/net/sf/taverna/t2/infrastructure/raven/2.6-SNAPSHOT/maven-metadata.xml (2 KB at 19.6 KB/sec)
[INFO] Downloading: http://repository.mygrid.org.uk/artifactory/repo/net/sf/taverna/t2/infrastructure/raven-log4j/2.6-SNAPSHOT/maven-metadata.xml
[INFO] Downloaded: http://repository.mygrid.org.uk/artifactory/repo/net/sf/taverna/t2/infrastructure/raven-log4j/2.6-SNAPSHOT/maven-metadata.xml (2 KB at 30.0 KB/sec)
[INFO] Downloading: http://repository.mygrid.org.uk/artifactory/repo/net/sf/taverna/t2/infrastructure/appconfig/2.6-SNAPSHOT/maven-metadata.xml
[INFO] Downloaded: http://repository.mygrid.org.uk/artifactory/repo/net/sf/taverna/t2/infrastructure/appconfig/2.6-SNAPSHOT/maven-metadata.xml (2 KB at 27.6 KB/sec)
[INFO] Downloading: http://repository.mygrid.org.uk/artifactory/repo/net/sf/taverna/t2/infrastructure/launcher-api/2.6-SNAPSHOT/maven-metadata.xml
[INFO] Downloaded: http://repository.mygrid.org.uk/artifactory/repo/net/sf/taverna/t2/infrastructure/launcher-api/2.6-SNAPSHOT/maven-metadata.xml (2 KB at 22.9 KB/sec)
[INFO] Downloading: http://repository.mygrid.org.uk/artifactory/repo/net/sf/taverna/t2/infrastructure/prelauncher/2.6-SNAPSHOT/maven-metadata.xml
[INFO] Downloaded: http://repository.mygrid.org.uk/artifactory/repo/net/sf/taverna/t2/infrastructure/prelauncher/2.6-SNAPSHOT/maven-metadata.xml (2 KB at 41.8 KB/sec)
[INFO] Downloading: http://repository.mygrid.org.uk/artifactory/repo/net/sf/taverna/t2/lang/partition/1.6-SNAPSHOT/maven-metadata.xml
[INFO] Downloaded: http://repository.mygrid.org.uk/artifactory/repo/net/sf/taverna/t2/lang/partition/1.6-SNAPSHOT/maven-metadata.xml (2 KB at 22.8 KB/sec)
[INFO] Downloading: http://repository.mygrid.org.uk/artifactory/repo/net/sf/taverna/t2/ui-api/helper-api/1.6-SNAPSHOT/maven-metadata.xml
[INFO] Downloaded: http://repository.mygrid.org.uk/artifactory/repo/net/sf/taverna/t2/ui-api/helper-api/1.6-SNAPSHOT/maven-metadata.xml (2 KB at 12.7 KB/sec)
[INFO] Downloading: http://repository.mygrid.org.uk/artifactory/repo/net/sf/taverna/t2/lang/ui/1.6-SNAPSHOT/maven-metadata.xml
[INFO] Downloaded: http://repository.mygrid.org.uk/artifactory/repo/net/sf/taverna/t2/lang/ui/1.6-SNAPSHOT/maven-metadata.xml (2 KB at 24.0 KB/sec)
[INFO] Downloading: http://repository.mygrid.org.uk/artifactory/repo/net/sf/taverna/t2/ui-api/workbench-api/1.6-SNAPSHOT/maven-metadata.xml
[INFO] Downloaded: http://repository.mygrid.org.uk/artifactory/repo/net/sf/taverna/t2/ui-api/workbench-api/1.6-SNAPSHOT/maven-metadata.xml (2 KB at 23.4 KB/sec)
[INFO] Downloading: http://repository.mygrid.org.uk/artifactory/repo/net/sf/taverna/t2/ui-api/configuration-api/1.6-SNAPSHOT/maven-metadata.xml
[INFO] Downloaded: http://repository.mygrid.org.uk/artifactory/repo/net/sf/taverna/t2/ui-api/configuration-api/1.6-SNAPSHOT/maven-metadata.xml (2 KB at 24.3 KB/sec)
[INFO] Downloading: http://repository.mygrid.org.uk/artifactory/repo/net/sf/taverna/t2/core/workflowmodel-api/1.6-SNAPSHOT/maven-metadata.xml
[INFO] Downloaded: http://repository.mygrid.org.uk/artifactory/repo/net/sf/taverna/t2/core/workflowmodel-api/1.6-SNAPSHOT/maven-metadata.xml (2 KB at 17.3 KB/sec)
[INFO] Downloading: http://repository.mygrid.org.uk/artifactory/repo/net/sf/taverna/t2/core/1.6-SNAPSHOT/maven-metadata.xml
[INFO] Downloaded: http://repository.mygrid.org.uk/artifactory/repo/net/sf/taverna/t2/core/1.6-SNAPSHOT/maven-metadata.xml (795 B at 21.0 KB/sec)
[INFO] Downloading: http://repository.mygrid.org.uk/artifactory/repo/net/sf/taverna/t2/core/reference-api/1.6-SNAPSHOT/maven-metadata.xml
[INFO] Downloaded: http://repository.mygrid.org.uk/artifactory/repo/net/sf/taverna/t2/core/reference-api/1.6-SNAPSHOT/maven-metadata.xml (2 KB at 16.4 KB/sec)
[INFO] Downloading: http://repository.mygrid.org.uk/artifactory/repo/net/sf/taverna/t2/lang/beans/1.6-SNAPSHOT/maven-metadata.xml
[INFO] Downloaded: http://repository.mygrid.org.uk/artifactory/repo/net/sf/taverna/t2/lang/beans/1.6-SNAPSHOT/maven-metadata.xml (2 KB at 16.0 KB/sec)
[INFO] Downloading: http://repository.mygrid.org.uk/artifactory/repo/net/sf/taverna/t2/activities/dependency-activity/1.6-SNAPSHOT/maven-metadata.xml
[INFO] Downloaded: http://repository.mygrid.org.uk/artifactory/repo/net/sf/taverna/t2/activities/dependency-activity/1.6-SNAPSHOT/maven-metadata.xml (2 KB at 24.0 KB/sec)
[INFO] Downloading: http://repository.mygrid.org.uk/artifactory/repo/net/sf/taverna/t2/core/workflowmodel-impl/1.6-SNAPSHOT/maven-metadata.xml
[INFO] Downloaded: http://repository.mygrid.org.uk/artifactory/repo/net/sf/taverna/t2/core/workflowmodel-impl/1.6-SNAPSHOT/maven-metadata.xml (2 KB at 28.8 KB/sec)
[INFO] Downloading: http://repository.mygrid.org.uk/artifactory/repo/net/sf/taverna/t2/ui-impl/file-impl/1.6-SNAPSHOT/maven-metadata.xml
[INFO] Downloaded: http://repository.mygrid.org.uk/artifactory/repo/net/sf/taverna/t2/ui-impl/file-impl/1.6-SNAPSHOT/maven-metadata.xml (2 KB at 17.4 KB/sec)
[INFO] Downloading: http://repository.mygrid.org.uk/artifactory/repo/net/sf/taverna/t2/ui-impl/1.6-SNAPSHOT/maven-metadata.xml
[INFO] Downloaded: http://repository.mygrid.org.uk/artifactory/repo/net/sf/taverna/t2/ui-impl/1.6-SNAPSHOT/maven-metadata.xml (798 B at 20.5 KB/sec)
[INFO] Downloading: http://repository.mygrid.org.uk/artifactory/repo/net/sf/taverna/t2/ui-api/file-api/1.6-SNAPSHOT/maven-metadata.xml
[INFO] Downloaded: http://repository.mygrid.org.uk/artifactory/repo/net/sf/taverna/t2/ui-api/file-api/1.6-SNAPSHOT/maven-metadata.xml (2 KB at 15.3 KB/sec)
[INFO] Downloading: http://repository.mygrid.org.uk/artifactory/repo/net/sf/taverna/t2/ui-api/edits-api/1.6-SNAPSHOT/maven-metadata.xml
[INFO] Downloaded: http://repository.mygrid.org.uk/artifactory/repo/net/sf/taverna/t2/ui-api/edits-api/1.6-SNAPSHOT/maven-metadata.xml (2 KB at 16.9 KB/sec)
[INFO] Downloading: http://repository.mygrid.org.uk/artifactory/repo/net/sf/taverna/t2/ui-api/menu-api/1.6-SNAPSHOT/maven-metadata.xml
[INFO] Downloaded: http://repository.mygrid.org.uk/artifactory/repo/net/sf/taverna/t2/ui-api/menu-api/1.6-SNAPSHOT/maven-metadata.xml (2 KB at 21.5 KB/sec)
[INFO] Downloading: http://repository.mygrid.org.uk/artifactory/repo/net/sf/taverna/t2/ui-api/common-icons/1.6-SNAPSHOT/maven-metadata.xml
[INFO] Downloaded: http://repository.mygrid.org.uk/artifactory/repo/net/sf/taverna/t2/ui-api/common-icons/1.6-SNAPSHOT/maven-metadata.xml (2 KB at 32.4 KB/sec)
[INFO] Downloading: http://repository.mygrid.org.uk/artifactory/repo/net/sf/taverna/t2/activities/beanshell-activity/1.6-SNAPSHOT/maven-metadata.xml
[INFO] Downloaded: http://repository.mygrid.org.uk/artifactory/repo/net/sf/taverna/t2/activities/beanshell-activity/1.6-SNAPSHOT/maven-metadata.xml (2 KB at 24.0 KB/sec)
[INFO] Downloading: http://repository.mygrid.org.uk/artifactory/repo/net/sf/taverna/t2/activities/localworker-activity/1.6-SNAPSHOT/maven-metadata.xml
[INFO] Downloaded: http://repository.mygrid.org.uk/artifactory/repo/net/sf/taverna/t2/activities/localworker-activity/1.6-SNAPSHOT/maven-metadata.xml (2 KB at 20.7 KB/sec)
[INFO] Downloading: http://repository.mygrid.org.uk/artifactory/repo/net/sf/taverna/t2/ui-activities/beanshell-activity-ui/1.6-SNAPSHOT/maven-metadata.xml
[INFO] Downloaded: http://repository.mygrid.org.uk/artifactory/repo/net/sf/taverna/t2/ui-activities/beanshell-activity-ui/1.6-SNAPSHOT/maven-metadata.xml (2 KB at 24.5 KB/sec)
[INFO] Downloading: http://repository.mygrid.org.uk/artifactory/repo/net/sf/taverna/t2/ui-impl/contextual-views-impl/1.6-SNAPSHOT/maven-metadata.xml
[INFO] Downloaded: http://repository.mygrid.org.uk/artifactory/repo/net/sf/taverna/t2/ui-impl/contextual-views-impl/1.6-SNAPSHOT/maven-metadata.xml (2 KB at 15.9 KB/sec)
[INFO] Downloading: http://repository.mygrid.org.uk/artifactory/repo/net/sf/taverna/t2/ui-api/contextual-views-api/1.6-SNAPSHOT/maven-metadata.xml
[INFO] Downloaded: http://repository.mygrid.org.uk/artifactory/repo/net/sf/taverna/t2/ui-api/contextual-views-api/1.6-SNAPSHOT/maven-metadata.xml (2 KB at 18.9 KB/sec)
[INFO] Downloading: http://repository.mygrid.org.uk/artifactory/repo/net/sf/taverna/t2/ui-impl/workbench-impl/1.6-SNAPSHOT/maven-metadata.xml
[INFO] Downloaded: http://repository.mygrid.org.uk/artifactory/repo/net/sf/taverna/t2/ui-impl/workbench-impl/1.6-SNAPSHOT/maven-metadata.xml (2 KB at 17.5 KB/sec)
[INFO] Downloading: http://repository.mygrid.org.uk/artifactory/repo/net/sf/taverna/t2/lang/io/1.6-SNAPSHOT/maven-metadata.xml
[INFO] Downloaded: http://repository.mygrid.org.uk/artifactory/repo/net/sf/taverna/t2/lang/io/1.6-SNAPSHOT/maven-metadata.xml (2 KB at 29.5 KB/sec)
[INFO] Downloading: http://repository.mygrid.org.uk/artifactory/repo/net/sf/taverna/t2/ui-api/perspective-core/1.6-SNAPSHOT/maven-metadata.xml
[INFO] Downloaded: http://repository.mygrid.org.uk/artifactory/repo/net/sf/taverna/t2/ui-api/perspective-core/1.6-SNAPSHOT/maven-metadata.xml (2 KB at 13.8 KB/sec)
[INFO] Downloading: http://repository.mygrid.org.uk/artifactory/repo/net/sf/taverna/t2/ui-impl/configuration-impl/1.6-SNAPSHOT/maven-metadata.xml
[INFO] Downloaded: http://repository.mygrid.org.uk/artifactory/repo/net/sf/taverna/t2/ui-impl/configuration-impl/1.6-SNAPSHOT/maven-metadata.xml (2 KB at 13.7 KB/sec)
[INFO] Downloading: http://repository.mygrid.org.uk/artifactory/repo/net/sf/taverna/t2/ui-impl/helper/1.6-SNAPSHOT/maven-metadata.xml
[INFO] Downloaded: http://repository.mygrid.org.uk/artifactory/repo/net/sf/taverna/t2/ui-impl/helper/1.6-SNAPSHOT/maven-metadata.xml (977 B at 7.4 KB/sec)
[INFO] Downloading: http://repository.mygrid.org.uk/artifactory/repo/net/sf/taverna/t2/ui-impl/zaria/1.6-SNAPSHOT/maven-metadata.xml
[INFO] Downloaded: http://repository.mygrid.org.uk/artifactory/repo/net/sf/taverna/t2/ui-impl/zaria/1.6-SNAPSHOT/maven-metadata.xml (2 KB at 13.9 KB/sec)
[INFO] Downloading: http://repository.mygrid.org.uk/artifactory/repo/net/sf/taverna/t2/ui-impl/edits-impl/1.6-SNAPSHOT/maven-metadata.xml
[INFO] Downloaded: http://repository.mygrid.org.uk/artifactory/repo/net/sf/taverna/t2/ui-impl/edits-impl/1.6-SNAPSHOT/maven-metadata.xml (2 KB at 12.3 KB/sec)
[INFO] Downloading: http://repository.mygrid.org.uk/artifactory/repo/net/sf/taverna/t2/infrastructure/plugins-api/2.6-SNAPSHOT/maven-metadata.xml
[INFO] Downloaded: http://repository.mygrid.org.uk/artifactory/repo/net/sf/taverna/t2/infrastructure/plugins-api/2.6-SNAPSHOT/maven-metadata.xml (2 KB at 13.4 KB/sec)
[INFO] Downloading: http://repository.mygrid.org.uk/artifactory/repo/net/sf/taverna/t2/ui-impl/activity-tools/1.6-SNAPSHOT/maven-metadata.xml
[INFO] Downloaded: http://repository.mygrid.org.uk/artifactory/repo/net/sf/taverna/t2/ui-impl/activity-tools/1.6-SNAPSHOT/maven-metadata.xml (2 KB at 14.6 KB/sec)
[INFO] Downloading: http://repository.mygrid.org.uk/artifactory/repo/net/sf/taverna/t2/ui-components/workflow-view/1.6-SNAPSHOT/maven-metadata.xml
[INFO] Downloaded: http://repository.mygrid.org.uk/artifactory/repo/net/sf/taverna/t2/ui-components/workflow-view/1.6-SNAPSHOT/maven-metadata.xml (2 KB at 18.4 KB/sec)
[INFO] Downloading: http://repository.mygrid.org.uk/artifactory/repo/net/sf/taverna/t2/ui-components/1.6-SNAPSHOT/maven-metadata.xml
[INFO] Downloaded: http://repository.mygrid.org.uk/artifactory/repo/net/sf/taverna/t2/ui-components/1.6-SNAPSHOT/maven-metadata.xml (804 B at 14.8 KB/sec)
[INFO] Downloading: http://repository.mygrid.org.uk/artifactory/repo/net/sf/taverna/t2/ui-impl/menu-impl/1.6-SNAPSHOT/maven-metadata.xml
[INFO] Downloaded: http://repository.mygrid.org.uk/artifactory/repo/net/sf/taverna/t2/ui-impl/menu-impl/1.6-SNAPSHOT/maven-metadata.xml (2 KB at 27.1 KB/sec)
[INFO] Downloading: http://repository.mygrid.org.uk/artifactory/repo/net/sf/taverna/t2/ui-components/design-ui/1.6-SNAPSHOT/maven-metadata.xml
[INFO] Downloaded: http://repository.mygrid.org.uk/artifactory/repo/net/sf/taverna/t2/ui-components/design-ui/1.6-SNAPSHOT/maven-metadata.xml (2 KB at 14.6 KB/sec)
[INFO] Downloading: http://repository.mygrid.org.uk/artifactory/repo/net/sf/taverna/t2/ui-components/graph-view/1.6-SNAPSHOT/maven-metadata.xml
[INFO] Downloaded: http://repository.mygrid.org.uk/artifactory/repo/net/sf/taverna/t2/ui-components/graph-view/1.6-SNAPSHOT/maven-metadata.xml (2 KB at 20.4 KB/sec)
[INFO] Downloading: http://repository.mygrid.org.uk/artifactory/repo/net/sf/taverna/t2/ui-components/graph-model/1.6-SNAPSHOT/maven-metadata.xml
[INFO] Downloaded: http://repository.mygrid.org.uk/artifactory/repo/net/sf/taverna/t2/ui-components/graph-model/1.6-SNAPSHOT/maven-metadata.xml (2 KB at 19.2 KB/sec)
[INFO] Downloading: http://repository.mygrid.org.uk/artifactory/repo/net/sf/taverna/t2/ui-components/perspective-results/1.6-SNAPSHOT/maven-metadata.xml
[INFO] Downloaded: http://repository.mygrid.org.uk/artifactory/repo/net/sf/taverna/t2/ui-components/perspective-results/1.6-SNAPSHOT/maven-metadata.xml (2 KB at 16.6 KB/sec)
[INFO] 
[INFO] --- maven-clean-plugin:2.5:clean (default-clean) @ localworker-activity-ui ---
[INFO] Deleting /var/lib/jenkins/workspace/taverna-localworker-activity-ui-maintenance/target
[INFO] 
[INFO] --- maven-resources-plugin:2.6:resources (default-resources) @ localworker-activity-ui ---
[INFO] Using 'UTF-8' encoding to copy filtered resources.
[INFO] Copying 58 resources
[INFO] 
[INFO] --- maven-compiler-plugin:3.1:compile (default-compile) @ localworker-activity-ui ---
[INFO] Changes detected - recompiling the module!
[INFO] Compiling 8 source files to /var/lib/jenkins/workspace/taverna-localworker-activity-ui-maintenance/target/classes
[WARNING] /var/lib/jenkins/workspace/taverna-localworker-activity-ui-maintenance/src/main/java/net/sf/taverna/t2/activities/localworker/actions/LocalworkerActivityConfigurationAction.java: /var/lib/jenkins/workspace/taverna-localworker-activity-ui-maintenance/src/main/java/net/sf/taverna/t2/activities/localworker/actions/LocalworkerActivityConfigurationAction.java uses unchecked or unsafe operations.
[WARNING] /var/lib/jenkins/workspace/taverna-localworker-activity-ui-maintenance/src/main/java/net/sf/taverna/t2/activities/localworker/actions/LocalworkerActivityConfigurationAction.java: Recompile with -Xlint:unchecked for details.
[INFO] 
[INFO] --- maven-resources-plugin:2.6:testResources (default-testResources) @ localworker-activity-ui ---
[INFO] Using 'UTF-8' encoding to copy filtered resources.
[INFO] skip non existing resourceDirectory /var/lib/jenkins/workspace/taverna-localworker-activity-ui-maintenance/src/test/resources
[INFO] 
[INFO] --- maven-compiler-plugin:3.1:testCompile (default-testCompile) @ localworker-activity-ui ---
[INFO] Changes detected - recompiling the module!
[INFO] Compiling 1 source file to /var/lib/jenkins/workspace/taverna-localworker-activity-ui-maintenance/target/test-classes
[INFO] 
[INFO] --- maven-surefire-plugin:2.17:test (default-test) @ localworker-activity-ui ---
[INFO] Surefire report directory: /var/lib/jenkins/workspace/taverna-localworker-activity-ui-maintenance/target/surefire-reports

-------------------------------------------------------
 T E S T S
-------------------------------------------------------
Running net.sf.taverna.t2.activities.localworker.views.TestContextualViewFactory
ApplicationConfig could not determine application name, using unknownApplication-8152f667-174c-4bc5-8334-dd08caab46b1
log4j:WARN No appenders could be found for logger (net.sf.taverna.raven.appconfig.ApplicationUserHome).
log4j:WARN Please initialize the log4j system properly.
log4j:WARN See http://logging.apache.org/log4j/1.2/faq.html#noconfig for more info.
ApplicationConfig could not determine application name, using unknownApplication-8152f667-174c-4bc5-8334-dd08caab46b1
Tests run: 1, Failures: 0, Errors: 0, Skipped: 0, Time elapsed: 0.714 sec - in net.sf.taverna.t2.activities.localworker.views.TestContextualViewFactory

Results :

Tests run: 1, Failures: 0, Errors: 0, Skipped: 0

[JENKINS] Recording test results
[INFO] 
[INFO] --- maven-jar-plugin:2.4:jar (default-jar) @ localworker-activity-ui ---
[INFO] Building jar: /var/lib/jenkins/workspace/taverna-localworker-activity-ui-maintenance/target/localworker-activity-ui-1.6-SNAPSHOT.jar
[INFO] 
[INFO] >>> maven-source-plugin:2.2.1:jar (default) @ localworker-activity-ui >>>
[WARNING] Failed to getClass for org.apache.maven.plugin.source.SourceJarMojo
[INFO] 
[INFO] <<< maven-source-plugin:2.2.1:jar (default) @ localworker-activity-ui <<<
[INFO] 
[INFO] --- maven-source-plugin:2.2.1:jar (default) @ localworker-activity-ui ---
[INFO] Building jar: /var/lib/jenkins/workspace/taverna-localworker-activity-ui-maintenance/target/localworker-activity-ui-1.6-SNAPSHOT-sources.jar
[INFO] 
[INFO] >>> maven-source-plugin:2.2.1:test-jar (default) @ localworker-activity-ui >>>
[WARNING] Failed to getClass for org.apache.maven.plugin.source.TestSourceJarMojo
[INFO] 
[INFO] <<< maven-source-plugin:2.2.1:test-jar (default) @ localworker-activity-ui <<<
[INFO] 
[INFO] --- maven-source-plugin:2.2.1:test-jar (default) @ localworker-activity-ui ---
[INFO] Building jar: /var/lib/jenkins/workspace/taverna-localworker-activity-ui-maintenance/target/localworker-activity-ui-1.6-SNAPSHOT-test-sources.jar
[INFO] 
[INFO] --- maven-jar-plugin:2.4:test-jar (default) @ localworker-activity-ui ---
[INFO] Building jar: /var/lib/jenkins/workspace/taverna-localworker-activity-ui-maintenance/target/localworker-activity-ui-1.6-SNAPSHOT-tests.jar
[INFO] 
[INFO] --- maven-install-plugin:2.4:install (default-install) @ localworker-activity-ui ---
[INFO] Installing /var/lib/jenkins/workspace/taverna-localworker-activity-ui-maintenance/target/localworker-activity-ui-1.6-SNAPSHOT.jar to /var/lib/jenkins/workspace/taverna-localworker-activity-ui-maintenance/.repository/net/sf/taverna/t2/ui-activities/localworker-activity-ui/1.6-SNAPSHOT/localworker-activity-ui-1.6-SNAPSHOT.jar
[INFO] Installing /var/lib/jenkins/workspace/taverna-localworker-activity-ui-maintenance/pom.xml to /var/lib/jenkins/workspace/taverna-localworker-activity-ui-maintenance/.repository/net/sf/taverna/t2/ui-activities/localworker-activity-ui/1.6-SNAPSHOT/localworker-activity-ui-1.6-SNAPSHOT.pom
[INFO] Installing /var/lib/jenkins/workspace/taverna-localworker-activity-ui-maintenance/target/localworker-activity-ui-1.6-SNAPSHOT-sources.jar to /var/lib/jenkins/workspace/taverna-localworker-activity-ui-maintenance/.repository/net/sf/taverna/t2/ui-activities/localworker-activity-ui/1.6-SNAPSHOT/localworker-activity-ui-1.6-SNAPSHOT-sources.jar
[INFO] Installing /var/lib/jenkins/workspace/taverna-localworker-activity-ui-maintenance/target/localworker-activity-ui-1.6-SNAPSHOT-test-sources.jar to /var/lib/jenkins/workspace/taverna-localworker-activity-ui-maintenance/.repository/net/sf/taverna/t2/ui-activities/localworker-activity-ui/1.6-SNAPSHOT/localworker-activity-ui-1.6-SNAPSHOT-test-sources.jar
[INFO] Installing /var/lib/jenkins/workspace/taverna-localworker-activity-ui-maintenance/target/localworker-activity-ui-1.6-SNAPSHOT-tests.jar to /var/lib/jenkins/workspace/taverna-localworker-activity-ui-maintenance/.repository/net/sf/taverna/t2/ui-activities/localworker-activity-ui/1.6-SNAPSHOT/localworker-activity-ui-1.6-SNAPSHOT-tests.jar
[INFO] Artifactory Build Info Recorder: Saving Build Info to '/var/lib/jenkins/workspace/taverna-localworker-activity-ui-maintenance/target/build-info.json'
[INFO] Deploying artifact: http://repository.mygrid.org.uk/artifactory/libs-snapshot-local/net/sf/taverna/t2/ui-activities/localworker-activity-ui/1.6-SNAPSHOT/localworker-activity-ui-1.6-SNAPSHOT-tests.jar
[ERROR] org.jfrog.build.extractor.maven.BuildInfoRecorder.sessionEnded() listener has failed: 
java.lang.RuntimeException: Error occurred while publishing artifact to Artifactory: /var/lib/jenkins/workspace/taverna-localworker-activity-ui-maintenance/target/localworker-activity-ui-1.6-SNAPSHOT-tests.jar.
 Skipping deployment of remaining artifacts (if any) and build info.
	at org.jfrog.build.extractor.maven.BuildDeploymentHelper.deployArtifacts(BuildDeploymentHelper.java:272)
	at org.jfrog.build.extractor.maven.BuildDeploymentHelper.deploy(BuildDeploymentHelper.java:108)
	at org.jfrog.build.extractor.maven.BuildInfoRecorder.sessionEnded(BuildInfoRecorder.java:139)
	at org.apache.maven.lifecycle.internal.DefaultExecutionEventCatapult.fire(DefaultExecutionEventCatapult.java:64)
	at org.apache.maven.lifecycle.internal.DefaultExecutionEventCatapult.fire(DefaultExecutionEventCatapult.java:42)
	at org.apache.maven.lifecycle.internal.LifecycleStarter.execute(LifecycleStarter.java:125)
	at org.apache.maven.DefaultMaven.doExecute(DefaultMaven.java:361)
	at org.apache.maven.DefaultMaven.execute(DefaultMaven.java:155)
	at org.jvnet.hudson.maven3.launcher.Maven31Launcher.main(Maven31Launcher.java:132)
	at sun.reflect.NativeMethodAccessorImpl.invoke0(Native Method)
	at sun.reflect.NativeMethodAccessorImpl.invoke(NativeMethodAccessorImpl.java:57)
	at sun.reflect.DelegatingMethodAccessorImpl.invoke(DelegatingMethodAccessorImpl.java:43)
	at java.lang.reflect.Method.invoke(Method.java:606)
	at org.codehaus.plexus.classworlds.launcher.Launcher.launchStandard(Launcher.java:330)
	at org.codehaus.plexus.classworlds.launcher.Launcher.launch(Launcher.java:238)
	at jenkins.maven3.agent.Maven31Main.launch(Maven31Main.java:181)
	at sun.reflect.NativeMethodAccessorImpl.invoke0(Native Method)
	at sun.reflect.NativeMethodAccessorImpl.invoke(NativeMethodAccessorImpl.java:57)
	at sun.reflect.DelegatingMethodAccessorImpl.invoke(DelegatingMethodAccessorImpl.java:43)
	at java.lang.reflect.Method.invoke(Method.java:606)
	at hudson.maven.Maven3Builder.call(Maven3Builder.java:134)
	at hudson.maven.Maven3Builder.call(Maven3Builder.java:69)
	at hudson.remoting.UserRequest.perform(UserRequest.java:118)
	at hudson.remoting.UserRequest.perform(UserRequest.java:48)
	at hudson.remoting.Request$2.run(Request.java:328)
	at hudson.remoting.InterceptingExecutorService$1.call(InterceptingExecutorService.java:72)
	at java.util.concurrent.FutureTask.run(FutureTask.java:262)
	at java.util.concurrent.ThreadPoolExecutor.runWorker(ThreadPoolExecutor.java:1145)
	at java.util.concurrent.ThreadPoolExecutor$Worker.run(ThreadPoolExecutor.java:615)
	at java.lang.Thread.run(Thread.java:745)
Caused by: java.io.IOException: Failed to deploy file: HTTP response code: 401. HTTP response message: Unauthorized
	at org.jfrog.build.client.ArtifactoryBuildInfoClient.throwHttpIOException(ArtifactoryBuildInfoClient.java:652)
	at org.jfrog.build.client.ArtifactoryBuildInfoClient.uploadFile(ArtifactoryBuildInfoClient.java:527)
	at org.jfrog.build.client.ArtifactoryBuildInfoClient.deployArtifact(ArtifactoryBuildInfoClient.java:302)
	at org.jfrog.build.extractor.maven.BuildDeploymentHelper.deployArtifacts(BuildDeploymentHelper.java:270)
	... 29 more
[ERROR] Internal error: java.lang.RuntimeException: org.jfrog.build.extractor.maven.BuildInfoRecorder.sessionEnded() listener has failed: Error occurred while publishing artifact to Artifactory: /var/lib/jenkins/workspace/taverna-localworker-activity-ui-maintenance/target/localworker-activity-ui-1.6-SNAPSHOT-tests.jar.
[ERROR] Skipping deployment of remaining artifacts (if any) and build info. Failed to deploy file: HTTP response code: 401. HTTP response message: Unauthorized
[ERROR] -> [Help 1]
org.apache.maven.InternalErrorException: Internal error: java.lang.RuntimeException: org.jfrog.build.extractor.maven.BuildInfoRecorder.sessionEnded() listener has failed: 
	at org.apache.maven.DefaultMaven.execute(DefaultMaven.java:167)
	at org.jvnet.hudson.maven3.launcher.Maven31Launcher.main(Maven31Launcher.java:132)
	at sun.reflect.NativeMethodAccessorImpl.invoke0(Native Method)
	at sun.reflect.NativeMethodAccessorImpl.invoke(NativeMethodAccessorImpl.java:57)
	at sun.reflect.DelegatingMethodAccessorImpl.invoke(DelegatingMethodAccessorImpl.java:43)
	at java.lang.reflect.Method.invoke(Method.java:606)
	at org.codehaus.plexus.classworlds.launcher.Launcher.launchStandard(Launcher.java:330)
	at org.codehaus.plexus.classworlds.launcher.Launcher.launch(Launcher.java:238)
	at jenkins.maven3.agent.Maven31Main.launch(Maven31Main.java:181)
	at sun.reflect.NativeMethodAccessorImpl.invoke0(Native Method)
	at sun.reflect.NativeMethodAccessorImpl.invoke(NativeMethodAccessorImpl.java:57)
	at sun.reflect.DelegatingMethodAccessorImpl.invoke(DelegatingMethodAccessorImpl.java:43)
	at java.lang.reflect.Method.invoke(Method.java:606)
	at hudson.maven.Maven3Builder.call(Maven3Builder.java:134)
	at hudson.maven.Maven3Builder.call(Maven3Builder.java:69)
	at hudson.remoting.UserRequest.perform(UserRequest.java:118)
	at hudson.remoting.UserRequest.perform(UserRequest.java:48)
	at hudson.remoting.Request$2.run(Request.java:328)
	at hudson.remoting.InterceptingExecutorService$1.call(InterceptingExecutorService.java:72)
	at java.util.concurrent.FutureTask.run(FutureTask.java:262)
	at java.util.concurrent.ThreadPoolExecutor.runWorker(ThreadPoolExecutor.java:1145)
	at java.util.concurrent.ThreadPoolExecutor$Worker.run(ThreadPoolExecutor.java:615)
	at java.lang.Thread.run(Thread.java:745)
Caused by: java.lang.RuntimeException: org.jfrog.build.extractor.maven.BuildInfoRecorder.sessionEnded() listener has failed: 
	at org.jfrog.build.extractor.maven.BuildInfoRecorder.sessionEnded(BuildInfoRecorder.java:150)
	at org.apache.maven.lifecycle.internal.DefaultExecutionEventCatapult.fire(DefaultExecutionEventCatapult.java:64)
	at org.apache.maven.lifecycle.internal.DefaultExecutionEventCatapult.fire(DefaultExecutionEventCatapult.java:42)
	at org.apache.maven.lifecycle.internal.LifecycleStarter.execute(LifecycleStarter.java:125)
	at org.apache.maven.DefaultMaven.doExecute(DefaultMaven.java:361)
	at org.apache.maven.DefaultMaven.execute(DefaultMaven.java:155)
	... 22 more
Caused by: java.lang.RuntimeException: Error occurred while publishing artifact to Artifactory: /var/lib/jenkins/workspace/taverna-localworker-activity-ui-maintenance/target/localworker-activity-ui-1.6-SNAPSHOT-tests.jar.
 Skipping deployment of remaining artifacts (if any) and build info.
	at org.jfrog.build.extractor.maven.BuildDeploymentHelper.deployArtifacts(BuildDeploymentHelper.java:272)
	at org.jfrog.build.extractor.maven.BuildDeploymentHelper.deploy(BuildDeploymentHelper.java:108)
	at org.jfrog.build.extractor.maven.BuildInfoRecorder.sessionEnded(BuildInfoRecorder.java:139)
	... 27 more
Caused by: java.io.IOException: Failed to deploy file: HTTP response code: 401. HTTP response message: Unauthorized
	at org.jfrog.build.client.ArtifactoryBuildInfoClient.throwHttpIOException(ArtifactoryBuildInfoClient.java:652)
	at org.jfrog.build.client.ArtifactoryBuildInfoClient.uploadFile(ArtifactoryBuildInfoClient.java:527)
	at org.jfrog.build.client.ArtifactoryBuildInfoClient.deployArtifact(ArtifactoryBuildInfoClient.java:302)
	at org.jfrog.build.extractor.maven.BuildDeploymentHelper.deployArtifacts(BuildDeploymentHelper.java:270)
	... 29 more
[ERROR] 
[ERROR] To see the full stack trace of the errors, re-run Maven with the -e switch.
[ERROR] Re-run Maven using the -X switch to enable full debug logging.
[ERROR] 
[ERROR] For more information about the errors and possible solutions, please read the following articles:
[ERROR] [Help 1] http://cwiki.apache.org/confluence/display/MAVEN/InternalErrorException