FailedConsole Output

Started by user Stian Soiland-Reyes (stain)
Building on master in workspace /local/jenkins/jobs/taverna-localworker-activity-maintenance/workspace
 > /usr/bin/git rev-parse --is-inside-work-tree
Fetching changes from the remote Git repository
 > /usr/bin/git config remote.origin.url git://github.com/taverna/taverna-localworker-activity.git
Fetching upstream changes from git://github.com/taverna/taverna-localworker-activity.git
 > /usr/bin/git --version
 > /usr/bin/git fetch --tags --progress git://github.com/taverna/taverna-localworker-activity.git +refs/heads/*:refs/remotes/origin/*
 > /usr/bin/git rev-parse origin/maintenance^{commit}
Checking out Revision 7083579d87d0fb02ce7b3a77c18de90e984516f2 (origin/maintenance)
 > /usr/bin/git config core.sparsecheckout
 > /usr/bin/git checkout -f 7083579d87d0fb02ce7b3a77c18de90e984516f2
 > /usr/bin/git rev-list 7083579d87d0fb02ce7b3a77c18de90e984516f2
Parsing POMs
[workspace] $ /local/jenkins/tools/hudson.model.JDK/jdk7/bin/java -Xmx1024m -XX:MaxPermSize=1024m -cp /local/jenkins/plugins/maven-plugin/WEB-INF/lib/maven31-agent-1.5.jar:/local/jenkins/tools/hudson.tasks.Maven_MavenInstallation/maven_3.2.1/boot/plexus-classworlds-2.5.1.jar:/local/jenkins/tools/hudson.tasks.Maven_MavenInstallation/maven_3.2.1/conf/logging jenkins.maven3.agent.Maven31Main /local/jenkins/tools/hudson.tasks.Maven_MavenInstallation/maven_3.2.1 /var/cache/jenkins/war/WEB-INF/lib/remoting-2.40.jar /local/jenkins/plugins/maven-plugin/WEB-INF/lib/maven31-interceptor-1.5.jar /local/jenkins/plugins/maven-plugin/WEB-INF/lib/maven3-interceptor-commons-1.5.jar 53395
<===[JENKINS REMOTING CAPACITY]===>channel started
Executing Maven:  -B -f /local/jenkins/jobs/taverna-localworker-activity-maintenance/workspace/pom.xml -Dmaven.repo.local=/local/jenkins/jobs/taverna-localworker-activity-maintenance/workspace/.repository clean install
[INFO] Scanning for projects...
[INFO] Initializing Artifactory Build-Info Recording
[HUDSON] Collecting dependencies info[INFO] 
[INFO] Using the builder org.apache.maven.lifecycle.internal.builder.singlethreaded.SingleThreadedBuilder with a thread count of 1

[INFO]                                                                         
[INFO] ------------------------------------------------------------------------
[INFO] Building Taverna 2 Localworker Activity 1.6-SNAPSHOT
[INFO] ------------------------------------------------------------------------
[INFO] Downloading: http://repository.mygrid.org.uk/artifactory/repo/net/sf/taverna/t2/infrastructure/2.6-SNAPSHOT/infrastructure-2.6-20140514.092153-1.pom
[INFO] ------------------------------------------------------------------------
[INFO] BUILD FAILURE
[INFO] ------------------------------------------------------------------------
[INFO] Total time: 01:04 min
[INFO] Finished at: 2014-05-14T16:25:15+00:00
[INFO] Final Memory: 11M/88M
[INFO] ------------------------------------------------------------------------
[ERROR] Failed to execute goal on project localworker-activity: Could not resolve dependencies for project net.sf.taverna.t2.activities:localworker-activity:jar:1.6-SNAPSHOT: Failed to collect dependencies at net.sf.taverna.t2.core:workflowmodel-api:jar:1.6-SNAPSHOT -> net.sf.taverna.t2.infrastructure:spi-discovery-api:jar:2.6-SNAPSHOT: Failed to read artifact descriptor for net.sf.taverna.t2.infrastructure:spi-discovery-api:jar:2.6-SNAPSHOT: Could not transfer artifact net.sf.taverna.t2:infrastructure:pom:2.6-20140514.092153-1 from/to mygrid-snapshot-repository (http://repository.mygrid.org.uk/artifactory/repo): Failed to transfer file: http://repository.mygrid.org.uk/artifactory/repo/net/sf/taverna/t2/infrastructure/2.6-SNAPSHOT/infrastructure-2.6-20140514.092153-1.pom. Return code is: 503, ReasonPhrase: Service Temporarily Unavailable. -> [Help 1]
[ERROR] 
[ERROR] To see the full stack trace of the errors, re-run Maven with the -e switch.
[ERROR] Re-run Maven using the -X switch to enable full debug logging.
[ERROR] 
[ERROR] For more information about the errors and possible solutions, please read the following articles:
[ERROR] [Help 1] http://cwiki.apache.org/confluence/display/MAVEN/DependencyResolutionException
[JENKINS] Archiving /local/jenkins/jobs/taverna-localworker-activity-maintenance/workspace/pom.xml to net.sf.taverna.t2.activities/localworker-activity/1.6-SNAPSHOT/localworker-activity-1.6-SNAPSHOT.pom
channel stopped
Warning: you have no plugins providing access control for builds, so falling back to legacy behavior of permitting any downstream builds to be triggered
Finished: FAILURE