SuccessConsole Output

maven31-agent.jar already up to date
maven31-interceptor.jar already up to date
maven3-interceptor-commons.jar already up to date
<===[JENKINS REMOTING CAPACITY]===>channel started
Executing Maven:  -B -f /var/lib/jenkins/workspace/taverna-engine-referencetypes-maintenance/pom.xml -Dmaven.repo.local=/var/lib/jenkins/workspace/taverna-engine-referencetypes-maintenance/.repository clean install -U
[INFO] Scanning for projects...
[INFO] [buildinfo] Properties file found at '/tmp/buildInfo7746182302506571603.properties'
[INFO] Downloading: http://repository.mygrid.org.uk/artifactory/repo/net/sf/taverna/taverna-parent/2.6-SNAPSHOT/maven-metadata.xml
[INFO] Downloaded: http://repository.mygrid.org.uk/artifactory/repo/net/sf/taverna/taverna-parent/2.6-SNAPSHOT/maven-metadata.xml (799 B at 2.4 KB/sec)
[INFO] [buildinfo] Properties file found at '/tmp/buildInfo7746182302506571603.properties'
[INFO] Initializing Artifactory Build-Info Recording
[HUDSON] Collecting dependencies info
[INFO] 
[INFO] Using the builder org.apache.maven.lifecycle.internal.builder.singlethreaded.SingleThreadedBuilder with a thread count of 1
[INFO]                                                                         
[INFO] ------------------------------------------------------------------------
[INFO] Building Taverna engine referencetypes 1.6-SNAPSHOT
[INFO] ------------------------------------------------------------------------
[INFO] Downloading: http://repository.mygrid.org.uk/artifactory/repo/net/sf/taverna/t2/core/reference-api/1.6-SNAPSHOT/maven-metadata.xml
[INFO] Downloaded: http://repository.mygrid.org.uk/artifactory/repo/net/sf/taverna/t2/core/reference-api/1.6-SNAPSHOT/maven-metadata.xml (2 KB at 23.7 KB/sec)
[INFO] Downloading: http://repository.mygrid.org.uk/artifactory/repo/net/sf/taverna/t2/core/1.6-SNAPSHOT/maven-metadata.xml
[INFO] Downloaded: http://repository.mygrid.org.uk/artifactory/repo/net/sf/taverna/t2/core/1.6-SNAPSHOT/maven-metadata.xml (792 B at 13.3 KB/sec)
[INFO] Downloading: http://repository.mygrid.org.uk/artifactory/repo/net/sf/taverna/t2/core/reference-testhelpers/1.6-SNAPSHOT/maven-metadata.xml
[INFO] Downloaded: http://repository.mygrid.org.uk/artifactory/repo/net/sf/taverna/t2/core/reference-testhelpers/1.6-SNAPSHOT/maven-metadata.xml (2 KB at 18.6 KB/sec)
[INFO] Downloading: http://repository.mygrid.org.uk/artifactory/repo/net/sf/taverna/t2/core/reference-impl/1.6-SNAPSHOT/maven-metadata.xml
[INFO] Downloaded: http://repository.mygrid.org.uk/artifactory/repo/net/sf/taverna/t2/core/reference-impl/1.6-SNAPSHOT/maven-metadata.xml (2 KB at 36.2 KB/sec)
[INFO] Downloading: http://repository.mygrid.org.uk/artifactory/repo/net/sf/taverna/t2/infrastructure/raven/2.6-SNAPSHOT/maven-metadata.xml
[INFO] Downloaded: http://repository.mygrid.org.uk/artifactory/repo/net/sf/taverna/t2/infrastructure/raven/2.6-SNAPSHOT/maven-metadata.xml (2 KB at 30.6 KB/sec)
[INFO] Downloading: http://repository.mygrid.org.uk/artifactory/repo/net/sf/taverna/t2/infrastructure/2.6-SNAPSHOT/maven-metadata.xml
[INFO] Downloaded: http://repository.mygrid.org.uk/artifactory/repo/net/sf/taverna/t2/infrastructure/2.6-SNAPSHOT/maven-metadata.xml (802 B at 25.3 KB/sec)
[INFO] Downloading: http://repository.mygrid.org.uk/artifactory/repo/net/sf/taverna/t2/infrastructure/appconfig/2.6-SNAPSHOT/maven-metadata.xml
[INFO] Downloaded: http://repository.mygrid.org.uk/artifactory/repo/net/sf/taverna/t2/infrastructure/appconfig/2.6-SNAPSHOT/maven-metadata.xml (2 KB at 28.1 KB/sec)
[INFO] Downloading: http://repository.mygrid.org.uk/artifactory/repo/net/sf/taverna/t2/infrastructure/launcher-api/2.6-SNAPSHOT/maven-metadata.xml
[INFO] Downloaded: http://repository.mygrid.org.uk/artifactory/repo/net/sf/taverna/t2/infrastructure/launcher-api/2.6-SNAPSHOT/maven-metadata.xml (2 KB at 22.5 KB/sec)
[INFO] Downloading: http://repository.mygrid.org.uk/artifactory/repo/net/sf/taverna/t2/infrastructure/prelauncher/2.6-SNAPSHOT/maven-metadata.xml
[INFO] Downloaded: http://repository.mygrid.org.uk/artifactory/repo/net/sf/taverna/t2/infrastructure/prelauncher/2.6-SNAPSHOT/maven-metadata.xml (2 KB at 44.5 KB/sec)
[INFO] Downloading: http://repository.mygrid.org.uk/artifactory/repo/net/sf/taverna/t2/infrastructure/raven-log4j/2.6-SNAPSHOT/maven-metadata.xml
[INFO] Downloaded: http://repository.mygrid.org.uk/artifactory/repo/net/sf/taverna/t2/infrastructure/raven-log4j/2.6-SNAPSHOT/maven-metadata.xml (2 KB at 27.8 KB/sec)
[INFO] 
[INFO] --- maven-clean-plugin:2.5:clean (default-clean) @ reference-core-extensions ---
[INFO] Deleting /var/lib/jenkins/workspace/taverna-engine-referencetypes-maintenance/target
[INFO] 
[INFO] --- maven-resources-plugin:2.6:resources (default-resources) @ reference-core-extensions ---
[INFO] Using 'UTF-8' encoding to copy filtered resources.
[INFO] Copying 10 resources
[INFO] 
[INFO] --- maven-compiler-plugin:3.1:compile (default-compile) @ reference-core-extensions ---
[INFO] Changes detected - recompiling the module!
[INFO] Compiling 23 source files to /var/lib/jenkins/workspace/taverna-engine-referencetypes-maintenance/target/classes
[INFO] 
[INFO] --- maven-resources-plugin:2.6:testResources (default-testResources) @ reference-core-extensions ---
[INFO] Using 'UTF-8' encoding to copy filtered resources.
[INFO] skip non existing resourceDirectory /var/lib/jenkins/workspace/taverna-engine-referencetypes-maintenance/src/test/resources
[INFO] 
[INFO] --- maven-compiler-plugin:3.1:testCompile (default-testCompile) @ reference-core-extensions ---
[INFO] Changes detected - recompiling the module!
[INFO] Compiling 1 source file to /var/lib/jenkins/workspace/taverna-engine-referencetypes-maintenance/target/test-classes
[INFO] 
[INFO] --- maven-surefire-plugin:2.17:test (default-test) @ reference-core-extensions ---
[INFO] Surefire report directory: /var/lib/jenkins/workspace/taverna-engine-referencetypes-maintenance/target/surefire-reports

-------------------------------------------------------
 T E S T S
-------------------------------------------------------
Running net.sf.taverna.t2.reference.impl.external.object.ByteArrayToStringTest
Tests run: 4, Failures: 0, Errors: 0, Skipped: 0, Time elapsed: 0.158 sec - in net.sf.taverna.t2.reference.impl.external.object.ByteArrayToStringTest

Results :

Tests run: 4, Failures: 0, Errors: 0, Skipped: 0

[JENKINS] Recording test results
[INFO] 
[INFO] --- maven-jar-plugin:2.4:jar (default-jar) @ reference-core-extensions ---
[INFO] Downloading: http://repository.mygrid.org.uk/artifactory/repo/org/apache/maven/maven-archiver/2.5/maven-archiver-2.5.pom
[INFO] Downloaded: http://repository.mygrid.org.uk/artifactory/repo/org/apache/maven/maven-archiver/2.5/maven-archiver-2.5.pom (5 KB at 85.2 KB/sec)
[INFO] Downloading: http://repository.mygrid.org.uk/artifactory/repo/org/codehaus/plexus/plexus-interpolation/1.15/plexus-interpolation-1.15.pom
[INFO] Downloaded: http://repository.mygrid.org.uk/artifactory/repo/org/codehaus/plexus/plexus-interpolation/1.15/plexus-interpolation-1.15.pom (1018 B at 24.2 KB/sec)
[INFO] Downloading: http://repository.mygrid.org.uk/artifactory/repo/org/apache/maven/maven-archiver/2.5/maven-archiver-2.5.jar
[INFO] Downloading: http://repository.mygrid.org.uk/artifactory/repo/org/codehaus/plexus/plexus-interpolation/1.15/plexus-interpolation-1.15.jar
[INFO] Downloading: http://repository.mygrid.org.uk/artifactory/repo/org/codehaus/plexus/plexus-archiver/2.1/plexus-archiver-2.1.jar
[INFO] Downloading: http://repository.mygrid.org.uk/artifactory/repo/commons-lang/commons-lang/2.1/commons-lang-2.1.jar
[INFO] Downloading: http://repository.mygrid.org.uk/artifactory/repo/org/codehaus/plexus/plexus-io/2.0.2/plexus-io-2.0.2.jar
[INFO] Downloaded: http://repository.mygrid.org.uk/artifactory/repo/org/apache/maven/maven-archiver/2.5/maven-archiver-2.5.jar (22 KB at 234.1 KB/sec)
[INFO] Downloaded: http://repository.mygrid.org.uk/artifactory/repo/org/codehaus/plexus/plexus-interpolation/1.15/plexus-interpolation-1.15.jar (60 KB at 228.9 KB/sec)
[INFO] Downloaded: http://repository.mygrid.org.uk/artifactory/repo/org/codehaus/plexus/plexus-io/2.0.2/plexus-io-2.0.2.jar (57 KB at 206.2 KB/sec)
[INFO] Downloaded: http://repository.mygrid.org.uk/artifactory/repo/org/codehaus/plexus/plexus-archiver/2.1/plexus-archiver-2.1.jar (181 KB at 281.0 KB/sec)
[INFO] Downloaded: http://repository.mygrid.org.uk/artifactory/repo/commons-lang/commons-lang/2.1/commons-lang-2.1.jar (203 KB at 286.1 KB/sec)
[INFO] Building jar: /var/lib/jenkins/workspace/taverna-engine-referencetypes-maintenance/target/reference-core-extensions-1.6-SNAPSHOT.jar
[INFO] 
[INFO] >>> maven-source-plugin:2.2.1:jar (default) @ reference-core-extensions >>>
[WARNING] Failed to getClass for org.apache.maven.plugin.source.SourceJarMojo
[INFO] 
[INFO] <<< maven-source-plugin:2.2.1:jar (default) @ reference-core-extensions <<<
[INFO] 
[INFO] --- maven-source-plugin:2.2.1:jar (default) @ reference-core-extensions ---
[INFO] Downloading: http://repository.mygrid.org.uk/artifactory/repo/org/codehaus/plexus/plexus-archiver/2.2/plexus-archiver-2.2.pom
[INFO] Downloaded: http://repository.mygrid.org.uk/artifactory/repo/org/codehaus/plexus/plexus-archiver/2.2/plexus-archiver-2.2.pom (4 KB at 92.3 KB/sec)
[INFO] Downloading: http://repository.mygrid.org.uk/artifactory/repo/org/codehaus/plexus/plexus-components/1.1.20/plexus-components-1.1.20.pom
[INFO] Downloaded: http://repository.mygrid.org.uk/artifactory/repo/org/codehaus/plexus/plexus-components/1.1.20/plexus-components-1.1.20.pom (3 KB at 27.5 KB/sec)
[INFO] Downloading: http://repository.mygrid.org.uk/artifactory/repo/org/codehaus/plexus/plexus/3.1/plexus-3.1.pom
[INFO] Downloaded: http://repository.mygrid.org.uk/artifactory/repo/org/codehaus/plexus/plexus/3.1/plexus-3.1.pom (19 KB at 288.6 KB/sec)
[INFO] Downloading: http://repository.mygrid.org.uk/artifactory/repo/org/codehaus/plexus/plexus-utils/3.0.7/plexus-utils-3.0.7.pom
[INFO] Downloaded: http://repository.mygrid.org.uk/artifactory/repo/org/codehaus/plexus/plexus-utils/3.0.7/plexus-utils-3.0.7.pom (3 KB at 81.8 KB/sec)
[INFO] Downloading: http://repository.mygrid.org.uk/artifactory/repo/org/codehaus/plexus/plexus-io/2.0.4/plexus-io-2.0.4.pom
[INFO] Downloaded: http://repository.mygrid.org.uk/artifactory/repo/org/codehaus/plexus/plexus-io/2.0.4/plexus-io-2.0.4.pom (2 KB at 51.3 KB/sec)
[INFO] Downloading: http://repository.mygrid.org.uk/artifactory/repo/org/codehaus/plexus/plexus-archiver/2.2/plexus-archiver-2.2.jar
[INFO] Downloading: http://repository.mygrid.org.uk/artifactory/repo/org/codehaus/plexus/plexus-io/2.0.4/plexus-io-2.0.4.jar
[INFO] Downloading: http://repository.mygrid.org.uk/artifactory/repo/org/codehaus/plexus/plexus-utils/3.0.8/plexus-utils-3.0.8.jar
[INFO] Downloaded: http://repository.mygrid.org.uk/artifactory/repo/org/codehaus/plexus/plexus-io/2.0.4/plexus-io-2.0.4.jar (57 KB at 434.5 KB/sec)
[INFO] Downloaded: http://repository.mygrid.org.uk/artifactory/repo/org/codehaus/plexus/plexus-utils/3.0.8/plexus-utils-3.0.8.jar (227 KB at 1414.9 KB/sec)
[INFO] Downloaded: http://repository.mygrid.org.uk/artifactory/repo/org/codehaus/plexus/plexus-archiver/2.2/plexus-archiver-2.2.jar (181 KB at 104.2 KB/sec)
[INFO] Building jar: /var/lib/jenkins/workspace/taverna-engine-referencetypes-maintenance/target/reference-core-extensions-1.6-SNAPSHOT-sources.jar
[INFO] 
[INFO] >>> maven-source-plugin:2.2.1:test-jar (default) @ reference-core-extensions >>>
[WARNING] Failed to getClass for org.apache.maven.plugin.source.TestSourceJarMojo
[INFO] 
[INFO] <<< maven-source-plugin:2.2.1:test-jar (default) @ reference-core-extensions <<<
[INFO] 
[INFO] --- maven-source-plugin:2.2.1:test-jar (default) @ reference-core-extensions ---
[INFO] Building jar: /var/lib/jenkins/workspace/taverna-engine-referencetypes-maintenance/target/reference-core-extensions-1.6-SNAPSHOT-test-sources.jar
[INFO] 
[INFO] --- maven-jar-plugin:2.4:test-jar (default) @ reference-core-extensions ---
[INFO] Building jar: /var/lib/jenkins/workspace/taverna-engine-referencetypes-maintenance/target/reference-core-extensions-1.6-SNAPSHOT-tests.jar
[INFO] 
[INFO] --- maven-install-plugin:2.4:install (default-install) @ reference-core-extensions ---
[INFO] Downloading: http://repository.mygrid.org.uk/artifactory/repo/org/codehaus/plexus/plexus-utils/3.0.5/plexus-utils-3.0.5.pom
[INFO] Downloaded: http://repository.mygrid.org.uk/artifactory/repo/org/codehaus/plexus/plexus-utils/3.0.5/plexus-utils-3.0.5.pom (3 KB at 48.1 KB/sec)
[INFO] Downloading: http://repository.mygrid.org.uk/artifactory/repo/org/codehaus/plexus/plexus-digest/1.0/plexus-digest-1.0.pom
[INFO] Downloaded: http://repository.mygrid.org.uk/artifactory/repo/org/codehaus/plexus/plexus-digest/1.0/plexus-digest-1.0.pom (2 KB at 27.2 KB/sec)
[INFO] Downloading: http://repository.mygrid.org.uk/artifactory/repo/org/codehaus/plexus/plexus-components/1.1.7/plexus-components-1.1.7.pom
[INFO] Downloaded: http://repository.mygrid.org.uk/artifactory/repo/org/codehaus/plexus/plexus-components/1.1.7/plexus-components-1.1.7.pom (5 KB at 202.4 KB/sec)
[INFO] Downloading: http://repository.mygrid.org.uk/artifactory/repo/org/codehaus/plexus/plexus/1.0.8/plexus-1.0.8.pom
[INFO] Downloaded: http://repository.mygrid.org.uk/artifactory/repo/org/codehaus/plexus/plexus/1.0.8/plexus-1.0.8.pom (8 KB at 185.8 KB/sec)
[INFO] Downloading: http://repository.mygrid.org.uk/artifactory/repo/org/codehaus/plexus/plexus-container-default/1.0-alpha-8/plexus-container-default-1.0-alpha-8.pom
[INFO] Downloaded: http://repository.mygrid.org.uk/artifactory/repo/org/codehaus/plexus/plexus-container-default/1.0-alpha-8/plexus-container-default-1.0-alpha-8.pom (8 KB at 262.7 KB/sec)
[INFO] Downloading: http://repository.mygrid.org.uk/artifactory/repo/org/codehaus/plexus/plexus-utils/3.0.5/plexus-utils-3.0.5.jar
[INFO] Downloading: http://repository.mygrid.org.uk/artifactory/repo/org/codehaus/plexus/plexus-digest/1.0/plexus-digest-1.0.jar
[INFO] Downloaded: http://repository.mygrid.org.uk/artifactory/repo/org/codehaus/plexus/plexus-digest/1.0/plexus-digest-1.0.jar (12 KB at 119.4 KB/sec)
[INFO] Downloaded: http://repository.mygrid.org.uk/artifactory/repo/org/codehaus/plexus/plexus-utils/3.0.5/plexus-utils-3.0.5.jar (226 KB at 1717.9 KB/sec)
[INFO] Installing /var/lib/jenkins/workspace/taverna-engine-referencetypes-maintenance/target/reference-core-extensions-1.6-SNAPSHOT.jar to /var/lib/jenkins/workspace/taverna-engine-referencetypes-maintenance/.repository/net/sf/taverna/t2/core/reference-core-extensions/1.6-SNAPSHOT/reference-core-extensions-1.6-SNAPSHOT.jar
[INFO] Installing /var/lib/jenkins/workspace/taverna-engine-referencetypes-maintenance/pom.xml to /var/lib/jenkins/workspace/taverna-engine-referencetypes-maintenance/.repository/net/sf/taverna/t2/core/reference-core-extensions/1.6-SNAPSHOT/reference-core-extensions-1.6-SNAPSHOT.pom
[INFO] Installing /var/lib/jenkins/workspace/taverna-engine-referencetypes-maintenance/target/reference-core-extensions-1.6-SNAPSHOT-sources.jar to /var/lib/jenkins/workspace/taverna-engine-referencetypes-maintenance/.repository/net/sf/taverna/t2/core/reference-core-extensions/1.6-SNAPSHOT/reference-core-extensions-1.6-SNAPSHOT-sources.jar
[INFO] Installing /var/lib/jenkins/workspace/taverna-engine-referencetypes-maintenance/target/reference-core-extensions-1.6-SNAPSHOT-test-sources.jar to /var/lib/jenkins/workspace/taverna-engine-referencetypes-maintenance/.repository/net/sf/taverna/t2/core/reference-core-extensions/1.6-SNAPSHOT/reference-core-extensions-1.6-SNAPSHOT-test-sources.jar
[INFO] Installing /var/lib/jenkins/workspace/taverna-engine-referencetypes-maintenance/target/reference-core-extensions-1.6-SNAPSHOT-tests.jar to /var/lib/jenkins/workspace/taverna-engine-referencetypes-maintenance/.repository/net/sf/taverna/t2/core/reference-core-extensions/1.6-SNAPSHOT/reference-core-extensions-1.6-SNAPSHOT-tests.jar
[INFO] Artifactory Build Info Recorder: Saving Build Info to '/var/lib/jenkins/workspace/taverna-engine-referencetypes-maintenance/target/build-info.json'
[INFO] Deploying artifact: http://build.mygrid.org.uk/artifactory/libs-snapshot-local/net/sf/taverna/t2/core/reference-core-extensions/1.6-SNAPSHOT/reference-core-extensions-1.6-SNAPSHOT.jar
[ERROR] org.jfrog.build.extractor.maven.BuildInfoRecorder.sessionEnded() listener has failed: 
java.lang.RuntimeException: Error occurred while publishing artifact to Artifactory: /var/lib/jenkins/workspace/taverna-engine-referencetypes-maintenance/target/reference-core-extensions-1.6-SNAPSHOT.jar.
 Skipping deployment of remaining artifacts (if any) and build info.
	at org.jfrog.build.extractor.maven.BuildDeploymentHelper.deployArtifacts(BuildDeploymentHelper.java:272)
	at org.jfrog.build.extractor.maven.BuildDeploymentHelper.deploy(BuildDeploymentHelper.java:108)
	at org.jfrog.build.extractor.maven.BuildInfoRecorder.sessionEnded(BuildInfoRecorder.java:135)
	at org.apache.maven.lifecycle.internal.DefaultExecutionEventCatapult.fire(DefaultExecutionEventCatapult.java:64)
	at org.apache.maven.lifecycle.internal.DefaultExecutionEventCatapult.fire(DefaultExecutionEventCatapult.java:42)
	at org.apache.maven.lifecycle.internal.LifecycleStarter.execute(LifecycleStarter.java:125)
	at org.apache.maven.DefaultMaven.doExecute(DefaultMaven.java:361)
	at org.apache.maven.DefaultMaven.execute(DefaultMaven.java:155)
	at org.jvnet.hudson.maven3.launcher.Maven31Launcher.main(Maven31Launcher.java:132)
	at sun.reflect.NativeMethodAccessorImpl.invoke0(Native Method)
	at sun.reflect.NativeMethodAccessorImpl.invoke(NativeMethodAccessorImpl.java:57)
	at sun.reflect.DelegatingMethodAccessorImpl.invoke(DelegatingMethodAccessorImpl.java:43)
	at java.lang.reflect.Method.invoke(Method.java:606)
	at org.codehaus.plexus.classworlds.launcher.Launcher.launchStandard(Launcher.java:330)
	at org.codehaus.plexus.classworlds.launcher.Launcher.launch(Launcher.java:238)
	at jenkins.maven3.agent.Maven31Main.launch(Maven31Main.java:181)
	at sun.reflect.NativeMethodAccessorImpl.invoke0(Native Method)
	at sun.reflect.NativeMethodAccessorImpl.invoke(NativeMethodAccessorImpl.java:57)
	at sun.reflect.DelegatingMethodAccessorImpl.invoke(DelegatingMethodAccessorImpl.java:43)
	at java.lang.reflect.Method.invoke(Method.java:606)
	at hudson.maven.Maven3Builder.call(Maven3Builder.java:136)
	at hudson.maven.Maven3Builder.call(Maven3Builder.java:71)
	at hudson.remoting.UserRequest.perform(UserRequest.java:118)
	at hudson.remoting.UserRequest.perform(UserRequest.java:48)
	at hudson.remoting.Request$2.run(Request.java:328)
	at hudson.remoting.InterceptingExecutorService$1.call(InterceptingExecutorService.java:72)
	at java.util.concurrent.FutureTask.run(FutureTask.java:262)
	at java.util.concurrent.ThreadPoolExecutor.runWorker(ThreadPoolExecutor.java:1145)
	at java.util.concurrent.ThreadPoolExecutor$Worker.run(ThreadPoolExecutor.java:615)
	at java.lang.Thread.run(Thread.java:745)
Caused by: java.io.IOException: Failed to deploy file: HTTP response code: 401. HTTP response message: Unauthorized
	at org.jfrog.build.client.ArtifactoryBuildInfoClient.throwHttpIOException(ArtifactoryBuildInfoClient.java:652)
	at org.jfrog.build.client.ArtifactoryBuildInfoClient.uploadFile(ArtifactoryBuildInfoClient.java:527)
	at org.jfrog.build.client.ArtifactoryBuildInfoClient.deployArtifact(ArtifactoryBuildInfoClient.java:302)
	at org.jfrog.build.extractor.maven.BuildDeploymentHelper.deployArtifacts(BuildDeploymentHelper.java:270)
	... 29 more
[ERROR] Internal error: java.lang.RuntimeException: org.jfrog.build.extractor.maven.BuildInfoRecorder.sessionEnded() listener has failed: Error occurred while publishing artifact to Artifactory: /var/lib/jenkins/workspace/taverna-engine-referencetypes-maintenance/target/reference-core-extensions-1.6-SNAPSHOT.jar.
[ERROR] Skipping deployment of remaining artifacts (if any) and build info. Failed to deploy file: HTTP response code: 401. HTTP response message: Unauthorized
[ERROR] -> [Help 1]
org.apache.maven.InternalErrorException: Internal error: java.lang.RuntimeException: org.jfrog.build.extractor.maven.BuildInfoRecorder.sessionEnded() listener has failed: 
	at org.apache.maven.DefaultMaven.execute(DefaultMaven.java:167)
	at org.jvnet.hudson.maven3.launcher.Maven31Launcher.main(Maven31Launcher.java:132)
	at sun.reflect.NativeMethodAccessorImpl.invoke0(Native Method)
	at sun.reflect.NativeMethodAccessorImpl.invoke(NativeMethodAccessorImpl.java:57)
	at sun.reflect.DelegatingMethodAccessorImpl.invoke(DelegatingMethodAccessorImpl.java:43)
	at java.lang.reflect.Method.invoke(Method.java:606)
	at org.codehaus.plexus.classworlds.launcher.Launcher.launchStandard(Launcher.java:330)
	at org.codehaus.plexus.classworlds.launcher.Launcher.launch(Launcher.java:238)
	at jenkins.maven3.agent.Maven31Main.launch(Maven31Main.java:181)
	at sun.reflect.NativeMethodAccessorImpl.invoke0(Native Method)
	at sun.reflect.NativeMethodAccessorImpl.invoke(NativeMethodAccessorImpl.java:57)
	at sun.reflect.DelegatingMethodAccessorImpl.invoke(DelegatingMethodAccessorImpl.java:43)
	at java.lang.reflect.Method.invoke(Method.java:606)
	at hudson.maven.Maven3Builder.call(Maven3Builder.java:136)
	at hudson.maven.Maven3Builder.call(Maven3Builder.java:71)
	at hudson.remoting.UserRequest.perform(UserRequest.java:118)
	at hudson.remoting.UserRequest.perform(UserRequest.java:48)
	at hudson.remoting.Request$2.run(Request.java:328)
	at hudson.remoting.InterceptingExecutorService$1.call(InterceptingExecutorService.java:72)
	at java.util.concurrent.FutureTask.run(FutureTask.java:262)
	at java.util.concurrent.ThreadPoolExecutor.runWorker(ThreadPoolExecutor.java:1145)
	at java.util.concurrent.ThreadPoolExecutor$Worker.run(ThreadPoolExecutor.java:615)
	at java.lang.Thread.run(Thread.java:745)
Caused by: java.lang.RuntimeException: org.jfrog.build.extractor.maven.BuildInfoRecorder.sessionEnded() listener has failed: 
	at org.jfrog.build.extractor.maven.BuildInfoRecorder.sessionEnded(BuildInfoRecorder.java:144)
	at org.apache.maven.lifecycle.internal.DefaultExecutionEventCatapult.fire(DefaultExecutionEventCatapult.java:64)
	at org.apache.maven.lifecycle.internal.DefaultExecutionEventCatapult.fire(DefaultExecutionEventCatapult.java:42)
	at org.apache.maven.lifecycle.internal.LifecycleStarter.execute(LifecycleStarter.java:125)
	at org.apache.maven.DefaultMaven.doExecute(DefaultMaven.java:361)
	at org.apache.maven.DefaultMaven.execute(DefaultMaven.java:155)
	... 22 more
Caused by: java.lang.RuntimeException: Error occurred while publishing artifact to Artifactory: /var/lib/jenkins/workspace/taverna-engine-referencetypes-maintenance/target/reference-core-extensions-1.6-SNAPSHOT.jar.
 Skipping deployment of remaining artifacts (if any) and build info.
	at org.jfrog.build.extractor.maven.BuildDeploymentHelper.deployArtifacts(BuildDeploymentHelper.java:272)
	at org.jfrog.build.extractor.maven.BuildDeploymentHelper.deploy(BuildDeploymentHelper.java:108)
	at org.jfrog.build.extractor.maven.BuildInfoRecorder.sessionEnded(BuildInfoRecorder.java:135)
	... 27 more
Caused by: java.io.IOException: Failed to deploy file: HTTP response code: 401. HTTP response message: Unauthorized
	at org.jfrog.build.client.ArtifactoryBuildInfoClient.throwHttpIOException(ArtifactoryBuildInfoClient.java:652)
	at org.jfrog.build.client.ArtifactoryBuildInfoClient.uploadFile(ArtifactoryBuildInfoClient.java:527)
	at org.jfrog.build.client.ArtifactoryBuildInfoClient.deployArtifact(ArtifactoryBuildInfoClient.java:302)
	at org.jfrog.build.extractor.maven.BuildDeploymentHelper.deployArtifacts(BuildDeploymentHelper.java:270)
	... 29 more
[ERROR] 
[ERROR] To see the full stack trace of the errors, re-run Maven with the -e switch.
[ERROR] Re-run Maven using the -X switch to enable full debug logging.
[ERROR] 
[ERROR] For more information about the errors and possible solutions, please read the following articles:
[ERROR] [Help 1] http://cwiki.apache.org/confluence/display/MAVEN/InternalErrorException