SuccessConsole Output

[INFO]                                                                         
[INFO] ------------------------------------------------------------------------
[INFO] Building Credential manager 1.6-SNAPSHOT
[INFO] ------------------------------------------------------------------------
[INFO] 
[INFO] --- maven-clean-plugin:2.5:clean (default-clean) @ credential-manager ---
[INFO] Deleting /var/lib/jenkins/workspace/taverna-engine-credential-manager-maintenance/credential-manager/target
[INFO] 
[INFO] --- maven-resources-plugin:2.6:resources (default-resources) @ credential-manager ---
[INFO] Using 'UTF-8' encoding to copy filtered resources.
[INFO] Copying 4 resources
[INFO] 
[INFO] --- maven-compiler-plugin:3.1:compile (default-compile) @ credential-manager ---
[INFO] Changes detected - recompiling the module!
[INFO] Compiling 10 source files to /var/lib/jenkins/workspace/taverna-engine-credential-manager-maintenance/credential-manager/target/classes
[INFO] 
[INFO] --- maven-resources-plugin:2.6:testResources (default-testResources) @ credential-manager ---
[INFO] Using 'UTF-8' encoding to copy filtered resources.
[INFO] Copying 3 resources
[INFO] 
[INFO] --- maven-compiler-plugin:3.1:testCompile (default-testCompile) @ credential-manager ---
[INFO] Changes detected - recompiling the module!
[INFO] Compiling 4 source files to /var/lib/jenkins/workspace/taverna-engine-credential-manager-maintenance/credential-manager/target/test-classes
[INFO] 
[INFO] --- maven-surefire-plugin:2.17:test (default-test) @ credential-manager ---
[INFO] Surefire report directory: /var/lib/jenkins/workspace/taverna-engine-credential-manager-maintenance/credential-manager/target/surefire-reports

-------------------------------------------------------
 T E S T S
-------------------------------------------------------
Running net.sf.taverna.t2.security.credentialmanager.PossibleLookupsTest
log4j:WARN No appenders could be found for logger (net.sf.taverna.raven.log.Log).
log4j:WARN Please initialize the log4j system properly.
log4j:WARN See http://logging.apache.org/log4j/1.2/faq.html#noconfig for more info.
Tests run: 8, Failures: 0, Errors: 0, Skipped: 0, Time elapsed: 0.611 sec - in net.sf.taverna.t2.security.credentialmanager.PossibleLookupsTest
Running net.sf.taverna.t2.security.credentialmanager.BasicAuthTest
ApplicationConfig could not determine application name, using unknownApplication-104589af-53b7-49f1-ad1a-5180914da4b0
ApplicationConfig could not determine application name, using unknownApplication-104589af-53b7-49f1-ad1a-5180914da4b0
2014-05-16 16:16:41.922:INFO::Logging to STDERR via org.mortbay.log.StdErrLog
2014-05-16 16:16:42.137:INFO::jetty-6.1.24
2014-05-16 16:16:42.587:INFO::NO JSP Support for /, did not find org.apache.jasper.servlet.JspServlet
2014-05-16 16:16:42.799:INFO::Started SelectChannelConnector@0.0.0.0:9638
2014-05-16 16:16:43.383:WARN::AUTH FAILURE: user basicUser
2014-05-16 16:16:43.394:WARN::AUTH FAILURE: user basicUser
2014-05-16 16:16:43.400:WARN::AUTH FAILURE: user basicUser
2014-05-16 16:16:43.664:WARN::AUTH FAILURE: user basicUser
2014-05-16 16:16:43.695:WARN::AUTH FAILURE: user basicUser
2014-05-16 16:16:43.720:WARN::AUTH FAILURE: user basicUser
2014-05-16 16:16:43.741:WARN::AUTH FAILURE: user basicUser
2014-05-16 16:16:43.746:WARN::AUTH FAILURE: user basicUser
2014-05-16 16:16:43.751:WARN::AUTH FAILURE: user basicUser
2014-05-16 16:16:43.770:WARN::AUTH FAILURE: user basicUser
2014-05-16 16:16:43.773:WARN::AUTH FAILURE: user basicUser
2014-05-16 16:16:43.781:WARN::AUTH FAILURE: user basicUser
2014-05-16 16:16:43.799:WARN::AUTH FAILURE: user basicUser
2014-05-16 16:16:43.815:WARN::AUTH FAILURE: user basicUser
2014-05-16 16:16:43.823:WARN::AUTH FAILURE: user basicUser
2014-05-16 16:16:43.832:WARN::AUTH FAILURE: user basicUser
2014-05-16 16:16:43.843:WARN::AUTH FAILURE: user basicUser
2014-05-16 16:16:43.851:WARN::AUTH FAILURE: user basicUser
2014-05-16 16:16:43.865:WARN::AUTH FAILURE: user basicUser
2014-05-16 16:16:43.981:WARN::AUTH FAILURE: user basicUser
2014-05-16 16:16:44.000:WARN::AUTH FAILURE: user basicUser
2014-05-16 16:16:44.020:WARN::AUTH FAILURE: user basicUser
2014-05-16 16:16:44.040:WARN::AUTH FAILURE: user basicUser
2014-05-16 16:16:44.049:WARN::AUTH FAILURE: user basicUser
2014-05-16 16:16:44.071:WARN::AUTH FAILURE: user basicUser
2014-05-16 16:16:44.089:WARN::AUTH FAILURE: user basicUser
2014-05-16 16:16:44.104:WARN::AUTH FAILURE: user basicUser
2014-05-16 16:16:44.123:WARN::AUTH FAILURE: user basicUser
2014-05-16 16:16:44.132:WARN::AUTH FAILURE: user basicUser
2014-05-16 16:16:44.148:WARN::AUTH FAILURE: user basicUser
2014-05-16 16:16:44.159:WARN::AUTH FAILURE: user basicUser
2014-05-16 16:16:44.175:WARN::AUTH FAILURE: user basicUser
2014-05-16 16:16:44.192:WARN::AUTH FAILURE: user basicUser
2014-05-16 16:16:44.207:WARN::AUTH FAILURE: user basicUser
2014-05-16 16:16:44.241:WARN::AUTH FAILURE: user basicUser
2014-05-16 16:16:44.258:WARN::AUTH FAILURE: user basicUser
2014-05-16 16:16:44.275:WARN::AUTH FAILURE: user basicUser
2014-05-16 16:16:44.284:WARN::AUTH FAILURE: user basicUser
2014-05-16 16:16:44.305:INFO::Stopped SelectChannelConnector@0.0.0.0:9638
Tests run: 6, Failures: 0, Errors: 0, Skipped: 0, Time elapsed: 5.837 sec - in net.sf.taverna.t2.security.credentialmanager.BasicAuthTest

Results :

Tests run: 14, Failures: 0, Errors: 0, Skipped: 0

[JENKINS] Recording test results
[INFO] 
[INFO] --- maven-jar-plugin:2.4:jar (default-jar) @ credential-manager ---
[INFO] Building jar: /var/lib/jenkins/workspace/taverna-engine-credential-manager-maintenance/credential-manager/target/credential-manager-1.6-SNAPSHOT.jar
[INFO] 
[INFO] >>> maven-source-plugin:2.2.1:jar (default) @ credential-manager >>>
[WARNING] Failed to getClass for org.apache.maven.plugin.source.SourceJarMojo
[INFO] 
[INFO] <<< maven-source-plugin:2.2.1:jar (default) @ credential-manager <<<
[INFO] 
[INFO] --- maven-source-plugin:2.2.1:jar (default) @ credential-manager ---
[INFO] Building jar: /var/lib/jenkins/workspace/taverna-engine-credential-manager-maintenance/credential-manager/target/credential-manager-1.6-SNAPSHOT-sources.jar
[INFO] 
[INFO] >>> maven-source-plugin:2.2.1:test-jar (default) @ credential-manager >>>
[WARNING] Failed to getClass for org.apache.maven.plugin.source.TestSourceJarMojo
[INFO] 
[INFO] <<< maven-source-plugin:2.2.1:test-jar (default) @ credential-manager <<<
[INFO] 
[INFO] --- maven-source-plugin:2.2.1:test-jar (default) @ credential-manager ---
[INFO] Building jar: /var/lib/jenkins/workspace/taverna-engine-credential-manager-maintenance/credential-manager/target/credential-manager-1.6-SNAPSHOT-test-sources.jar
[INFO] 
[INFO] --- maven-jar-plugin:2.4:test-jar (default) @ credential-manager ---
[INFO] Building jar: /var/lib/jenkins/workspace/taverna-engine-credential-manager-maintenance/credential-manager/target/credential-manager-1.6-SNAPSHOT-tests.jar
[INFO] 
[INFO] --- maven-install-plugin:2.4:install (default-install) @ credential-manager ---
[INFO] Installing /var/lib/jenkins/workspace/taverna-engine-credential-manager-maintenance/credential-manager/target/credential-manager-1.6-SNAPSHOT.jar to /var/lib/jenkins/workspace/taverna-engine-credential-manager-maintenance/.repository/net/sf/taverna/t2/security/credential-manager/1.6-SNAPSHOT/credential-manager-1.6-SNAPSHOT.jar
[INFO] Installing /var/lib/jenkins/workspace/taverna-engine-credential-manager-maintenance/credential-manager/pom.xml to /var/lib/jenkins/workspace/taverna-engine-credential-manager-maintenance/.repository/net/sf/taverna/t2/security/credential-manager/1.6-SNAPSHOT/credential-manager-1.6-SNAPSHOT.pom
[INFO] Installing /var/lib/jenkins/workspace/taverna-engine-credential-manager-maintenance/credential-manager/target/credential-manager-1.6-SNAPSHOT-sources.jar to /var/lib/jenkins/workspace/taverna-engine-credential-manager-maintenance/.repository/net/sf/taverna/t2/security/credential-manager/1.6-SNAPSHOT/credential-manager-1.6-SNAPSHOT-sources.jar
[INFO] Installing /var/lib/jenkins/workspace/taverna-engine-credential-manager-maintenance/credential-manager/target/credential-manager-1.6-SNAPSHOT-test-sources.jar to /var/lib/jenkins/workspace/taverna-engine-credential-manager-maintenance/.repository/net/sf/taverna/t2/security/credential-manager/1.6-SNAPSHOT/credential-manager-1.6-SNAPSHOT-test-sources.jar
[INFO] Installing /var/lib/jenkins/workspace/taverna-engine-credential-manager-maintenance/credential-manager/target/credential-manager-1.6-SNAPSHOT-tests.jar to /var/lib/jenkins/workspace/taverna-engine-credential-manager-maintenance/.repository/net/sf/taverna/t2/security/credential-manager/1.6-SNAPSHOT/credential-manager-1.6-SNAPSHOT-tests.jar