SuccessConsole Output

[INFO]                                                                         
[INFO] ------------------------------------------------------------------------
[INFO] Building Credential manager 1.6-SNAPSHOT
[INFO] ------------------------------------------------------------------------
[INFO] 
[INFO] --- maven-clean-plugin:2.5:clean (default-clean) @ credential-manager ---
[INFO] Deleting /var/lib/jenkins/workspace/taverna-engine-credential-manager-maintenance/credential-manager/target
[INFO] 
[INFO] --- maven-resources-plugin:2.6:resources (default-resources) @ credential-manager ---
[INFO] Using 'UTF-8' encoding to copy filtered resources.
[INFO] Copying 4 resources
[INFO] 
[INFO] --- maven-compiler-plugin:3.1:compile (default-compile) @ credential-manager ---
[INFO] Changes detected - recompiling the module!
[INFO] Compiling 10 source files to /var/lib/jenkins/workspace/taverna-engine-credential-manager-maintenance/credential-manager/target/classes
[INFO] 
[INFO] --- maven-resources-plugin:2.6:testResources (default-testResources) @ credential-manager ---
[INFO] Using 'UTF-8' encoding to copy filtered resources.
[INFO] Copying 3 resources
[INFO] 
[INFO] --- maven-compiler-plugin:3.1:testCompile (default-testCompile) @ credential-manager ---
[INFO] Changes detected - recompiling the module!
[INFO] Compiling 4 source files to /var/lib/jenkins/workspace/taverna-engine-credential-manager-maintenance/credential-manager/target/test-classes
[INFO] 
[INFO] --- maven-surefire-plugin:2.17:test (default-test) @ credential-manager ---
[INFO] Surefire report directory: /var/lib/jenkins/workspace/taverna-engine-credential-manager-maintenance/credential-manager/target/surefire-reports

-------------------------------------------------------
 T E S T S
-------------------------------------------------------
Running net.sf.taverna.t2.security.credentialmanager.PossibleLookupsTest
log4j:WARN No appenders could be found for logger (net.sf.taverna.raven.log.Log).
log4j:WARN Please initialize the log4j system properly.
log4j:WARN See http://logging.apache.org/log4j/1.2/faq.html#noconfig for more info.
Tests run: 8, Failures: 0, Errors: 0, Skipped: 0, Time elapsed: 0.711 sec - in net.sf.taverna.t2.security.credentialmanager.PossibleLookupsTest
Running net.sf.taverna.t2.security.credentialmanager.BasicAuthTest
ApplicationConfig could not determine application name, using unknownApplication-b5abada8-eaae-4579-b156-6c2b3ac9e019
ApplicationConfig could not determine application name, using unknownApplication-b5abada8-eaae-4579-b156-6c2b3ac9e019
2014-05-14 17:08:19.955:INFO::Logging to STDERR via org.mortbay.log.StdErrLog
2014-05-14 17:08:20.054:INFO::jetty-6.1.24
2014-05-14 17:08:20.307:INFO::NO JSP Support for /, did not find org.apache.jasper.servlet.JspServlet
2014-05-14 17:08:20.463:INFO::Started SelectChannelConnector@0.0.0.0:9638
2014-05-14 17:08:20.978:WARN::AUTH FAILURE: user basicUser
2014-05-14 17:08:20.985:WARN::AUTH FAILURE: user basicUser
2014-05-14 17:08:20.990:WARN::AUTH FAILURE: user basicUser
2014-05-14 17:08:20.995:WARN::AUTH FAILURE: user basicUser
2014-05-14 17:08:21.001:WARN::AUTH FAILURE: user basicUser
2014-05-14 17:08:21.007:WARN::AUTH FAILURE: user basicUser
2014-05-14 17:08:21.014:WARN::AUTH FAILURE: user basicUser
2014-05-14 17:08:21.018:WARN::AUTH FAILURE: user basicUser
2014-05-14 17:08:21.022:WARN::AUTH FAILURE: user basicUser
2014-05-14 17:08:21.026:WARN::AUTH FAILURE: user basicUser
2014-05-14 17:08:21.031:WARN::AUTH FAILURE: user basicUser
2014-05-14 17:08:21.036:WARN::AUTH FAILURE: user basicUser
2014-05-14 17:08:21.041:WARN::AUTH FAILURE: user basicUser
2014-05-14 17:08:21.045:WARN::AUTH FAILURE: user basicUser
2014-05-14 17:08:21.049:WARN::AUTH FAILURE: user basicUser
2014-05-14 17:08:21.052:WARN::AUTH FAILURE: user basicUser
2014-05-14 17:08:21.059:WARN::AUTH FAILURE: user basicUser
2014-05-14 17:08:21.063:WARN::AUTH FAILURE: user basicUser
2014-05-14 17:08:21.067:WARN::AUTH FAILURE: user basicUser
2014-05-14 17:08:21.170:WARN::AUTH FAILURE: user basicUser
2014-05-14 17:08:21.180:WARN::AUTH FAILURE: user basicUser
2014-05-14 17:08:21.199:WARN::AUTH FAILURE: user basicUser
2014-05-14 17:08:21.212:WARN::AUTH FAILURE: user basicUser
2014-05-14 17:08:21.224:WARN::AUTH FAILURE: user basicUser
2014-05-14 17:08:21.244:WARN::AUTH FAILURE: user basicUser
2014-05-14 17:08:21.256:WARN::AUTH FAILURE: user basicUser
2014-05-14 17:08:21.265:WARN::AUTH FAILURE: user basicUser
2014-05-14 17:08:21.278:WARN::AUTH FAILURE: user basicUser
2014-05-14 17:08:21.288:WARN::AUTH FAILURE: user basicUser
2014-05-14 17:08:21.296:WARN::AUTH FAILURE: user basicUser
2014-05-14 17:08:21.309:WARN::AUTH FAILURE: user basicUser
2014-05-14 17:08:21.318:WARN::AUTH FAILURE: user basicUser
2014-05-14 17:08:21.331:WARN::AUTH FAILURE: user basicUser
2014-05-14 17:08:21.339:WARN::AUTH FAILURE: user basicUser
2014-05-14 17:08:21.372:WARN::AUTH FAILURE: user basicUser
2014-05-14 17:08:21.397:WARN::AUTH FAILURE: user basicUser
2014-05-14 17:08:21.405:WARN::AUTH FAILURE: user basicUser
2014-05-14 17:08:21.424:WARN::AUTH FAILURE: user basicUser
2014-05-14 17:08:21.452:INFO::Stopped SelectChannelConnector@0.0.0.0:9638
Tests run: 6, Failures: 0, Errors: 0, Skipped: 0, Time elapsed: 4.585 sec - in net.sf.taverna.t2.security.credentialmanager.BasicAuthTest

Results :

Tests run: 14, Failures: 0, Errors: 0, Skipped: 0

[JENKINS] Recording test results
[INFO] 
[INFO] --- maven-jar-plugin:2.4:jar (default-jar) @ credential-manager ---
[INFO] Building jar: /var/lib/jenkins/workspace/taverna-engine-credential-manager-maintenance/credential-manager/target/credential-manager-1.6-SNAPSHOT.jar
[INFO] 
[INFO] >>> maven-source-plugin:2.2.1:jar (default) @ credential-manager >>>
[WARNING] Failed to getClass for org.apache.maven.plugin.source.SourceJarMojo
[INFO] 
[INFO] <<< maven-source-plugin:2.2.1:jar (default) @ credential-manager <<<
[INFO] 
[INFO] --- maven-source-plugin:2.2.1:jar (default) @ credential-manager ---
[INFO] Building jar: /var/lib/jenkins/workspace/taverna-engine-credential-manager-maintenance/credential-manager/target/credential-manager-1.6-SNAPSHOT-sources.jar
[INFO] 
[INFO] >>> maven-source-plugin:2.2.1:test-jar (default) @ credential-manager >>>
[WARNING] Failed to getClass for org.apache.maven.plugin.source.TestSourceJarMojo
[INFO] 
[INFO] <<< maven-source-plugin:2.2.1:test-jar (default) @ credential-manager <<<
[INFO] 
[INFO] --- maven-source-plugin:2.2.1:test-jar (default) @ credential-manager ---
[INFO] Building jar: /var/lib/jenkins/workspace/taverna-engine-credential-manager-maintenance/credential-manager/target/credential-manager-1.6-SNAPSHOT-test-sources.jar
[INFO] 
[INFO] --- maven-jar-plugin:2.4:test-jar (default) @ credential-manager ---
[INFO] Building jar: /var/lib/jenkins/workspace/taverna-engine-credential-manager-maintenance/credential-manager/target/credential-manager-1.6-SNAPSHOT-tests.jar
[INFO] 
[INFO] --- maven-install-plugin:2.4:install (default-install) @ credential-manager ---
[INFO] Installing /var/lib/jenkins/workspace/taverna-engine-credential-manager-maintenance/credential-manager/target/credential-manager-1.6-SNAPSHOT.jar to /var/lib/jenkins/workspace/taverna-engine-credential-manager-maintenance/.repository/net/sf/taverna/t2/security/credential-manager/1.6-SNAPSHOT/credential-manager-1.6-SNAPSHOT.jar
[INFO] Installing /var/lib/jenkins/workspace/taverna-engine-credential-manager-maintenance/credential-manager/pom.xml to /var/lib/jenkins/workspace/taverna-engine-credential-manager-maintenance/.repository/net/sf/taverna/t2/security/credential-manager/1.6-SNAPSHOT/credential-manager-1.6-SNAPSHOT.pom
[INFO] Installing /var/lib/jenkins/workspace/taverna-engine-credential-manager-maintenance/credential-manager/target/credential-manager-1.6-SNAPSHOT-sources.jar to /var/lib/jenkins/workspace/taverna-engine-credential-manager-maintenance/.repository/net/sf/taverna/t2/security/credential-manager/1.6-SNAPSHOT/credential-manager-1.6-SNAPSHOT-sources.jar
[INFO] Installing /var/lib/jenkins/workspace/taverna-engine-credential-manager-maintenance/credential-manager/target/credential-manager-1.6-SNAPSHOT-test-sources.jar to /var/lib/jenkins/workspace/taverna-engine-credential-manager-maintenance/.repository/net/sf/taverna/t2/security/credential-manager/1.6-SNAPSHOT/credential-manager-1.6-SNAPSHOT-test-sources.jar
[INFO] Installing /var/lib/jenkins/workspace/taverna-engine-credential-manager-maintenance/credential-manager/target/credential-manager-1.6-SNAPSHOT-tests.jar to /var/lib/jenkins/workspace/taverna-engine-credential-manager-maintenance/.repository/net/sf/taverna/t2/security/credential-manager/1.6-SNAPSHOT/credential-manager-1.6-SNAPSHOT-tests.jar