SuccessConsole Output

[INFO]                                                                         
[INFO] ------------------------------------------------------------------------
[INFO] Building Credential manager 1.6-SNAPSHOT
[INFO] ------------------------------------------------------------------------
[INFO] 
[INFO] --- maven-clean-plugin:2.5:clean (default-clean) @ credential-manager ---
[INFO] Deleting /var/lib/jenkins/workspace/taverna-engine-credential-manager-maintenance/credential-manager/target
[INFO] 
[INFO] --- maven-resources-plugin:2.6:resources (default-resources) @ credential-manager ---
[INFO] Using 'UTF-8' encoding to copy filtered resources.
[INFO] Copying 4 resources
[INFO] 
[INFO] --- maven-compiler-plugin:3.1:compile (default-compile) @ credential-manager ---
[INFO] Changes detected - recompiling the module!
[INFO] Compiling 10 source files to /var/lib/jenkins/workspace/taverna-engine-credential-manager-maintenance/credential-manager/target/classes
[INFO] 
[INFO] --- maven-resources-plugin:2.6:testResources (default-testResources) @ credential-manager ---
[INFO] Using 'UTF-8' encoding to copy filtered resources.
[INFO] Copying 3 resources
[INFO] 
[INFO] --- maven-compiler-plugin:3.1:testCompile (default-testCompile) @ credential-manager ---
[INFO] Changes detected - recompiling the module!
[INFO] Compiling 4 source files to /var/lib/jenkins/workspace/taverna-engine-credential-manager-maintenance/credential-manager/target/test-classes
[INFO] 
[INFO] --- maven-surefire-plugin:2.17:test (default-test) @ credential-manager ---
[INFO] Surefire report directory: /var/lib/jenkins/workspace/taverna-engine-credential-manager-maintenance/credential-manager/target/surefire-reports

-------------------------------------------------------
 T E S T S
-------------------------------------------------------
Running net.sf.taverna.t2.security.credentialmanager.PossibleLookupsTest
log4j:WARN No appenders could be found for logger (net.sf.taverna.raven.log.Log).
log4j:WARN Please initialize the log4j system properly.
log4j:WARN See http://logging.apache.org/log4j/1.2/faq.html#noconfig for more info.
Tests run: 8, Failures: 0, Errors: 0, Skipped: 0, Time elapsed: 0.777 sec - in net.sf.taverna.t2.security.credentialmanager.PossibleLookupsTest
Running net.sf.taverna.t2.security.credentialmanager.BasicAuthTest
2014-05-14 16:00:50.228:INFO::Logging to STDERR via org.mortbay.log.StdErrLog
2014-05-14 16:00:50.337:INFO::jetty-6.1.24
2014-05-14 16:00:50.566:INFO::NO JSP Support for /, did not find org.apache.jasper.servlet.JspServlet
2014-05-14 16:00:50.722:INFO::Started SelectChannelConnector@0.0.0.0:9638
ApplicationConfig could not determine application name, using unknownApplication-42edf154-a2a7-4d31-9789-c41eebd38ad1
ApplicationConfig could not determine application name, using unknownApplication-42edf154-a2a7-4d31-9789-c41eebd38ad1
2014-05-14 16:00:53.002:WARN::AUTH FAILURE: user basicUser
2014-05-14 16:00:53.010:WARN::AUTH FAILURE: user basicUser
2014-05-14 16:00:53.018:WARN::AUTH FAILURE: user basicUser
2014-05-14 16:00:53.027:WARN::AUTH FAILURE: user basicUser
2014-05-14 16:00:53.033:WARN::AUTH FAILURE: user basicUser
2014-05-14 16:00:53.045:WARN::AUTH FAILURE: user basicUser
2014-05-14 16:00:53.049:WARN::AUTH FAILURE: user basicUser
2014-05-14 16:00:53.059:WARN::AUTH FAILURE: user basicUser
2014-05-14 16:00:53.067:WARN::AUTH FAILURE: user basicUser
2014-05-14 16:00:53.084:WARN::AUTH FAILURE: user basicUser
2014-05-14 16:00:53.096:WARN::AUTH FAILURE: user basicUser
2014-05-14 16:00:53.110:WARN::AUTH FAILURE: user basicUser
2014-05-14 16:00:53.117:WARN::AUTH FAILURE: user basicUser
2014-05-14 16:00:53.121:WARN::AUTH FAILURE: user basicUser
2014-05-14 16:00:53.127:WARN::AUTH FAILURE: user basicUser
2014-05-14 16:00:53.131:WARN::AUTH FAILURE: user basicUser
2014-05-14 16:00:53.135:WARN::AUTH FAILURE: user basicUser
2014-05-14 16:00:53.145:WARN::AUTH FAILURE: user basicUser
2014-05-14 16:00:53.155:WARN::AUTH FAILURE: user basicUser
2014-05-14 16:00:53.262:WARN::AUTH FAILURE: user basicUser
2014-05-14 16:00:53.273:WARN::AUTH FAILURE: user basicUser
2014-05-14 16:00:53.297:WARN::AUTH FAILURE: user basicUser
2014-05-14 16:00:53.313:WARN::AUTH FAILURE: user basicUser
2014-05-14 16:00:53.325:WARN::AUTH FAILURE: user basicUser
2014-05-14 16:00:53.335:WARN::AUTH FAILURE: user basicUser
2014-05-14 16:00:53.345:WARN::AUTH FAILURE: user basicUser
2014-05-14 16:00:53.356:WARN::AUTH FAILURE: user basicUser
2014-05-14 16:00:53.400:WARN::AUTH FAILURE: user basicUser
2014-05-14 16:00:53.412:WARN::AUTH FAILURE: user basicUser
2014-05-14 16:00:53.425:WARN::AUTH FAILURE: user basicUser
2014-05-14 16:00:53.435:WARN::AUTH FAILURE: user basicUser
2014-05-14 16:00:53.447:WARN::AUTH FAILURE: user basicUser
2014-05-14 16:00:53.463:WARN::AUTH FAILURE: user basicUser
2014-05-14 16:00:53.471:WARN::AUTH FAILURE: user basicUser
2014-05-14 16:00:53.501:WARN::AUTH FAILURE: user basicUser
2014-05-14 16:00:53.507:WARN::AUTH FAILURE: user basicUser
2014-05-14 16:00:53.515:WARN::AUTH FAILURE: user basicUser
2014-05-14 16:00:53.521:WARN::AUTH FAILURE: user basicUser
2014-05-14 16:00:53.537:INFO::Stopped SelectChannelConnector@0.0.0.0:9638
Tests run: 6, Failures: 0, Errors: 0, Skipped: 0, Time elapsed: 3.443 sec - in net.sf.taverna.t2.security.credentialmanager.BasicAuthTest

Results :

Tests run: 14, Failures: 0, Errors: 0, Skipped: 0

[JENKINS] Recording test results
[INFO] 
[INFO] --- maven-jar-plugin:2.4:jar (default-jar) @ credential-manager ---
[INFO] Building jar: /var/lib/jenkins/workspace/taverna-engine-credential-manager-maintenance/credential-manager/target/credential-manager-1.6-SNAPSHOT.jar
[INFO] 
[INFO] >>> maven-source-plugin:2.2.1:jar (default) @ credential-manager >>>
[WARNING] Failed to getClass for org.apache.maven.plugin.source.SourceJarMojo
[INFO] 
[INFO] <<< maven-source-plugin:2.2.1:jar (default) @ credential-manager <<<
[INFO] 
[INFO] --- maven-source-plugin:2.2.1:jar (default) @ credential-manager ---
[INFO] Building jar: /var/lib/jenkins/workspace/taverna-engine-credential-manager-maintenance/credential-manager/target/credential-manager-1.6-SNAPSHOT-sources.jar
[INFO] 
[INFO] >>> maven-source-plugin:2.2.1:test-jar (default) @ credential-manager >>>
[WARNING] Failed to getClass for org.apache.maven.plugin.source.TestSourceJarMojo
[INFO] 
[INFO] <<< maven-source-plugin:2.2.1:test-jar (default) @ credential-manager <<<
[INFO] 
[INFO] --- maven-source-plugin:2.2.1:test-jar (default) @ credential-manager ---
[INFO] Building jar: /var/lib/jenkins/workspace/taverna-engine-credential-manager-maintenance/credential-manager/target/credential-manager-1.6-SNAPSHOT-test-sources.jar
[INFO] 
[INFO] --- maven-jar-plugin:2.4:test-jar (default) @ credential-manager ---
[INFO] Building jar: /var/lib/jenkins/workspace/taverna-engine-credential-manager-maintenance/credential-manager/target/credential-manager-1.6-SNAPSHOT-tests.jar
[INFO] 
[INFO] --- maven-install-plugin:2.4:install (default-install) @ credential-manager ---
[INFO] Installing /var/lib/jenkins/workspace/taverna-engine-credential-manager-maintenance/credential-manager/target/credential-manager-1.6-SNAPSHOT.jar to /var/lib/jenkins/workspace/taverna-engine-credential-manager-maintenance/.repository/net/sf/taverna/t2/security/credential-manager/1.6-SNAPSHOT/credential-manager-1.6-SNAPSHOT.jar
[INFO] Installing /var/lib/jenkins/workspace/taverna-engine-credential-manager-maintenance/credential-manager/pom.xml to /var/lib/jenkins/workspace/taverna-engine-credential-manager-maintenance/.repository/net/sf/taverna/t2/security/credential-manager/1.6-SNAPSHOT/credential-manager-1.6-SNAPSHOT.pom
[INFO] Installing /var/lib/jenkins/workspace/taverna-engine-credential-manager-maintenance/credential-manager/target/credential-manager-1.6-SNAPSHOT-sources.jar to /var/lib/jenkins/workspace/taverna-engine-credential-manager-maintenance/.repository/net/sf/taverna/t2/security/credential-manager/1.6-SNAPSHOT/credential-manager-1.6-SNAPSHOT-sources.jar
[INFO] Installing /var/lib/jenkins/workspace/taverna-engine-credential-manager-maintenance/credential-manager/target/credential-manager-1.6-SNAPSHOT-test-sources.jar to /var/lib/jenkins/workspace/taverna-engine-credential-manager-maintenance/.repository/net/sf/taverna/t2/security/credential-manager/1.6-SNAPSHOT/credential-manager-1.6-SNAPSHOT-test-sources.jar
[INFO] Installing /var/lib/jenkins/workspace/taverna-engine-credential-manager-maintenance/credential-manager/target/credential-manager-1.6-SNAPSHOT-tests.jar to /var/lib/jenkins/workspace/taverna-engine-credential-manager-maintenance/.repository/net/sf/taverna/t2/security/credential-manager/1.6-SNAPSHOT/credential-manager-1.6-SNAPSHOT-tests.jar