SuccessConsole Output

[INFO]                                                                         
[INFO] ------------------------------------------------------------------------
[INFO] Building Credential manager 1.6-SNAPSHOT
[INFO] ------------------------------------------------------------------------
[INFO] Downloading: http://repository.mygrid.org.uk/artifactory/repo/net/sf/taverna/t2/infrastructure/spi-discovery-api/2.6-SNAPSHOT/maven-metadata.xml
[INFO] Downloaded: http://repository.mygrid.org.uk/artifactory/repo/net/sf/taverna/t2/infrastructure/spi-discovery-api/2.6-SNAPSHOT/maven-metadata.xml (2 KB at 0.9 KB/sec)
[INFO] Downloading: http://repository.mygrid.org.uk/artifactory/repo/net/sf/taverna/t2/infrastructure/spi-discovery-api/2.6-SNAPSHOT/spi-discovery-api-2.6-20141203.194409-13.pom
[INFO] Downloaded: http://repository.mygrid.org.uk/artifactory/repo/net/sf/taverna/t2/infrastructure/spi-discovery-api/2.6-SNAPSHOT/spi-discovery-api-2.6-20141203.194409-13.pom (2 KB at 15.9 KB/sec)
[INFO] Downloading: http://repository.mygrid.org.uk/artifactory/repo/net/sf/taverna/t2/infrastructure/2.6-SNAPSHOT/maven-metadata.xml
[INFO] Downloaded: http://repository.mygrid.org.uk/artifactory/repo/net/sf/taverna/t2/infrastructure/2.6-SNAPSHOT/maven-metadata.xml (805 B at 0.6 KB/sec)
[INFO] Downloading: http://repository.mygrid.org.uk/artifactory/repo/net/sf/taverna/t2/infrastructure/2.6-SNAPSHOT/infrastructure-2.6-20141203.194409-13.pom
[INFO] Downloaded: http://repository.mygrid.org.uk/artifactory/repo/net/sf/taverna/t2/infrastructure/2.6-SNAPSHOT/infrastructure-2.6-20141203.194409-13.pom (4 KB at 31.2 KB/sec)
[INFO] Downloading: http://repository.mygrid.org.uk/artifactory/repo/net/sf/taverna/t2/lang/observer/1.6-SNAPSHOT/maven-metadata.xml
[INFO] Downloaded: http://repository.mygrid.org.uk/artifactory/repo/net/sf/taverna/t2/lang/observer/1.6-SNAPSHOT/maven-metadata.xml (2 KB at 25.4 KB/sec)
[INFO] Downloading: http://repository.mygrid.org.uk/artifactory/repo/net/sf/taverna/t2/lang/1.6-SNAPSHOT/maven-metadata.xml
[INFO] Downloaded: http://repository.mygrid.org.uk/artifactory/repo/net/sf/taverna/t2/lang/1.6-SNAPSHOT/maven-metadata.xml (795 B at 24.3 KB/sec)
[INFO] Downloading: http://repository.mygrid.org.uk/artifactory/repo/net/sf/taverna/t2/infrastructure/raven/2.6-SNAPSHOT/maven-metadata.xml
[INFO] Downloaded: http://repository.mygrid.org.uk/artifactory/repo/net/sf/taverna/t2/infrastructure/raven/2.6-SNAPSHOT/maven-metadata.xml (2 KB at 1.1 KB/sec)
[INFO] Downloading: http://repository.mygrid.org.uk/artifactory/repo/net/sf/taverna/t2/infrastructure/raven/2.6-SNAPSHOT/raven-2.6-20141203.194409-13.pom
[INFO] Downloaded: http://repository.mygrid.org.uk/artifactory/repo/net/sf/taverna/t2/infrastructure/raven/2.6-SNAPSHOT/raven-2.6-20141203.194409-13.pom (2 KB at 20.4 KB/sec)
[INFO] Downloading: http://repository.mygrid.org.uk/artifactory/repo/net/sf/taverna/t2/infrastructure/raven-log4j/2.6-SNAPSHOT/maven-metadata.xml
[INFO] Downloaded: http://repository.mygrid.org.uk/artifactory/repo/net/sf/taverna/t2/infrastructure/raven-log4j/2.6-SNAPSHOT/maven-metadata.xml (2 KB at 1.0 KB/sec)
[INFO] Downloading: http://repository.mygrid.org.uk/artifactory/repo/net/sf/taverna/t2/infrastructure/raven-log4j/2.6-SNAPSHOT/raven-log4j-2.6-20141203.194409-13.pom
[INFO] Downloaded: http://repository.mygrid.org.uk/artifactory/repo/net/sf/taverna/t2/infrastructure/raven-log4j/2.6-SNAPSHOT/raven-log4j-2.6-20141203.194409-13.pom (952 B at 8.9 KB/sec)
[INFO] Downloading: http://repository.mygrid.org.uk/artifactory/repo/net/sf/taverna/t2/infrastructure/appconfig/2.6-SNAPSHOT/maven-metadata.xml
[INFO] Downloaded: http://repository.mygrid.org.uk/artifactory/repo/net/sf/taverna/t2/infrastructure/appconfig/2.6-SNAPSHOT/maven-metadata.xml (2 KB at 1.2 KB/sec)
[INFO] Downloading: http://repository.mygrid.org.uk/artifactory/repo/net/sf/taverna/t2/infrastructure/appconfig/2.6-SNAPSHOT/appconfig-2.6-20141203.194409-13.pom
[INFO] Downloaded: http://repository.mygrid.org.uk/artifactory/repo/net/sf/taverna/t2/infrastructure/appconfig/2.6-SNAPSHOT/appconfig-2.6-20141203.194409-13.pom (2 KB at 35.7 KB/sec)
[INFO] Downloading: http://repository.mygrid.org.uk/artifactory/repo/net/sf/taverna/t2/infrastructure/launcher-api/2.6-SNAPSHOT/maven-metadata.xml
[INFO] Downloaded: http://repository.mygrid.org.uk/artifactory/repo/net/sf/taverna/t2/infrastructure/launcher-api/2.6-SNAPSHOT/maven-metadata.xml (2 KB at 1.1 KB/sec)
[INFO] Downloading: http://repository.mygrid.org.uk/artifactory/repo/net/sf/taverna/t2/infrastructure/launcher-api/2.6-SNAPSHOT/launcher-api-2.6-20141203.194409-13.pom
[INFO] Downloaded: http://repository.mygrid.org.uk/artifactory/repo/net/sf/taverna/t2/infrastructure/launcher-api/2.6-SNAPSHOT/launcher-api-2.6-20141203.194409-13.pom (549 B at 5.0 KB/sec)
[INFO] Downloading: http://repository.mygrid.org.uk/artifactory/repo/net/sf/taverna/t2/infrastructure/prelauncher/2.6-SNAPSHOT/maven-metadata.xml
[INFO] Downloaded: http://repository.mygrid.org.uk/artifactory/repo/net/sf/taverna/t2/infrastructure/prelauncher/2.6-SNAPSHOT/maven-metadata.xml (2 KB at 1.0 KB/sec)
[INFO] Downloading: http://repository.mygrid.org.uk/artifactory/repo/net/sf/taverna/t2/infrastructure/prelauncher/2.6-SNAPSHOT/prelauncher-2.6-20141203.194409-13.pom
[INFO] Downloaded: http://repository.mygrid.org.uk/artifactory/repo/net/sf/taverna/t2/infrastructure/prelauncher/2.6-SNAPSHOT/prelauncher-2.6-20141203.194409-13.pom (2 KB at 23.9 KB/sec)
[INFO] Downloading: http://repository.mygrid.org.uk/artifactory/repo/net/sf/taverna/t2/infrastructure/spi-discovery-api/2.6-SNAPSHOT/spi-discovery-api-2.6-20141203.194409-13.jar
[INFO] Downloading: http://repository.mygrid.org.uk/artifactory/repo/net/sf/taverna/t2/infrastructure/raven/2.6-SNAPSHOT/raven-2.6-20141203.194409-13.jar
[INFO] Downloading: http://repository.mygrid.org.uk/artifactory/repo/net/sf/taverna/t2/infrastructure/appconfig/2.6-SNAPSHOT/appconfig-2.6-20141203.194409-13.jar
[INFO] Downloading: http://repository.mygrid.org.uk/artifactory/repo/net/sf/taverna/t2/infrastructure/raven-log4j/2.6-SNAPSHOT/raven-log4j-2.6-20141203.194409-13.jar
[INFO] Downloading: http://repository.mygrid.org.uk/artifactory/repo/net/sf/taverna/t2/infrastructure/launcher-api/2.6-SNAPSHOT/launcher-api-2.6-20141203.194409-13.jar
[INFO] Downloaded: http://repository.mygrid.org.uk/artifactory/repo/net/sf/taverna/t2/infrastructure/raven-log4j/2.6-SNAPSHOT/raven-log4j-2.6-20141203.194409-13.jar (4 KB at 17.4 KB/sec)
[INFO] Downloading: http://repository.mygrid.org.uk/artifactory/repo/net/sf/taverna/t2/infrastructure/prelauncher/2.6-SNAPSHOT/prelauncher-2.6-20141203.194409-13.jar
[INFO] Downloaded: http://repository.mygrid.org.uk/artifactory/repo/net/sf/taverna/t2/infrastructure/spi-discovery-api/2.6-SNAPSHOT/spi-discovery-api-2.6-20141203.194409-13.jar (6 KB at 24.9 KB/sec)
[INFO] Downloaded: http://repository.mygrid.org.uk/artifactory/repo/net/sf/taverna/t2/infrastructure/appconfig/2.6-SNAPSHOT/appconfig-2.6-20141203.194409-13.jar (29 KB at 128.3 KB/sec)
[INFO] Downloaded: http://repository.mygrid.org.uk/artifactory/repo/net/sf/taverna/t2/infrastructure/raven/2.6-SNAPSHOT/raven-2.6-20141203.194409-13.jar (85 KB at 358.1 KB/sec)
[INFO] Downloaded: http://repository.mygrid.org.uk/artifactory/repo/net/sf/taverna/t2/infrastructure/launcher-api/2.6-SNAPSHOT/launcher-api-2.6-20141203.194409-13.jar (3 KB at 9.5 KB/sec)
[INFO] Downloaded: http://repository.mygrid.org.uk/artifactory/repo/net/sf/taverna/t2/infrastructure/prelauncher/2.6-SNAPSHOT/prelauncher-2.6-20141203.194409-13.jar (9 KB at 54.1 KB/sec)
[INFO] 
[INFO] --- maven-clean-plugin:2.5:clean (default-clean) @ credential-manager ---
[INFO] Deleting /var/lib/jenkins/workspace/taverna-engine-credential-manager-maintenance/credential-manager/target
[INFO] 
[INFO] --- maven-resources-plugin:2.6:resources (default-resources) @ credential-manager ---
[INFO] Using 'UTF-8' encoding to copy filtered resources.
[INFO] Copying 7 resources
[INFO] 
[INFO] --- maven-compiler-plugin:3.1:compile (default-compile) @ credential-manager ---
[INFO] Changes detected - recompiling the module!
[INFO] Compiling 10 source files to /var/lib/jenkins/workspace/taverna-engine-credential-manager-maintenance/credential-manager/target/classes
[INFO] 
[INFO] --- maven-resources-plugin:2.6:testResources (default-testResources) @ credential-manager ---
[INFO] Using 'UTF-8' encoding to copy filtered resources.
[INFO] Copying 3 resources
[INFO] 
[INFO] --- maven-compiler-plugin:3.1:testCompile (default-testCompile) @ credential-manager ---
[INFO] Changes detected - recompiling the module!
[INFO] Compiling 4 source files to /var/lib/jenkins/workspace/taverna-engine-credential-manager-maintenance/credential-manager/target/test-classes
[INFO] 
[INFO] --- maven-surefire-plugin:2.17:test (default-test) @ credential-manager ---
[INFO] Surefire report directory: /var/lib/jenkins/workspace/taverna-engine-credential-manager-maintenance/credential-manager/target/surefire-reports

-------------------------------------------------------
 T E S T S
-------------------------------------------------------
Running net.sf.taverna.t2.security.credentialmanager.PossibleLookupsTest
log4j:WARN No appenders could be found for logger (net.sf.taverna.raven.log.Log).
log4j:WARN Please initialize the log4j system properly.
log4j:WARN See http://logging.apache.org/log4j/1.2/faq.html#noconfig for more info.
Tests run: 8, Failures: 0, Errors: 0, Skipped: 0, Time elapsed: 0.802 sec - in net.sf.taverna.t2.security.credentialmanager.PossibleLookupsTest
Running net.sf.taverna.t2.security.credentialmanager.BasicAuthTest
ApplicationConfig could not determine application name, using unknownApplication-a2b4d07e-4310-412c-bc26-5e3a434bfb48
ApplicationConfig could not determine application name, using unknownApplication-a2b4d07e-4310-412c-bc26-5e3a434bfb48
2014-12-03 19:46:26.230:INFO::Logging to STDERR via org.mortbay.log.StdErrLog
2014-12-03 19:46:26.333:INFO::jetty-6.1.24
2014-12-03 19:46:26.581:INFO::NO JSP Support for /, did not find org.apache.jasper.servlet.JspServlet
2014-12-03 19:46:26.725:INFO::Started SelectChannelConnector@0.0.0.0:9638
2014-12-03 19:46:27.027:WARN::AUTH FAILURE: user basicUser
2014-12-03 19:46:27.031:WARN::AUTH FAILURE: user basicUser
2014-12-03 19:46:27.039:WARN::AUTH FAILURE: user basicUser
2014-12-03 19:46:27.043:WARN::AUTH FAILURE: user basicUser
2014-12-03 19:46:27.047:WARN::AUTH FAILURE: user basicUser
2014-12-03 19:46:27.060:WARN::AUTH FAILURE: user basicUser
2014-12-03 19:46:27.065:WARN::AUTH FAILURE: user basicUser
2014-12-03 19:46:27.069:WARN::AUTH FAILURE: user basicUser
2014-12-03 19:46:27.077:WARN::AUTH FAILURE: user basicUser
2014-12-03 19:46:27.080:WARN::AUTH FAILURE: user basicUser
2014-12-03 19:46:27.086:WARN::AUTH FAILURE: user basicUser
2014-12-03 19:46:27.092:WARN::AUTH FAILURE: user basicUser
2014-12-03 19:46:27.098:WARN::AUTH FAILURE: user basicUser
2014-12-03 19:46:27.103:WARN::AUTH FAILURE: user basicUser
2014-12-03 19:46:27.117:WARN::AUTH FAILURE: user basicUser
2014-12-03 19:46:27.126:WARN::AUTH FAILURE: user basicUser
2014-12-03 19:46:27.131:WARN::AUTH FAILURE: user basicUser
2014-12-03 19:46:27.135:WARN::AUTH FAILURE: user basicUser
2014-12-03 19:46:27.140:WARN::AUTH FAILURE: user basicUser
2014-12-03 19:46:27.262:WARN::AUTH FAILURE: user basicUser
2014-12-03 19:46:27.277:WARN::AUTH FAILURE: user basicUser
2014-12-03 19:46:27.289:WARN::AUTH FAILURE: user basicUser
2014-12-03 19:46:27.309:WARN::AUTH FAILURE: user basicUser
2014-12-03 19:46:27.325:WARN::AUTH FAILURE: user basicUser
2014-12-03 19:46:27.352:WARN::AUTH FAILURE: user basicUser
2014-12-03 19:46:27.362:WARN::AUTH FAILURE: user basicUser
2014-12-03 19:46:27.372:WARN::AUTH FAILURE: user basicUser
2014-12-03 19:46:27.381:WARN::AUTH FAILURE: user basicUser
2014-12-03 19:46:27.394:WARN::AUTH FAILURE: user basicUser
2014-12-03 19:46:27.409:WARN::AUTH FAILURE: user basicUser
2014-12-03 19:46:27.418:WARN::AUTH FAILURE: user basicUser
2014-12-03 19:46:27.428:WARN::AUTH FAILURE: user basicUser
2014-12-03 19:46:27.448:WARN::AUTH FAILURE: user basicUser
2014-12-03 19:46:27.456:WARN::AUTH FAILURE: user basicUser
2014-12-03 19:46:27.484:WARN::AUTH FAILURE: user basicUser
2014-12-03 19:46:27.492:WARN::AUTH FAILURE: user basicUser
2014-12-03 19:46:27.503:WARN::AUTH FAILURE: user basicUser
2014-12-03 19:46:27.514:WARN::AUTH FAILURE: user basicUser
2014-12-03 19:46:27.549:INFO::Stopped SelectChannelConnector@0.0.0.0:9638
Tests run: 6, Failures: 0, Errors: 0, Skipped: 0, Time elapsed: 3.631 sec - in net.sf.taverna.t2.security.credentialmanager.BasicAuthTest

Results :

Tests run: 14, Failures: 0, Errors: 0, Skipped: 0

[JENKINS] Recording test results
[INFO] 
[INFO] --- maven-jar-plugin:2.4:jar (default-jar) @ credential-manager ---
[INFO] Building jar: /var/lib/jenkins/workspace/taverna-engine-credential-manager-maintenance/credential-manager/target/credential-manager-1.6-SNAPSHOT.jar
[INFO] 
[INFO] >>> maven-source-plugin:2.2.1:jar (default) @ credential-manager >>>
[WARNING] Failed to getClass for org.apache.maven.plugin.source.SourceJarMojo
[INFO] 
[INFO] <<< maven-source-plugin:2.2.1:jar (default) @ credential-manager <<<
[INFO] 
[INFO] --- maven-source-plugin:2.2.1:jar (default) @ credential-manager ---
[INFO] Building jar: /var/lib/jenkins/workspace/taverna-engine-credential-manager-maintenance/credential-manager/target/credential-manager-1.6-SNAPSHOT-sources.jar
[INFO] 
[INFO] >>> maven-source-plugin:2.2.1:test-jar (default) @ credential-manager >>>
[WARNING] Failed to getClass for org.apache.maven.plugin.source.TestSourceJarMojo
[INFO] 
[INFO] <<< maven-source-plugin:2.2.1:test-jar (default) @ credential-manager <<<
[INFO] 
[INFO] --- maven-source-plugin:2.2.1:test-jar (default) @ credential-manager ---
[INFO] Building jar: /var/lib/jenkins/workspace/taverna-engine-credential-manager-maintenance/credential-manager/target/credential-manager-1.6-SNAPSHOT-test-sources.jar
[INFO] 
[INFO] --- maven-jar-plugin:2.4:test-jar (default) @ credential-manager ---
[INFO] Building jar: /var/lib/jenkins/workspace/taverna-engine-credential-manager-maintenance/credential-manager/target/credential-manager-1.6-SNAPSHOT-tests.jar
[INFO] 
[INFO] --- maven-install-plugin:2.4:install (default-install) @ credential-manager ---
[INFO] Installing /var/lib/jenkins/workspace/taverna-engine-credential-manager-maintenance/credential-manager/target/credential-manager-1.6-SNAPSHOT.jar to /var/lib/jenkins/workspace/taverna-engine-credential-manager-maintenance/.repository/net/sf/taverna/t2/security/credential-manager/1.6-SNAPSHOT/credential-manager-1.6-SNAPSHOT.jar
[INFO] Installing /var/lib/jenkins/workspace/taverna-engine-credential-manager-maintenance/credential-manager/pom.xml to /var/lib/jenkins/workspace/taverna-engine-credential-manager-maintenance/.repository/net/sf/taverna/t2/security/credential-manager/1.6-SNAPSHOT/credential-manager-1.6-SNAPSHOT.pom
[INFO] Installing /var/lib/jenkins/workspace/taverna-engine-credential-manager-maintenance/credential-manager/target/credential-manager-1.6-SNAPSHOT-sources.jar to /var/lib/jenkins/workspace/taverna-engine-credential-manager-maintenance/.repository/net/sf/taverna/t2/security/credential-manager/1.6-SNAPSHOT/credential-manager-1.6-SNAPSHOT-sources.jar
[INFO] Installing /var/lib/jenkins/workspace/taverna-engine-credential-manager-maintenance/credential-manager/target/credential-manager-1.6-SNAPSHOT-test-sources.jar to /var/lib/jenkins/workspace/taverna-engine-credential-manager-maintenance/.repository/net/sf/taverna/t2/security/credential-manager/1.6-SNAPSHOT/credential-manager-1.6-SNAPSHOT-test-sources.jar
[INFO] Installing /var/lib/jenkins/workspace/taverna-engine-credential-manager-maintenance/credential-manager/target/credential-manager-1.6-SNAPSHOT-tests.jar to /var/lib/jenkins/workspace/taverna-engine-credential-manager-maintenance/.repository/net/sf/taverna/t2/security/credential-manager/1.6-SNAPSHOT/credential-manager-1.6-SNAPSHOT-tests.jar