SuccessConsole Output

[INFO]                                                                         
[INFO] ------------------------------------------------------------------------
[INFO] Building Credential manager 1.6-SNAPSHOT
[INFO] ------------------------------------------------------------------------
[INFO] Downloading: http://repository.mygrid.org.uk/artifactory/repo/org/apache/maven/plugins/maven-resources-plugin/2.6/maven-resources-plugin-2.6.pom
[INFO] Downloaded: http://repository.mygrid.org.uk/artifactory/repo/org/apache/maven/plugins/maven-resources-plugin/2.6/maven-resources-plugin-2.6.pom (8 KB at 139.0 KB/sec)
[INFO] Downloading: http://repository.mygrid.org.uk/artifactory/repo/org/apache/maven/plugins/maven-resources-plugin/2.6/maven-resources-plugin-2.6.jar
[INFO] Downloaded: http://repository.mygrid.org.uk/artifactory/repo/org/apache/maven/plugins/maven-resources-plugin/2.6/maven-resources-plugin-2.6.jar (29 KB at 339.1 KB/sec)
[INFO] Downloading: http://repository.mygrid.org.uk/artifactory/repo/org/apache/maven/plugins/maven-compiler-plugin/3.1/maven-compiler-plugin-3.1.pom
[INFO] Downloaded: http://repository.mygrid.org.uk/artifactory/repo/org/apache/maven/plugins/maven-compiler-plugin/3.1/maven-compiler-plugin-3.1.pom (10 KB at 212.1 KB/sec)
[INFO] Downloading: http://repository.mygrid.org.uk/artifactory/repo/org/apache/maven/plugins/maven-plugins/24/maven-plugins-24.pom
[INFO] Downloaded: http://repository.mygrid.org.uk/artifactory/repo/org/apache/maven/plugins/maven-plugins/24/maven-plugins-24.pom (11 KB at 185.1 KB/sec)
[INFO] Downloading: http://repository.mygrid.org.uk/artifactory/repo/org/apache/maven/maven-parent/23/maven-parent-23.pom
[INFO] Downloaded: http://repository.mygrid.org.uk/artifactory/repo/org/apache/maven/maven-parent/23/maven-parent-23.pom (32 KB at 776.2 KB/sec)
[INFO] Downloading: http://repository.mygrid.org.uk/artifactory/repo/org/apache/apache/13/apache-13.pom
[INFO] Downloaded: http://repository.mygrid.org.uk/artifactory/repo/org/apache/apache/13/apache-13.pom (14 KB at 41.9 KB/sec)
[INFO] Downloading: http://repository.mygrid.org.uk/artifactory/repo/org/apache/maven/plugins/maven-compiler-plugin/3.1/maven-compiler-plugin-3.1.jar
[INFO] Downloaded: http://repository.mygrid.org.uk/artifactory/repo/org/apache/maven/plugins/maven-compiler-plugin/3.1/maven-compiler-plugin-3.1.jar (42 KB at 953.2 KB/sec)
[INFO] Downloading: http://repository.mygrid.org.uk/artifactory/repo/org/apache/maven/plugins/maven-surefire-plugin/2.17/maven-surefire-plugin-2.17.pom
[INFO] Downloaded: http://repository.mygrid.org.uk/artifactory/repo/org/apache/maven/plugins/maven-surefire-plugin/2.17/maven-surefire-plugin-2.17.pom (5 KB at 46.1 KB/sec)
[INFO] Downloading: http://repository.mygrid.org.uk/artifactory/repo/org/apache/maven/surefire/surefire/2.17/surefire-2.17.pom
[INFO] Downloaded: http://repository.mygrid.org.uk/artifactory/repo/org/apache/maven/surefire/surefire/2.17/surefire-2.17.pom (17 KB at 286.5 KB/sec)
[INFO] Downloading: http://repository.mygrid.org.uk/artifactory/repo/org/apache/maven/plugins/maven-surefire-plugin/2.17/maven-surefire-plugin-2.17.jar
[INFO] Downloaded: http://repository.mygrid.org.uk/artifactory/repo/org/apache/maven/plugins/maven-surefire-plugin/2.17/maven-surefire-plugin-2.17.jar (34 KB at 983.2 KB/sec)
[INFO] Downloading: http://repository.mygrid.org.uk/artifactory/repo/net/sf/taverna/t2/infrastructure/spi-discovery-api/2.6-SNAPSHOT/maven-metadata.xml
[INFO] Downloaded: http://repository.mygrid.org.uk/artifactory/repo/net/sf/taverna/t2/infrastructure/spi-discovery-api/2.6-SNAPSHOT/maven-metadata.xml (2 KB at 11.5 KB/sec)
[INFO] Downloading: http://repository.mygrid.org.uk/artifactory/repo/net/sf/taverna/t2/infrastructure/spi-discovery-api/2.6-SNAPSHOT/spi-discovery-api-2.6-20141117.163049-11.pom
[INFO] Downloaded: http://repository.mygrid.org.uk/artifactory/repo/net/sf/taverna/t2/infrastructure/spi-discovery-api/2.6-SNAPSHOT/spi-discovery-api-2.6-20141117.163049-11.pom (2 KB at 16.1 KB/sec)
[INFO] Downloading: http://repository.mygrid.org.uk/artifactory/repo/net/sf/taverna/t2/infrastructure/2.6-SNAPSHOT/maven-metadata.xml
[INFO] Downloaded: http://repository.mygrid.org.uk/artifactory/repo/net/sf/taverna/t2/infrastructure/2.6-SNAPSHOT/maven-metadata.xml (805 B at 7.9 KB/sec)
[INFO] Downloading: http://repository.mygrid.org.uk/artifactory/repo/net/sf/taverna/t2/infrastructure/2.6-SNAPSHOT/infrastructure-2.6-20141117.163049-11.pom
[INFO] Downloaded: http://repository.mygrid.org.uk/artifactory/repo/net/sf/taverna/t2/infrastructure/2.6-SNAPSHOT/infrastructure-2.6-20141117.163049-11.pom (4 KB at 60.5 KB/sec)
[INFO] Downloading: http://repository.mygrid.org.uk/artifactory/repo/net/sf/taverna/t2/lang/observer/1.6-SNAPSHOT/maven-metadata.xml
[INFO] Downloaded: http://repository.mygrid.org.uk/artifactory/repo/net/sf/taverna/t2/lang/observer/1.6-SNAPSHOT/maven-metadata.xml (2 KB at 25.9 KB/sec)
[INFO] Downloading: http://repository.mygrid.org.uk/artifactory/repo/net/sf/taverna/t2/lang/observer/1.6-SNAPSHOT/observer-1.6-20141117.162858-11.pom
[INFO] Downloaded: http://repository.mygrid.org.uk/artifactory/repo/net/sf/taverna/t2/lang/observer/1.6-SNAPSHOT/observer-1.6-20141117.162858-11.pom (833 B at 10.3 KB/sec)
[INFO] Downloading: http://repository.mygrid.org.uk/artifactory/repo/net/sf/taverna/t2/lang/1.6-SNAPSHOT/maven-metadata.xml
[INFO] Downloaded: http://repository.mygrid.org.uk/artifactory/repo/net/sf/taverna/t2/lang/1.6-SNAPSHOT/maven-metadata.xml (795 B at 11.9 KB/sec)
[INFO] Downloading: http://repository.mygrid.org.uk/artifactory/repo/net/sf/taverna/t2/lang/1.6-SNAPSHOT/lang-1.6-20141117.162858-11.pom
[INFO] Downloaded: http://repository.mygrid.org.uk/artifactory/repo/net/sf/taverna/t2/lang/1.6-SNAPSHOT/lang-1.6-20141117.162858-11.pom (3 KB at 37.4 KB/sec)
[INFO] Downloading: http://repository.mygrid.org.uk/artifactory/repo/log4j/log4j/1.2.16/log4j-1.2.16.pom
[INFO] Downloaded: http://repository.mygrid.org.uk/artifactory/repo/log4j/log4j/1.2.16/log4j-1.2.16.pom (20 KB at 367.8 KB/sec)
[INFO] Downloading: http://repository.mygrid.org.uk/artifactory/repo/net/sf/taverna/t2/infrastructure/raven/2.6-SNAPSHOT/maven-metadata.xml
[INFO] Downloaded: http://repository.mygrid.org.uk/artifactory/repo/net/sf/taverna/t2/infrastructure/raven/2.6-SNAPSHOT/maven-metadata.xml (2 KB at 21.2 KB/sec)
[INFO] Downloading: http://repository.mygrid.org.uk/artifactory/repo/net/sf/taverna/t2/infrastructure/raven/2.6-SNAPSHOT/raven-2.6-20141117.163049-11.pom
[INFO] Downloaded: http://repository.mygrid.org.uk/artifactory/repo/net/sf/taverna/t2/infrastructure/raven/2.6-SNAPSHOT/raven-2.6-20141117.163049-11.pom (2 KB at 19.3 KB/sec)
[INFO] Downloading: http://repository.mygrid.org.uk/artifactory/repo/net/sf/taverna/t2/infrastructure/raven-log4j/2.6-SNAPSHOT/maven-metadata.xml
[INFO] Downloaded: http://repository.mygrid.org.uk/artifactory/repo/net/sf/taverna/t2/infrastructure/raven-log4j/2.6-SNAPSHOT/maven-metadata.xml (2 KB at 20.2 KB/sec)
[INFO] Downloading: http://repository.mygrid.org.uk/artifactory/repo/net/sf/taverna/t2/infrastructure/raven-log4j/2.6-SNAPSHOT/raven-log4j-2.6-20141117.163049-11.pom
[INFO] Downloaded: http://repository.mygrid.org.uk/artifactory/repo/net/sf/taverna/t2/infrastructure/raven-log4j/2.6-SNAPSHOT/raven-log4j-2.6-20141117.163049-11.pom (952 B at 12.9 KB/sec)
[INFO] Downloading: http://repository.mygrid.org.uk/artifactory/repo/net/sf/taverna/t2/infrastructure/appconfig/2.6-SNAPSHOT/maven-metadata.xml
[INFO] Downloaded: http://repository.mygrid.org.uk/artifactory/repo/net/sf/taverna/t2/infrastructure/appconfig/2.6-SNAPSHOT/maven-metadata.xml (2 KB at 25.6 KB/sec)
[INFO] Downloading: http://repository.mygrid.org.uk/artifactory/repo/net/sf/taverna/t2/infrastructure/appconfig/2.6-SNAPSHOT/appconfig-2.6-20141117.163049-11.pom
[INFO] Downloaded: http://repository.mygrid.org.uk/artifactory/repo/net/sf/taverna/t2/infrastructure/appconfig/2.6-SNAPSHOT/appconfig-2.6-20141117.163049-11.pom (2 KB at 25.8 KB/sec)
[INFO] Downloading: http://repository.mygrid.org.uk/artifactory/repo/net/sf/taverna/t2/infrastructure/launcher-api/2.6-SNAPSHOT/maven-metadata.xml
[INFO] Downloaded: http://repository.mygrid.org.uk/artifactory/repo/net/sf/taverna/t2/infrastructure/launcher-api/2.6-SNAPSHOT/maven-metadata.xml (2 KB at 18.4 KB/sec)
[INFO] Downloading: http://repository.mygrid.org.uk/artifactory/repo/net/sf/taverna/t2/infrastructure/launcher-api/2.6-SNAPSHOT/launcher-api-2.6-20141117.163049-11.pom
[INFO] Downloaded: http://repository.mygrid.org.uk/artifactory/repo/net/sf/taverna/t2/infrastructure/launcher-api/2.6-SNAPSHOT/launcher-api-2.6-20141117.163049-11.pom (549 B at 10.7 KB/sec)
[INFO] Downloading: http://repository.mygrid.org.uk/artifactory/repo/net/sf/taverna/t2/infrastructure/prelauncher/2.6-SNAPSHOT/maven-metadata.xml
[INFO] Downloaded: http://repository.mygrid.org.uk/artifactory/repo/net/sf/taverna/t2/infrastructure/prelauncher/2.6-SNAPSHOT/maven-metadata.xml (2 KB at 34.7 KB/sec)
[INFO] Downloading: http://repository.mygrid.org.uk/artifactory/repo/net/sf/taverna/t2/infrastructure/prelauncher/2.6-SNAPSHOT/prelauncher-2.6-20141117.163049-11.pom
[INFO] Downloaded: http://repository.mygrid.org.uk/artifactory/repo/net/sf/taverna/t2/infrastructure/prelauncher/2.6-SNAPSHOT/prelauncher-2.6-20141117.163049-11.pom (2 KB at 25.8 KB/sec)
[INFO] Downloading: http://repository.mygrid.org.uk/artifactory/repo/bouncycastle/bcprov-jdk16/140/bcprov-jdk16-140.pom
[INFO] Downloaded: http://repository.mygrid.org.uk/artifactory/repo/bouncycastle/bcprov-jdk16/140/bcprov-jdk16-140.pom (2 KB at 15.0 KB/sec)
[INFO] Downloading: http://repository.mygrid.org.uk/artifactory/repo/junit/junit/4.8.1/junit-4.8.1.pom
[INFO] Downloaded: http://repository.mygrid.org.uk/artifactory/repo/junit/junit/4.8.1/junit-4.8.1.pom (949 B at 22.6 KB/sec)
[INFO] Downloading: http://repository.mygrid.org.uk/artifactory/repo/commons-io/commons-io/1.4/commons-io-1.4.pom
[INFO] Downloaded: http://repository.mygrid.org.uk/artifactory/repo/commons-io/commons-io/1.4/commons-io-1.4.pom (13 KB at 357.2 KB/sec)
[INFO] Downloading: http://repository.mygrid.org.uk/artifactory/repo/org/apache/commons/commons-parent/7/commons-parent-7.pom
[INFO] Downloaded: http://repository.mygrid.org.uk/artifactory/repo/org/apache/commons/commons-parent/7/commons-parent-7.pom (18 KB at 335.0 KB/sec)
[INFO] Downloading: http://repository.mygrid.org.uk/artifactory/repo/org/mortbay/jetty/jetty/6.1.24/jetty-6.1.24.pom
[INFO] Downloaded: http://repository.mygrid.org.uk/artifactory/repo/org/mortbay/jetty/jetty/6.1.24/jetty-6.1.24.pom (7 KB at 40.5 KB/sec)
[INFO] Downloading: http://repository.mygrid.org.uk/artifactory/repo/org/mortbay/jetty/project/6.1.24/project-6.1.24.pom
[INFO] Downloaded: http://repository.mygrid.org.uk/artifactory/repo/org/mortbay/jetty/project/6.1.24/project-6.1.24.pom (10 KB at 219.7 KB/sec)
[INFO] Downloading: http://repository.mygrid.org.uk/artifactory/repo/org/mortbay/jetty/jetty-parent/9/jetty-parent-9.pom
[INFO] Downloaded: http://repository.mygrid.org.uk/artifactory/repo/org/mortbay/jetty/jetty-parent/9/jetty-parent-9.pom (3 KB at 25.2 KB/sec)
[INFO] Downloading: http://repository.mygrid.org.uk/artifactory/repo/org/eclipse/jetty/jetty-parent/12/jetty-parent-12.pom
[INFO] Downloaded: http://repository.mygrid.org.uk/artifactory/repo/org/eclipse/jetty/jetty-parent/12/jetty-parent-12.pom (16 KB at 140.3 KB/sec)
[INFO] Downloading: http://repository.mygrid.org.uk/artifactory/repo/org/mortbay/jetty/jetty-util/6.1.24/jetty-util-6.1.24.pom
[INFO] Downloaded: http://repository.mygrid.org.uk/artifactory/repo/org/mortbay/jetty/jetty-util/6.1.24/jetty-util-6.1.24.pom (4 KB at 35.0 KB/sec)
[INFO] Downloading: http://repository.mygrid.org.uk/artifactory/repo/org/mortbay/jetty/servlet-api/2.5-20081211/servlet-api-2.5-20081211.pom
[INFO] Downloaded: http://repository.mygrid.org.uk/artifactory/repo/org/mortbay/jetty/servlet-api/2.5-20081211/servlet-api-2.5-20081211.pom (3 KB at 29.4 KB/sec)
[INFO] Downloading: http://repository.mygrid.org.uk/artifactory/repo/org/mortbay/jetty/jetty-parent/7/jetty-parent-7.pom
[INFO] Downloaded: http://repository.mygrid.org.uk/artifactory/repo/org/mortbay/jetty/jetty-parent/7/jetty-parent-7.pom (13 KB at 94.9 KB/sec)
[INFO] Downloading: http://repository.mygrid.org.uk/artifactory/repo/net/sf/taverna/t2/infrastructure/spi-discovery-api/2.6-SNAPSHOT/spi-discovery-api-2.6-20141117.163049-11.jar
[INFO] Downloading: http://repository.mygrid.org.uk/artifactory/repo/net/sf/taverna/t2/lang/observer/1.6-SNAPSHOT/observer-1.6-20141117.162858-11.jar
[INFO] Downloading: http://repository.mygrid.org.uk/artifactory/repo/bouncycastle/bcprov-jdk16/140/bcprov-jdk16-140.jar
[INFO] Downloading: http://repository.mygrid.org.uk/artifactory/repo/net/sf/taverna/t2/infrastructure/raven-log4j/2.6-SNAPSHOT/raven-log4j-2.6-20141117.163049-11.jar
[INFO] Downloading: http://repository.mygrid.org.uk/artifactory/repo/net/sf/taverna/t2/infrastructure/raven/2.6-SNAPSHOT/raven-2.6-20141117.163049-11.jar
[INFO] Downloaded: http://repository.mygrid.org.uk/artifactory/repo/net/sf/taverna/t2/lang/observer/1.6-SNAPSHOT/observer-1.6-20141117.162858-11.jar (5 KB at 15.0 KB/sec)
[INFO] Downloading: http://repository.mygrid.org.uk/artifactory/repo/net/sf/taverna/t2/infrastructure/appconfig/2.6-SNAPSHOT/appconfig-2.6-20141117.163049-11.jar
[INFO] Downloaded: http://repository.mygrid.org.uk/artifactory/repo/net/sf/taverna/t2/infrastructure/raven-log4j/2.6-SNAPSHOT/raven-log4j-2.6-20141117.163049-11.jar (4 KB at 11.2 KB/sec)
[INFO] Downloading: http://repository.mygrid.org.uk/artifactory/repo/net/sf/taverna/t2/infrastructure/launcher-api/2.6-SNAPSHOT/launcher-api-2.6-20141117.163049-11.jar
[INFO] Downloaded: http://repository.mygrid.org.uk/artifactory/repo/net/sf/taverna/t2/infrastructure/spi-discovery-api/2.6-SNAPSHOT/spi-discovery-api-2.6-20141117.163049-11.jar (6 KB at 16.5 KB/sec)
[INFO] Downloaded: http://repository.mygrid.org.uk/artifactory/repo/net/sf/taverna/t2/infrastructure/raven/2.6-SNAPSHOT/raven-2.6-20141117.163049-11.jar (85 KB at 263.2 KB/sec)
[INFO] Downloading: http://repository.mygrid.org.uk/artifactory/repo/net/sf/taverna/t2/infrastructure/prelauncher/2.6-SNAPSHOT/prelauncher-2.6-20141117.163049-11.jar
[INFO] Downloading: http://repository.mygrid.org.uk/artifactory/repo/log4j/log4j/1.2.16/log4j-1.2.16.jar
[INFO] Downloaded: http://repository.mygrid.org.uk/artifactory/repo/net/sf/taverna/t2/infrastructure/prelauncher/2.6-SNAPSHOT/prelauncher-2.6-20141117.163049-11.jar (9 KB at 59.2 KB/sec)
[INFO] Downloading: http://repository.mygrid.org.uk/artifactory/repo/junit/junit/4.8.1/junit-4.8.1.jar
[INFO] Downloaded: http://repository.mygrid.org.uk/artifactory/repo/net/sf/taverna/t2/infrastructure/appconfig/2.6-SNAPSHOT/appconfig-2.6-20141117.163049-11.jar (29 KB at 146.4 KB/sec)
[INFO] Downloading: http://repository.mygrid.org.uk/artifactory/repo/commons-io/commons-io/1.4/commons-io-1.4.jar
[INFO] Downloaded: http://repository.mygrid.org.uk/artifactory/repo/net/sf/taverna/t2/infrastructure/launcher-api/2.6-SNAPSHOT/launcher-api-2.6-20141117.163049-11.jar (3 KB at 13.9 KB/sec)
[INFO] Downloading: http://repository.mygrid.org.uk/artifactory/repo/org/mortbay/jetty/jetty/6.1.24/jetty-6.1.24.jar
[INFO] Downloaded: http://repository.mygrid.org.uk/artifactory/repo/log4j/log4j/1.2.16/log4j-1.2.16.jar (471 KB at 2207.7 KB/sec)
[INFO] Downloading: http://repository.mygrid.org.uk/artifactory/repo/org/mortbay/jetty/jetty-util/6.1.24/jetty-util-6.1.24.jar
[INFO] Downloaded: http://repository.mygrid.org.uk/artifactory/repo/commons-io/commons-io/1.4/commons-io-1.4.jar (107 KB at 744.7 KB/sec)
[INFO] Downloading: http://repository.mygrid.org.uk/artifactory/repo/org/mortbay/jetty/servlet-api/2.5-20081211/servlet-api-2.5-20081211.jar
[INFO] Downloaded: http://repository.mygrid.org.uk/artifactory/repo/junit/junit/4.8.1/junit-4.8.1.jar (232 KB at 1181.1 KB/sec)
[INFO] Downloaded: http://repository.mygrid.org.uk/artifactory/repo/org/mortbay/jetty/servlet-api/2.5-20081211/servlet-api-2.5-20081211.jar (131 KB at 748.5 KB/sec)
[INFO] Downloaded: http://repository.mygrid.org.uk/artifactory/repo/org/mortbay/jetty/jetty-util/6.1.24/jetty-util-6.1.24.jar (174 KB at 626.9 KB/sec)
[INFO] Downloaded: http://repository.mygrid.org.uk/artifactory/repo/org/mortbay/jetty/jetty/6.1.24/jetty-6.1.24.jar (526 KB at 1616.8 KB/sec)
[INFO] Downloaded: http://repository.mygrid.org.uk/artifactory/repo/bouncycastle/bcprov-jdk16/140/bcprov-jdk16-140.jar (1614 KB at 1035.1 KB/sec)
[INFO] 
[INFO] --- maven-clean-plugin:2.5:clean (default-clean) @ credential-manager ---
[INFO] Deleting /var/lib/jenkins/workspace/taverna-engine-credential-manager-maintenance/credential-manager/target
[INFO] 
[INFO] --- maven-resources-plugin:2.6:resources (default-resources) @ credential-manager ---
[INFO] Downloading: http://repository.mygrid.org.uk/artifactory/repo/org/codehaus/plexus/plexus-utils/2.0.5/plexus-utils-2.0.5.pom
[INFO] Downloaded: http://repository.mygrid.org.uk/artifactory/repo/org/codehaus/plexus/plexus-utils/2.0.5/plexus-utils-2.0.5.pom (4 KB at 83.5 KB/sec)
[INFO] Downloading: http://repository.mygrid.org.uk/artifactory/repo/org/codehaus/plexus/plexus/2.0.6/plexus-2.0.6.pom
[INFO] Downloaded: http://repository.mygrid.org.uk/artifactory/repo/org/codehaus/plexus/plexus/2.0.6/plexus-2.0.6.pom (17 KB at 334.1 KB/sec)
[INFO] Downloading: http://repository.mygrid.org.uk/artifactory/repo/org/apache/maven/shared/maven-filtering/1.1/maven-filtering-1.1.pom
[INFO] Downloaded: http://repository.mygrid.org.uk/artifactory/repo/org/apache/maven/shared/maven-filtering/1.1/maven-filtering-1.1.pom (6 KB at 27.2 KB/sec)
[INFO] Downloading: http://repository.mygrid.org.uk/artifactory/repo/org/codehaus/plexus/plexus-utils/1.5.15/plexus-utils-1.5.15.pom
[INFO] Downloaded: http://repository.mygrid.org.uk/artifactory/repo/org/codehaus/plexus/plexus-utils/1.5.15/plexus-utils-1.5.15.pom (7 KB at 128.6 KB/sec)
[INFO] Downloading: http://repository.mygrid.org.uk/artifactory/repo/org/codehaus/plexus/plexus/2.0.2/plexus-2.0.2.pom
[INFO] Downloaded: http://repository.mygrid.org.uk/artifactory/repo/org/codehaus/plexus/plexus/2.0.2/plexus-2.0.2.pom (12 KB at 210.0 KB/sec)
[INFO] Downloading: http://repository.mygrid.org.uk/artifactory/repo/org/codehaus/plexus/plexus-interpolation/1.12/plexus-interpolation-1.12.pom
[INFO] Downloaded: http://repository.mygrid.org.uk/artifactory/repo/org/codehaus/plexus/plexus-interpolation/1.12/plexus-interpolation-1.12.pom (889 B at 16.7 KB/sec)
[INFO] Downloading: http://repository.mygrid.org.uk/artifactory/repo/org/codehaus/plexus/plexus-components/1.1.14/plexus-components-1.1.14.pom
[INFO] Downloaded: http://repository.mygrid.org.uk/artifactory/repo/org/codehaus/plexus/plexus-components/1.1.14/plexus-components-1.1.14.pom (6 KB at 93.5 KB/sec)
[INFO] Downloading: http://repository.mygrid.org.uk/artifactory/repo/org/sonatype/plexus/plexus-build-api/0.0.4/plexus-build-api-0.0.4.pom
[INFO] Downloaded: http://repository.mygrid.org.uk/artifactory/repo/org/sonatype/plexus/plexus-build-api/0.0.4/plexus-build-api-0.0.4.pom (3 KB at 28.2 KB/sec)
[INFO] Downloading: http://repository.mygrid.org.uk/artifactory/repo/org/sonatype/spice/spice-parent/10/spice-parent-10.pom
[INFO] Downloaded: http://repository.mygrid.org.uk/artifactory/repo/org/sonatype/spice/spice-parent/10/spice-parent-10.pom (3 KB at 35.9 KB/sec)
[INFO] Downloading: http://repository.mygrid.org.uk/artifactory/repo/org/sonatype/forge/forge-parent/3/forge-parent-3.pom
[INFO] Downloaded: http://repository.mygrid.org.uk/artifactory/repo/org/sonatype/forge/forge-parent/3/forge-parent-3.pom (5 KB at 41.3 KB/sec)
[INFO] Downloading: http://repository.mygrid.org.uk/artifactory/repo/org/codehaus/plexus/plexus-utils/1.5.8/plexus-utils-1.5.8.pom
[INFO] Downloaded: http://repository.mygrid.org.uk/artifactory/repo/org/codehaus/plexus/plexus-utils/1.5.8/plexus-utils-1.5.8.pom (8 KB at 112.5 KB/sec)
[INFO] Downloading: http://repository.mygrid.org.uk/artifactory/repo/org/codehaus/plexus/plexus-interpolation/1.13/plexus-interpolation-1.13.pom
[INFO] Downloaded: http://repository.mygrid.org.uk/artifactory/repo/org/codehaus/plexus/plexus-interpolation/1.13/plexus-interpolation-1.13.pom (890 B at 2.7 KB/sec)
[INFO] Downloading: http://repository.mygrid.org.uk/artifactory/repo/org/codehaus/plexus/plexus-components/1.1.15/plexus-components-1.1.15.pom
[INFO] Downloaded: http://repository.mygrid.org.uk/artifactory/repo/org/codehaus/plexus/plexus-components/1.1.15/plexus-components-1.1.15.pom (3 KB at 30.2 KB/sec)
[INFO] Downloading: http://repository.mygrid.org.uk/artifactory/repo/org/codehaus/plexus/plexus/2.0.3/plexus-2.0.3.pom
[INFO] Downloaded: http://repository.mygrid.org.uk/artifactory/repo/org/codehaus/plexus/plexus/2.0.3/plexus-2.0.3.pom (16 KB at 149.5 KB/sec)
[INFO] Downloading: http://repository.mygrid.org.uk/artifactory/repo/org/codehaus/plexus/plexus-utils/2.0.5/plexus-utils-2.0.5.jar
[INFO] Downloading: http://repository.mygrid.org.uk/artifactory/repo/org/apache/maven/shared/maven-filtering/1.1/maven-filtering-1.1.jar
[INFO] Downloading: http://repository.mygrid.org.uk/artifactory/repo/org/codehaus/plexus/plexus-interpolation/1.13/plexus-interpolation-1.13.jar
[INFO] Downloading: http://repository.mygrid.org.uk/artifactory/repo/org/sonatype/plexus/plexus-build-api/0.0.4/plexus-build-api-0.0.4.jar
[INFO] Downloaded: http://repository.mygrid.org.uk/artifactory/repo/org/sonatype/plexus/plexus-build-api/0.0.4/plexus-build-api-0.0.4.jar (7 KB at 31.2 KB/sec)
[INFO] Downloaded: http://repository.mygrid.org.uk/artifactory/repo/org/codehaus/plexus/plexus-interpolation/1.13/plexus-interpolation-1.13.jar (60 KB at 272.3 KB/sec)
[INFO] Downloaded: http://repository.mygrid.org.uk/artifactory/repo/org/apache/maven/shared/maven-filtering/1.1/maven-filtering-1.1.jar (43 KB at 188.8 KB/sec)
[INFO] Downloaded: http://repository.mygrid.org.uk/artifactory/repo/org/codehaus/plexus/plexus-utils/2.0.5/plexus-utils-2.0.5.jar (218 KB at 947.6 KB/sec)
[INFO] Using 'UTF-8' encoding to copy filtered resources.
[INFO] Copying 7 resources
[INFO] 
[INFO] --- maven-compiler-plugin:3.1:compile (default-compile) @ credential-manager ---
[INFO] Downloading: http://repository.mygrid.org.uk/artifactory/repo/org/apache/maven/maven-core/2.0.9/maven-core-2.0.9.pom
[INFO] Downloaded: http://repository.mygrid.org.uk/artifactory/repo/org/apache/maven/maven-core/2.0.9/maven-core-2.0.9.pom (8 KB at 152.1 KB/sec)
[INFO] Downloading: http://repository.mygrid.org.uk/artifactory/repo/org/apache/maven/maven-plugin-parameter-documenter/2.0.9/maven-plugin-parameter-documenter-2.0.9.pom
[INFO] Downloaded: http://repository.mygrid.org.uk/artifactory/repo/org/apache/maven/maven-plugin-parameter-documenter/2.0.9/maven-plugin-parameter-documenter-2.0.9.pom (2 KB at 19.8 KB/sec)
[INFO] Downloading: http://repository.mygrid.org.uk/artifactory/repo/org/apache/maven/maven-error-diagnostics/2.0.9/maven-error-diagnostics-2.0.9.pom
[INFO] Downloaded: http://repository.mygrid.org.uk/artifactory/repo/org/apache/maven/maven-error-diagnostics/2.0.9/maven-error-diagnostics-2.0.9.pom (2 KB at 19.1 KB/sec)
[INFO] Downloading: http://repository.mygrid.org.uk/artifactory/repo/org/apache/maven/maven-plugin-descriptor/2.0.9/maven-plugin-descriptor-2.0.9.pom
[INFO] Downloaded: http://repository.mygrid.org.uk/artifactory/repo/org/apache/maven/maven-plugin-descriptor/2.0.9/maven-plugin-descriptor-2.0.9.pom (3 KB at 45.0 KB/sec)
[INFO] Downloading: http://repository.mygrid.org.uk/artifactory/repo/org/apache/maven/maven-monitor/2.0.9/maven-monitor-2.0.9.pom
[INFO] Downloaded: http://repository.mygrid.org.uk/artifactory/repo/org/apache/maven/maven-monitor/2.0.9/maven-monitor-2.0.9.pom (2 KB at 23.7 KB/sec)
[INFO] Downloading: http://repository.mygrid.org.uk/artifactory/repo/org/apache/maven/maven-toolchain/1.0/maven-toolchain-1.0.pom
[INFO] Downloaded: http://repository.mygrid.org.uk/artifactory/repo/org/apache/maven/maven-toolchain/1.0/maven-toolchain-1.0.pom (4 KB at 87.7 KB/sec)
[INFO] Downloading: http://repository.mygrid.org.uk/artifactory/repo/org/apache/maven/shared/maven-shared-utils/0.1/maven-shared-utils-0.1.pom
[INFO] Downloaded: http://repository.mygrid.org.uk/artifactory/repo/org/apache/maven/shared/maven-shared-utils/0.1/maven-shared-utils-0.1.pom (4 KB at 47.6 KB/sec)
[INFO] Downloading: http://repository.mygrid.org.uk/artifactory/repo/org/apache/maven/shared/maven-shared-components/18/maven-shared-components-18.pom
[INFO] Downloaded: http://repository.mygrid.org.uk/artifactory/repo/org/apache/maven/shared/maven-shared-components/18/maven-shared-components-18.pom (5 KB at 55.4 KB/sec)
[INFO] Downloading: http://repository.mygrid.org.uk/artifactory/repo/com/google/code/findbugs/jsr305/2.0.1/jsr305-2.0.1.pom
[INFO] Downloaded: http://repository.mygrid.org.uk/artifactory/repo/com/google/code/findbugs/jsr305/2.0.1/jsr305-2.0.1.pom (965 B at 17.1 KB/sec)
[INFO] Downloading: http://repository.mygrid.org.uk/artifactory/repo/org/apache/maven/shared/maven-shared-incremental/1.1/maven-shared-incremental-1.1.pom
[INFO] Downloaded: http://repository.mygrid.org.uk/artifactory/repo/org/apache/maven/shared/maven-shared-incremental/1.1/maven-shared-incremental-1.1.pom (5 KB at 115.8 KB/sec)
[INFO] Downloading: http://repository.mygrid.org.uk/artifactory/repo/org/apache/maven/shared/maven-shared-components/19/maven-shared-components-19.pom
[INFO] Downloaded: http://repository.mygrid.org.uk/artifactory/repo/org/apache/maven/shared/maven-shared-components/19/maven-shared-components-19.pom (7 KB at 85.1 KB/sec)
[INFO] Downloading: http://repository.mygrid.org.uk/artifactory/repo/org/apache/maven/maven-plugin-api/2.2.1/maven-plugin-api-2.2.1.pom
[INFO] Downloaded: http://repository.mygrid.org.uk/artifactory/repo/org/apache/maven/maven-plugin-api/2.2.1/maven-plugin-api-2.2.1.pom (2 KB at 28.5 KB/sec)
[INFO] Downloading: http://repository.mygrid.org.uk/artifactory/repo/org/apache/maven/maven/2.2.1/maven-2.2.1.pom
[INFO] Downloaded: http://repository.mygrid.org.uk/artifactory/repo/org/apache/maven/maven/2.2.1/maven-2.2.1.pom (22 KB at 312.6 KB/sec)
[INFO] Downloading: http://repository.mygrid.org.uk/artifactory/repo/org/apache/maven/maven-parent/11/maven-parent-11.pom
[INFO] Downloaded: http://repository.mygrid.org.uk/artifactory/repo/org/apache/maven/maven-parent/11/maven-parent-11.pom (32 KB at 518.8 KB/sec)
[INFO] Downloading: http://repository.mygrid.org.uk/artifactory/repo/org/apache/apache/5/apache-5.pom
[INFO] Downloaded: http://repository.mygrid.org.uk/artifactory/repo/org/apache/apache/5/apache-5.pom (5 KB at 63.5 KB/sec)
[INFO] Downloading: http://repository.mygrid.org.uk/artifactory/repo/org/apache/maven/maven-core/2.2.1/maven-core-2.2.1.pom
[INFO] Downloaded: http://repository.mygrid.org.uk/artifactory/repo/org/apache/maven/maven-core/2.2.1/maven-core-2.2.1.pom (12 KB at 199.3 KB/sec)
[INFO] Downloading: http://repository.mygrid.org.uk/artifactory/repo/org/apache/maven/maven-settings/2.2.1/maven-settings-2.2.1.pom
[INFO] Downloaded: http://repository.mygrid.org.uk/artifactory/repo/org/apache/maven/maven-settings/2.2.1/maven-settings-2.2.1.pom (3 KB at 36.1 KB/sec)
[INFO] Downloading: http://repository.mygrid.org.uk/artifactory/repo/org/apache/maven/maven-model/2.2.1/maven-model-2.2.1.pom
[INFO] Downloaded: http://repository.mygrid.org.uk/artifactory/repo/org/apache/maven/maven-model/2.2.1/maven-model-2.2.1.pom (4 KB at 41.1 KB/sec)
[INFO] Downloading: http://repository.mygrid.org.uk/artifactory/repo/org/codehaus/plexus/plexus-interpolation/1.11/plexus-interpolation-1.11.pom
[INFO] Downloaded: http://repository.mygrid.org.uk/artifactory/repo/org/codehaus/plexus/plexus-interpolation/1.11/plexus-interpolation-1.11.pom (889 B at 9.6 KB/sec)
[INFO] Downloading: http://repository.mygrid.org.uk/artifactory/repo/org/apache/maven/maven-plugin-parameter-documenter/2.2.1/maven-plugin-parameter-documenter-2.2.1.pom
[INFO] Downloaded: http://repository.mygrid.org.uk/artifactory/repo/org/apache/maven/maven-plugin-parameter-documenter/2.2.1/maven-plugin-parameter-documenter-2.2.1.pom (2 KB at 36.1 KB/sec)
[INFO] Downloading: http://repository.mygrid.org.uk/artifactory/repo/org/slf4j/slf4j-jdk14/1.5.6/slf4j-jdk14-1.5.6.pom
[INFO] Downloaded: http://repository.mygrid.org.uk/artifactory/repo/org/slf4j/slf4j-jdk14/1.5.6/slf4j-jdk14-1.5.6.pom (2 KB at 26.1 KB/sec)
[INFO] Downloading: http://repository.mygrid.org.uk/artifactory/repo/org/slf4j/slf4j-parent/1.5.6/slf4j-parent-1.5.6.pom
[INFO] Downloaded: http://repository.mygrid.org.uk/artifactory/repo/org/slf4j/slf4j-parent/1.5.6/slf4j-parent-1.5.6.pom (8 KB at 103.1 KB/sec)
[INFO] Downloading: http://repository.mygrid.org.uk/artifactory/repo/org/slf4j/slf4j-api/1.5.6/slf4j-api-1.5.6.pom
[INFO] Downloaded: http://repository.mygrid.org.uk/artifactory/repo/org/slf4j/slf4j-api/1.5.6/slf4j-api-1.5.6.pom (3 KB at 94.0 KB/sec)
[INFO] Downloading: http://repository.mygrid.org.uk/artifactory/repo/org/slf4j/jcl-over-slf4j/1.5.6/jcl-over-slf4j-1.5.6.pom
[INFO] Downloaded: http://repository.mygrid.org.uk/artifactory/repo/org/slf4j/jcl-over-slf4j/1.5.6/jcl-over-slf4j-1.5.6.pom (3 KB at 9.5 KB/sec)
[INFO] Downloading: http://repository.mygrid.org.uk/artifactory/repo/org/apache/maven/maven-profile/2.2.1/maven-profile-2.2.1.pom
[INFO] Downloaded: http://repository.mygrid.org.uk/artifactory/repo/org/apache/maven/maven-profile/2.2.1/maven-profile-2.2.1.pom (3 KB at 7.1 KB/sec)
[INFO] Downloading: http://repository.mygrid.org.uk/artifactory/repo/org/apache/maven/maven-artifact/2.2.1/maven-artifact-2.2.1.pom
[INFO] Downloaded: http://repository.mygrid.org.uk/artifactory/repo/org/apache/maven/maven-artifact/2.2.1/maven-artifact-2.2.1.pom (2 KB at 51.5 KB/sec)
[INFO] Downloading: http://repository.mygrid.org.uk/artifactory/repo/org/apache/maven/maven-repository-metadata/2.2.1/maven-repository-metadata-2.2.1.pom
[INFO] Downloaded: http://repository.mygrid.org.uk/artifactory/repo/org/apache/maven/maven-repository-metadata/2.2.1/maven-repository-metadata-2.2.1.pom (2 KB at 31.5 KB/sec)
[INFO] Downloading: http://repository.mygrid.org.uk/artifactory/repo/org/apache/maven/maven-error-diagnostics/2.2.1/maven-error-diagnostics-2.2.1.pom
[INFO] Downloaded: http://repository.mygrid.org.uk/artifactory/repo/org/apache/maven/maven-error-diagnostics/2.2.1/maven-error-diagnostics-2.2.1.pom (2 KB at 37.9 KB/sec)
[INFO] Downloading: http://repository.mygrid.org.uk/artifactory/repo/org/apache/maven/maven-project/2.2.1/maven-project-2.2.1.pom
[INFO] Downloaded: http://repository.mygrid.org.uk/artifactory/repo/org/apache/maven/maven-project/2.2.1/maven-project-2.2.1.pom (3 KB at 63.0 KB/sec)
[INFO] Downloading: http://repository.mygrid.org.uk/artifactory/repo/org/apache/maven/maven-artifact-manager/2.2.1/maven-artifact-manager-2.2.1.pom
[INFO] Downloaded: http://repository.mygrid.org.uk/artifactory/repo/org/apache/maven/maven-artifact-manager/2.2.1/maven-artifact-manager-2.2.1.pom (4 KB at 68.9 KB/sec)
[INFO] Downloading: http://repository.mygrid.org.uk/artifactory/repo/backport-util-concurrent/backport-util-concurrent/3.1/backport-util-concurrent-3.1.pom
[INFO] Downloaded: http://repository.mygrid.org.uk/artifactory/repo/backport-util-concurrent/backport-util-concurrent/3.1/backport-util-concurrent-3.1.pom (880 B at 22.0 KB/sec)
[INFO] Downloading: http://repository.mygrid.org.uk/artifactory/repo/org/apache/maven/maven-plugin-registry/2.2.1/maven-plugin-registry-2.2.1.pom
[INFO] Downloaded: http://repository.mygrid.org.uk/artifactory/repo/org/apache/maven/maven-plugin-registry/2.2.1/maven-plugin-registry-2.2.1.pom (2 KB at 30.9 KB/sec)
[INFO] Downloading: http://repository.mygrid.org.uk/artifactory/repo/org/apache/maven/maven-plugin-descriptor/2.2.1/maven-plugin-descriptor-2.2.1.pom
[INFO] Downloaded: http://repository.mygrid.org.uk/artifactory/repo/org/apache/maven/maven-plugin-descriptor/2.2.1/maven-plugin-descriptor-2.2.1.pom (3 KB at 32.5 KB/sec)
[INFO] Downloading: http://repository.mygrid.org.uk/artifactory/repo/org/apache/maven/maven-monitor/2.2.1/maven-monitor-2.2.1.pom
[INFO] Downloaded: http://repository.mygrid.org.uk/artifactory/repo/org/apache/maven/maven-monitor/2.2.1/maven-monitor-2.2.1.pom (2 KB at 23.2 KB/sec)
[INFO] Downloading: http://repository.mygrid.org.uk/artifactory/repo/org/sonatype/plexus/plexus-sec-dispatcher/1.3/plexus-sec-dispatcher-1.3.pom
[INFO] Downloaded: http://repository.mygrid.org.uk/artifactory/repo/org/sonatype/plexus/plexus-sec-dispatcher/1.3/plexus-sec-dispatcher-1.3.pom (3 KB at 46.6 KB/sec)
[INFO] Downloading: http://repository.mygrid.org.uk/artifactory/repo/org/sonatype/spice/spice-parent/12/spice-parent-12.pom
[INFO] Downloaded: http://repository.mygrid.org.uk/artifactory/repo/org/sonatype/spice/spice-parent/12/spice-parent-12.pom (7 KB at 107.1 KB/sec)
[INFO] Downloading: http://repository.mygrid.org.uk/artifactory/repo/org/sonatype/forge/forge-parent/4/forge-parent-4.pom
[INFO] Downloaded: http://repository.mygrid.org.uk/artifactory/repo/org/sonatype/forge/forge-parent/4/forge-parent-4.pom (9 KB at 118.8 KB/sec)
[INFO] Downloading: http://repository.mygrid.org.uk/artifactory/repo/org/codehaus/plexus/plexus-utils/1.5.5/plexus-utils-1.5.5.pom
[INFO] Downloaded: http://repository.mygrid.org.uk/artifactory/repo/org/codehaus/plexus/plexus-utils/1.5.5/plexus-utils-1.5.5.pom (6 KB at 116.9 KB/sec)
[INFO] Downloading: http://repository.mygrid.org.uk/artifactory/repo/org/sonatype/plexus/plexus-cipher/1.4/plexus-cipher-1.4.pom
[INFO] Downloaded: http://repository.mygrid.org.uk/artifactory/repo/org/sonatype/plexus/plexus-cipher/1.4/plexus-cipher-1.4.pom (3 KB at 29.2 KB/sec)
[INFO] Downloading: http://repository.mygrid.org.uk/artifactory/repo/org/codehaus/plexus/plexus-component-annotations/1.5.5/plexus-component-annotations-1.5.5.pom
[INFO] Downloaded: http://repository.mygrid.org.uk/artifactory/repo/org/codehaus/plexus/plexus-component-annotations/1.5.5/plexus-component-annotations-1.5.5.pom (815 B at 13.0 KB/sec)
[INFO] Downloading: http://repository.mygrid.org.uk/artifactory/repo/org/codehaus/plexus/plexus-containers/1.5.5/plexus-containers-1.5.5.pom
[INFO] Downloaded: http://repository.mygrid.org.uk/artifactory/repo/org/codehaus/plexus/plexus-containers/1.5.5/plexus-containers-1.5.5.pom (5 KB at 121.8 KB/sec)
[INFO] Downloading: http://repository.mygrid.org.uk/artifactory/repo/org/codehaus/plexus/plexus/2.0.7/plexus-2.0.7.pom
[INFO] Downloaded: http://repository.mygrid.org.uk/artifactory/repo/org/codehaus/plexus/plexus/2.0.7/plexus-2.0.7.pom (17 KB at 198.7 KB/sec)
[INFO] Downloading: http://repository.mygrid.org.uk/artifactory/repo/org/codehaus/plexus/plexus-compiler-api/2.2/plexus-compiler-api-2.2.pom
[INFO] Downloaded: http://repository.mygrid.org.uk/artifactory/repo/org/codehaus/plexus/plexus-compiler-api/2.2/plexus-compiler-api-2.2.pom (865 B at 14.3 KB/sec)
[INFO] Downloading: http://repository.mygrid.org.uk/artifactory/repo/org/codehaus/plexus/plexus-compiler/2.2/plexus-compiler-2.2.pom
[INFO] Downloaded: http://repository.mygrid.org.uk/artifactory/repo/org/codehaus/plexus/plexus-compiler/2.2/plexus-compiler-2.2.pom (4 KB at 26.7 KB/sec)
[INFO] Downloading: http://repository.mygrid.org.uk/artifactory/repo/org/codehaus/plexus/plexus-components/1.3.1/plexus-components-1.3.1.pom
[INFO] Downloaded: http://repository.mygrid.org.uk/artifactory/repo/org/codehaus/plexus/plexus-components/1.3.1/plexus-components-1.3.1.pom (3 KB at 21.7 KB/sec)
[INFO] Downloading: http://repository.mygrid.org.uk/artifactory/repo/org/codehaus/plexus/plexus/3.3.1/plexus-3.3.1.pom
[INFO] Downloaded: http://repository.mygrid.org.uk/artifactory/repo/org/codehaus/plexus/plexus/3.3.1/plexus-3.3.1.pom (20 KB at 302.5 KB/sec)
[INFO] Downloading: http://repository.mygrid.org.uk/artifactory/repo/org/codehaus/plexus/plexus-compiler-manager/2.2/plexus-compiler-manager-2.2.pom
[INFO] Downloaded: http://repository.mygrid.org.uk/artifactory/repo/org/codehaus/plexus/plexus-compiler-manager/2.2/plexus-compiler-manager-2.2.pom (690 B at 24.1 KB/sec)
[INFO] Downloading: http://repository.mygrid.org.uk/artifactory/repo/org/codehaus/plexus/plexus-compiler-javac/2.2/plexus-compiler-javac-2.2.pom
[INFO] Downloaded: http://repository.mygrid.org.uk/artifactory/repo/org/codehaus/plexus/plexus-compiler-javac/2.2/plexus-compiler-javac-2.2.pom (769 B at 24.2 KB/sec)
[INFO] Downloading: http://repository.mygrid.org.uk/artifactory/repo/org/codehaus/plexus/plexus-compilers/2.2/plexus-compilers-2.2.pom
[INFO] Downloaded: http://repository.mygrid.org.uk/artifactory/repo/org/codehaus/plexus/plexus-compilers/2.2/plexus-compilers-2.2.pom (2 KB at 39.1 KB/sec)
[INFO] Downloading: http://repository.mygrid.org.uk/artifactory/repo/org/codehaus/plexus/plexus-container-default/1.5.5/plexus-container-default-1.5.5.pom
[INFO] Downloaded: http://repository.mygrid.org.uk/artifactory/repo/org/codehaus/plexus/plexus-container-default/1.5.5/plexus-container-default-1.5.5.pom (3 KB at 74.7 KB/sec)
[INFO] Downloading: http://repository.mygrid.org.uk/artifactory/repo/org/codehaus/plexus/plexus-utils/1.4.5/plexus-utils-1.4.5.pom
[INFO] Downloaded: http://repository.mygrid.org.uk/artifactory/repo/org/codehaus/plexus/plexus-utils/1.4.5/plexus-utils-1.4.5.pom (3 KB at 79.0 KB/sec)
[INFO] Downloading: http://repository.mygrid.org.uk/artifactory/repo/org/codehaus/plexus/plexus-classworlds/2.2.2/plexus-classworlds-2.2.2.pom
[INFO] Downloaded: http://repository.mygrid.org.uk/artifactory/repo/org/codehaus/plexus/plexus-classworlds/2.2.2/plexus-classworlds-2.2.2.pom (4 KB at 140.7 KB/sec)
[INFO] Downloading: http://repository.mygrid.org.uk/artifactory/repo/org/apache/xbean/xbean-reflect/3.4/xbean-reflect-3.4.pom
[INFO] Downloaded: http://repository.mygrid.org.uk/artifactory/repo/org/apache/xbean/xbean-reflect/3.4/xbean-reflect-3.4.pom (3 KB at 85.7 KB/sec)
[INFO] Downloading: http://repository.mygrid.org.uk/artifactory/repo/org/apache/xbean/xbean/3.4/xbean-3.4.pom
[INFO] Downloaded: http://repository.mygrid.org.uk/artifactory/repo/org/apache/xbean/xbean/3.4/xbean-3.4.pom (19 KB at 532.3 KB/sec)
[INFO] Downloading: http://repository.mygrid.org.uk/artifactory/repo/log4j/log4j/1.2.12/log4j-1.2.12.pom
[INFO] Downloaded: http://repository.mygrid.org.uk/artifactory/repo/log4j/log4j/1.2.12/log4j-1.2.12.pom (145 B at 5.2 KB/sec)
[INFO] Downloading: http://repository.mygrid.org.uk/artifactory/repo/commons-logging/commons-logging-api/1.1/commons-logging-api-1.1.pom
[INFO] Downloaded: http://repository.mygrid.org.uk/artifactory/repo/commons-logging/commons-logging-api/1.1/commons-logging-api-1.1.pom (6 KB at 168.4 KB/sec)
[INFO] Downloading: http://repository.mygrid.org.uk/artifactory/repo/com/google/collections/google-collections/1.0/google-collections-1.0.pom
[INFO] Downloaded: http://repository.mygrid.org.uk/artifactory/repo/com/google/collections/google-collections/1.0/google-collections-1.0.pom (3 KB at 67.2 KB/sec)
[INFO] Downloading: http://repository.mygrid.org.uk/artifactory/repo/com/google/google/1/google-1.pom
[INFO] Downloaded: http://repository.mygrid.org.uk/artifactory/repo/com/google/google/1/google-1.pom (2 KB at 56.2 KB/sec)
[INFO] Downloading: http://repository.mygrid.org.uk/artifactory/repo/junit/junit/3.8.2/junit-3.8.2.pom
[INFO] Downloaded: http://repository.mygrid.org.uk/artifactory/repo/junit/junit/3.8.2/junit-3.8.2.pom (747 B at 25.2 KB/sec)
[INFO] Downloading: http://repository.mygrid.org.uk/artifactory/repo/org/codehaus/plexus/plexus-utils/1.5.1/plexus-utils-1.5.1.jar
[INFO] Downloading: http://repository.mygrid.org.uk/artifactory/repo/org/apache/maven/shared/maven-shared-utils/0.1/maven-shared-utils-0.1.jar
[INFO] Downloading: http://repository.mygrid.org.uk/artifactory/repo/org/apache/maven/shared/maven-shared-incremental/1.1/maven-shared-incremental-1.1.jar
[INFO] Downloading: http://repository.mygrid.org.uk/artifactory/repo/com/google/code/findbugs/jsr305/2.0.1/jsr305-2.0.1.jar
[INFO] Downloading: http://repository.mygrid.org.uk/artifactory/repo/org/codehaus/plexus/plexus-component-annotations/1.5.5/plexus-component-annotations-1.5.5.jar
[INFO] Downloaded: http://repository.mygrid.org.uk/artifactory/repo/org/apache/maven/shared/maven-shared-incremental/1.1/maven-shared-incremental-1.1.jar (14 KB at 136.3 KB/sec)
[INFO] Downloaded: http://repository.mygrid.org.uk/artifactory/repo/org/codehaus/plexus/plexus-component-annotations/1.5.5/plexus-component-annotations-1.5.5.jar (5 KB at 45.7 KB/sec)
[INFO] Downloading: http://repository.mygrid.org.uk/artifactory/repo/org/codehaus/plexus/plexus-compiler-api/2.2/plexus-compiler-api-2.2.jar
[INFO] Downloading: http://repository.mygrid.org.uk/artifactory/repo/org/codehaus/plexus/plexus-compiler-manager/2.2/plexus-compiler-manager-2.2.jar
[INFO] Downloaded: http://repository.mygrid.org.uk/artifactory/repo/com/google/code/findbugs/jsr305/2.0.1/jsr305-2.0.1.jar (32 KB at 227.1 KB/sec)
[INFO] Downloading: http://repository.mygrid.org.uk/artifactory/repo/org/codehaus/plexus/plexus-compiler-javac/2.2/plexus-compiler-javac-2.2.jar
[INFO] Downloaded: http://repository.mygrid.org.uk/artifactory/repo/org/codehaus/plexus/plexus-compiler-manager/2.2/plexus-compiler-manager-2.2.jar (5 KB at 59.4 KB/sec)
[INFO] Downloaded: http://repository.mygrid.org.uk/artifactory/repo/org/apache/maven/shared/maven-shared-utils/0.1/maven-shared-utils-0.1.jar (151 KB at 732.5 KB/sec)
[INFO] Downloaded: http://repository.mygrid.org.uk/artifactory/repo/org/codehaus/plexus/plexus-compiler-api/2.2/plexus-compiler-api-2.2.jar (25 KB at 262.4 KB/sec)
[INFO] Downloaded: http://repository.mygrid.org.uk/artifactory/repo/org/codehaus/plexus/plexus-compiler-javac/2.2/plexus-compiler-javac-2.2.jar (19 KB at 356.3 KB/sec)
[INFO] Downloading: http://repository.mygrid.org.uk/artifactory/repo/org/apache/xbean/xbean-reflect/3.4/xbean-reflect-3.4.jar
[INFO] Downloading: http://repository.mygrid.org.uk/artifactory/repo/log4j/log4j/1.2.12/log4j-1.2.12.jar
[INFO] Downloading: http://repository.mygrid.org.uk/artifactory/repo/commons-logging/commons-logging-api/1.1/commons-logging-api-1.1.jar
[INFO] Downloading: http://repository.mygrid.org.uk/artifactory/repo/com/google/collections/google-collections/1.0/google-collections-1.0.jar
[INFO] Downloaded: http://repository.mygrid.org.uk/artifactory/repo/org/codehaus/plexus/plexus-utils/1.5.1/plexus-utils-1.5.1.jar (206 KB at 773.5 KB/sec)
[INFO] Downloading: http://repository.mygrid.org.uk/artifactory/repo/junit/junit/3.8.2/junit-3.8.2.jar
[INFO] Downloaded: http://repository.mygrid.org.uk/artifactory/repo/com/google/collections/google-collections/1.0/google-collections-1.0.jar (625 KB at 3831.9 KB/sec)
[INFO] Downloaded: http://repository.mygrid.org.uk/artifactory/repo/commons-logging/commons-logging-api/1.1/commons-logging-api-1.1.jar (44 KB at 248.9 KB/sec)
[INFO] Downloaded: http://repository.mygrid.org.uk/artifactory/repo/org/apache/xbean/xbean-reflect/3.4/xbean-reflect-3.4.jar (131 KB at 616.5 KB/sec)
[INFO] Downloaded: http://repository.mygrid.org.uk/artifactory/repo/junit/junit/3.8.2/junit-3.8.2.jar (118 KB at 647.3 KB/sec)
[INFO] Downloaded: http://repository.mygrid.org.uk/artifactory/repo/log4j/log4j/1.2.12/log4j-1.2.12.jar (350 KB at 1173.5 KB/sec)
[INFO] Changes detected - recompiling the module!
[INFO] Compiling 10 source files to /var/lib/jenkins/workspace/taverna-engine-credential-manager-maintenance/credential-manager/target/classes
[INFO] 
[INFO] --- maven-resources-plugin:2.6:testResources (default-testResources) @ credential-manager ---
[INFO] Using 'UTF-8' encoding to copy filtered resources.
[INFO] Copying 3 resources
[INFO] 
[INFO] --- maven-compiler-plugin:3.1:testCompile (default-testCompile) @ credential-manager ---
[INFO] Changes detected - recompiling the module!
[INFO] Compiling 4 source files to /var/lib/jenkins/workspace/taverna-engine-credential-manager-maintenance/credential-manager/target/test-classes
[INFO] 
[INFO] --- maven-surefire-plugin:2.17:test (default-test) @ credential-manager ---
[INFO] Downloading: http://repository.mygrid.org.uk/artifactory/repo/org/apache/maven/surefire/maven-surefire-common/2.17/maven-surefire-common-2.17.pom
[INFO] Downloaded: http://repository.mygrid.org.uk/artifactory/repo/org/apache/maven/surefire/maven-surefire-common/2.17/maven-surefire-common-2.17.pom (6 KB at 126.7 KB/sec)
[INFO] Downloading: http://repository.mygrid.org.uk/artifactory/repo/org/apache/maven/plugin-tools/maven-plugin-annotations/3.2/maven-plugin-annotations-3.2.pom
[INFO] Downloaded: http://repository.mygrid.org.uk/artifactory/repo/org/apache/maven/plugin-tools/maven-plugin-annotations/3.2/maven-plugin-annotations-3.2.pom (2 KB at 41.7 KB/sec)
[INFO] Downloading: http://repository.mygrid.org.uk/artifactory/repo/org/apache/maven/plugin-tools/maven-plugin-tools/3.2/maven-plugin-tools-3.2.pom
[INFO] Downloaded: http://repository.mygrid.org.uk/artifactory/repo/org/apache/maven/plugin-tools/maven-plugin-tools/3.2/maven-plugin-tools-3.2.pom (17 KB at 264.6 KB/sec)
[INFO] Downloading: http://repository.mygrid.org.uk/artifactory/repo/org/apache/maven/surefire/surefire-api/2.17/surefire-api-2.17.pom
[INFO] Downloaded: http://repository.mygrid.org.uk/artifactory/repo/org/apache/maven/surefire/surefire-api/2.17/surefire-api-2.17.pom (3 KB at 44.7 KB/sec)
[INFO] Downloading: http://repository.mygrid.org.uk/artifactory/repo/org/apache/maven/surefire/surefire-booter/2.17/surefire-booter-2.17.pom
[INFO] Downloaded: http://repository.mygrid.org.uk/artifactory/repo/org/apache/maven/surefire/surefire-booter/2.17/surefire-booter-2.17.pom (3 KB at 61.4 KB/sec)
[INFO] Downloading: http://repository.mygrid.org.uk/artifactory/repo/org/apache/maven/reporting/maven-reporting-api/2.0.9/maven-reporting-api-2.0.9.pom
[INFO] Downloaded: http://repository.mygrid.org.uk/artifactory/repo/org/apache/maven/reporting/maven-reporting-api/2.0.9/maven-reporting-api-2.0.9.pom (2 KB at 41.9 KB/sec)
[INFO] Downloading: http://repository.mygrid.org.uk/artifactory/repo/org/apache/maven/reporting/maven-reporting/2.0.9/maven-reporting-2.0.9.pom
[INFO] Downloaded: http://repository.mygrid.org.uk/artifactory/repo/org/apache/maven/reporting/maven-reporting/2.0.9/maven-reporting-2.0.9.pom (2 KB at 40.0 KB/sec)
[INFO] Downloading: http://repository.mygrid.org.uk/artifactory/repo/org/apache/maven/maven-toolchain/2.0.9/maven-toolchain-2.0.9.pom
[INFO] Downloaded: http://repository.mygrid.org.uk/artifactory/repo/org/apache/maven/maven-toolchain/2.0.9/maven-toolchain-2.0.9.pom (4 KB at 72.2 KB/sec)
[INFO] Downloading: http://repository.mygrid.org.uk/artifactory/repo/org/apache/commons/commons-lang3/3.1/commons-lang3-3.1.pom
[INFO] Downloaded: http://repository.mygrid.org.uk/artifactory/repo/org/apache/commons/commons-lang3/3.1/commons-lang3-3.1.pom (17 KB at 291.4 KB/sec)
[INFO] Downloading: http://repository.mygrid.org.uk/artifactory/repo/org/apache/commons/commons-parent/22/commons-parent-22.pom
[INFO] Downloaded: http://repository.mygrid.org.uk/artifactory/repo/org/apache/commons/commons-parent/22/commons-parent-22.pom (41 KB at 731.0 KB/sec)
[INFO] Downloading: http://repository.mygrid.org.uk/artifactory/repo/org/apache/apache/9/apache-9.pom
[INFO] Downloaded: http://repository.mygrid.org.uk/artifactory/repo/org/apache/apache/9/apache-9.pom (15 KB at 146.6 KB/sec)
[INFO] Downloading: http://repository.mygrid.org.uk/artifactory/repo/org/apache/maven/surefire/maven-surefire-common/2.17/maven-surefire-common-2.17.jar
[INFO] Downloading: http://repository.mygrid.org.uk/artifactory/repo/org/apache/maven/surefire/surefire-booter/2.17/surefire-booter-2.17.jar
[INFO] Downloading: http://repository.mygrid.org.uk/artifactory/repo/org/apache/maven/reporting/maven-reporting-api/2.0.9/maven-reporting-api-2.0.9.jar
[INFO] Downloading: http://repository.mygrid.org.uk/artifactory/repo/org/apache/commons/commons-lang3/3.1/commons-lang3-3.1.jar
[INFO] Downloading: http://repository.mygrid.org.uk/artifactory/repo/org/apache/maven/surefire/surefire-api/2.17/surefire-api-2.17.jar
[INFO] Downloaded: http://repository.mygrid.org.uk/artifactory/repo/org/apache/maven/reporting/maven-reporting-api/2.0.9/maven-reporting-api-2.0.9.jar (10 KB at 99.0 KB/sec)
[INFO] Downloading: http://repository.mygrid.org.uk/artifactory/repo/org/apache/maven/plugin-tools/maven-plugin-annotations/3.2/maven-plugin-annotations-3.2.jar
[INFO] Downloaded: http://repository.mygrid.org.uk/artifactory/repo/org/apache/maven/surefire/surefire-booter/2.17/surefire-booter-2.17.jar (39 KB at 357.9 KB/sec)
[INFO] Downloaded: http://repository.mygrid.org.uk/artifactory/repo/org/apache/maven/surefire/maven-surefire-common/2.17/maven-surefire-common-2.17.jar (260 KB at 1978.4 KB/sec)
[INFO] Downloaded: http://repository.mygrid.org.uk/artifactory/repo/org/apache/maven/plugin-tools/maven-plugin-annotations/3.2/maven-plugin-annotations-3.2.jar (15 KB at 350.6 KB/sec)
[INFO] Downloaded: http://repository.mygrid.org.uk/artifactory/repo/org/apache/maven/surefire/surefire-api/2.17/surefire-api-2.17.jar (144 KB at 1020.3 KB/sec)
[INFO] Downloaded: http://repository.mygrid.org.uk/artifactory/repo/org/apache/commons/commons-lang3/3.1/commons-lang3-3.1.jar (309 KB at 1989.7 KB/sec)
[INFO] Surefire report directory: /var/lib/jenkins/workspace/taverna-engine-credential-manager-maintenance/credential-manager/target/surefire-reports
[INFO] Downloading: http://repository.mygrid.org.uk/artifactory/repo/org/apache/maven/surefire/surefire-junit4/2.17/surefire-junit4-2.17.pom
[INFO] Downloaded: http://repository.mygrid.org.uk/artifactory/repo/org/apache/maven/surefire/surefire-junit4/2.17/surefire-junit4-2.17.pom (3 KB at 13.7 KB/sec)
[INFO] Downloading: http://repository.mygrid.org.uk/artifactory/repo/org/apache/maven/surefire/surefire-providers/2.17/surefire-providers-2.17.pom
[INFO] Downloaded: http://repository.mygrid.org.uk/artifactory/repo/org/apache/maven/surefire/surefire-providers/2.17/surefire-providers-2.17.pom (3 KB at 80.1 KB/sec)
[INFO] Downloading: http://repository.mygrid.org.uk/artifactory/repo/org/apache/maven/surefire/surefire-junit4/2.17/surefire-junit4-2.17.jar
[INFO] Downloaded: http://repository.mygrid.org.uk/artifactory/repo/org/apache/maven/surefire/surefire-junit4/2.17/surefire-junit4-2.17.jar (63 KB at 1610.5 KB/sec)

-------------------------------------------------------
 T E S T S
-------------------------------------------------------
Running net.sf.taverna.t2.security.credentialmanager.PossibleLookupsTest
log4j:WARN No appenders could be found for logger (net.sf.taverna.raven.log.Log).
log4j:WARN Please initialize the log4j system properly.
log4j:WARN See http://logging.apache.org/log4j/1.2/faq.html#noconfig for more info.
Tests run: 8, Failures: 0, Errors: 0, Skipped: 0, Time elapsed: 0.536 sec - in net.sf.taverna.t2.security.credentialmanager.PossibleLookupsTest
Running net.sf.taverna.t2.security.credentialmanager.BasicAuthTest
ApplicationConfig could not determine application name, using unknownApplication-9ed849da-80f0-4908-9faa-472b422defce
ApplicationConfig could not determine application name, using unknownApplication-9ed849da-80f0-4908-9faa-472b422defce
2014-11-17 16:33:36.048:INFO::Logging to STDERR via org.mortbay.log.StdErrLog
2014-11-17 16:33:36.244:INFO::jetty-6.1.24
2014-11-17 16:33:36.488:INFO::NO JSP Support for /, did not find org.apache.jasper.servlet.JspServlet
2014-11-17 16:33:36.679:INFO::Started SelectChannelConnector@0.0.0.0:9638
2014-11-17 16:33:37.261:WARN::AUTH FAILURE: user basicUser
2014-11-17 16:33:37.283:WARN::AUTH FAILURE: user basicUser
2014-11-17 16:33:37.296:WARN::AUTH FAILURE: user basicUser
2014-11-17 16:33:37.300:WARN::AUTH FAILURE: user basicUser
2014-11-17 16:33:37.309:WARN::AUTH FAILURE: user basicUser
2014-11-17 16:33:37.315:WARN::AUTH FAILURE: user basicUser
2014-11-17 16:33:37.320:WARN::AUTH FAILURE: user basicUser
2014-11-17 16:33:37.330:WARN::AUTH FAILURE: user basicUser
2014-11-17 16:33:37.337:WARN::AUTH FAILURE: user basicUser
2014-11-17 16:33:37.343:WARN::AUTH FAILURE: user basicUser
2014-11-17 16:33:37.348:WARN::AUTH FAILURE: user basicUser
2014-11-17 16:33:37.354:WARN::AUTH FAILURE: user basicUser
2014-11-17 16:33:37.360:WARN::AUTH FAILURE: user basicUser
2014-11-17 16:33:37.366:WARN::AUTH FAILURE: user basicUser
2014-11-17 16:33:37.372:WARN::AUTH FAILURE: user basicUser
2014-11-17 16:33:37.378:WARN::AUTH FAILURE: user basicUser
2014-11-17 16:33:37.384:WARN::AUTH FAILURE: user basicUser
2014-11-17 16:33:37.388:WARN::AUTH FAILURE: user basicUser
2014-11-17 16:33:37.414:WARN::AUTH FAILURE: user basicUser
2014-11-17 16:33:37.564:WARN::AUTH FAILURE: user basicUser
2014-11-17 16:33:37.575:WARN::AUTH FAILURE: user basicUser
2014-11-17 16:33:37.589:WARN::AUTH FAILURE: user basicUser
2014-11-17 16:33:37.603:WARN::AUTH FAILURE: user basicUser
2014-11-17 16:33:37.615:WARN::AUTH FAILURE: user basicUser
2014-11-17 16:33:37.626:WARN::AUTH FAILURE: user basicUser
2014-11-17 16:33:37.634:WARN::AUTH FAILURE: user basicUser
2014-11-17 16:33:37.652:WARN::AUTH FAILURE: user basicUser
2014-11-17 16:33:37.669:WARN::AUTH FAILURE: user basicUser
2014-11-17 16:33:37.681:WARN::AUTH FAILURE: user basicUser
2014-11-17 16:33:37.689:WARN::AUTH FAILURE: user basicUser
2014-11-17 16:33:37.700:WARN::AUTH FAILURE: user basicUser
2014-11-17 16:33:37.710:WARN::AUTH FAILURE: user basicUser
2014-11-17 16:33:37.719:WARN::AUTH FAILURE: user basicUser
2014-11-17 16:33:37.732:WARN::AUTH FAILURE: user basicUser
2014-11-17 16:33:37.754:WARN::AUTH FAILURE: user basicUser
2014-11-17 16:33:37.766:WARN::AUTH FAILURE: user basicUser
2014-11-17 16:33:37.773:WARN::AUTH FAILURE: user basicUser
2014-11-17 16:33:37.788:WARN::AUTH FAILURE: user basicUser
2014-11-17 16:33:37.807:INFO::Stopped SelectChannelConnector@0.0.0.0:9638
Tests run: 6, Failures: 0, Errors: 0, Skipped: 0, Time elapsed: 4.86 sec - in net.sf.taverna.t2.security.credentialmanager.BasicAuthTest

Results :

Tests run: 14, Failures: 0, Errors: 0, Skipped: 0

[JENKINS] Recording test results
[INFO] 
[INFO] --- maven-jar-plugin:2.4:jar (default-jar) @ credential-manager ---
[INFO] Building jar: /var/lib/jenkins/workspace/taverna-engine-credential-manager-maintenance/credential-manager/target/credential-manager-1.6-SNAPSHOT.jar
[INFO] 
[INFO] >>> maven-source-plugin:2.2.1:jar (default) @ credential-manager >>>
[WARNING] Failed to getClass for org.apache.maven.plugin.source.SourceJarMojo
[INFO] 
[INFO] <<< maven-source-plugin:2.2.1:jar (default) @ credential-manager <<<
[INFO] 
[INFO] --- maven-source-plugin:2.2.1:jar (default) @ credential-manager ---
[INFO] Building jar: /var/lib/jenkins/workspace/taverna-engine-credential-manager-maintenance/credential-manager/target/credential-manager-1.6-SNAPSHOT-sources.jar
[INFO] 
[INFO] >>> maven-source-plugin:2.2.1:test-jar (default) @ credential-manager >>>
[WARNING] Failed to getClass for org.apache.maven.plugin.source.TestSourceJarMojo
[INFO] 
[INFO] <<< maven-source-plugin:2.2.1:test-jar (default) @ credential-manager <<<
[INFO] 
[INFO] --- maven-source-plugin:2.2.1:test-jar (default) @ credential-manager ---
[INFO] Building jar: /var/lib/jenkins/workspace/taverna-engine-credential-manager-maintenance/credential-manager/target/credential-manager-1.6-SNAPSHOT-test-sources.jar
[INFO] 
[INFO] --- maven-jar-plugin:2.4:test-jar (default) @ credential-manager ---
[INFO] Building jar: /var/lib/jenkins/workspace/taverna-engine-credential-manager-maintenance/credential-manager/target/credential-manager-1.6-SNAPSHOT-tests.jar
[INFO] 
[INFO] --- maven-install-plugin:2.4:install (default-install) @ credential-manager ---
[INFO] Installing /var/lib/jenkins/workspace/taverna-engine-credential-manager-maintenance/credential-manager/target/credential-manager-1.6-SNAPSHOT.jar to /var/lib/jenkins/workspace/taverna-engine-credential-manager-maintenance/.repository/net/sf/taverna/t2/security/credential-manager/1.6-SNAPSHOT/credential-manager-1.6-SNAPSHOT.jar
[INFO] Installing /var/lib/jenkins/workspace/taverna-engine-credential-manager-maintenance/credential-manager/pom.xml to /var/lib/jenkins/workspace/taverna-engine-credential-manager-maintenance/.repository/net/sf/taverna/t2/security/credential-manager/1.6-SNAPSHOT/credential-manager-1.6-SNAPSHOT.pom
[INFO] Installing /var/lib/jenkins/workspace/taverna-engine-credential-manager-maintenance/credential-manager/target/credential-manager-1.6-SNAPSHOT-sources.jar to /var/lib/jenkins/workspace/taverna-engine-credential-manager-maintenance/.repository/net/sf/taverna/t2/security/credential-manager/1.6-SNAPSHOT/credential-manager-1.6-SNAPSHOT-sources.jar
[INFO] Installing /var/lib/jenkins/workspace/taverna-engine-credential-manager-maintenance/credential-manager/target/credential-manager-1.6-SNAPSHOT-test-sources.jar to /var/lib/jenkins/workspace/taverna-engine-credential-manager-maintenance/.repository/net/sf/taverna/t2/security/credential-manager/1.6-SNAPSHOT/credential-manager-1.6-SNAPSHOT-test-sources.jar
[INFO] Installing /var/lib/jenkins/workspace/taverna-engine-credential-manager-maintenance/credential-manager/target/credential-manager-1.6-SNAPSHOT-tests.jar to /var/lib/jenkins/workspace/taverna-engine-credential-manager-maintenance/.repository/net/sf/taverna/t2/security/credential-manager/1.6-SNAPSHOT/credential-manager-1.6-SNAPSHOT-tests.jar