SuccessConsole Output

[INFO]                                                                         
[INFO] ------------------------------------------------------------------------
[INFO] Building Credential manager 1.6-SNAPSHOT
[INFO] ------------------------------------------------------------------------
[INFO] Downloading: http://repository.mygrid.org.uk/artifactory/repo/net/sf/taverna/t2/infrastructure/spi-discovery-api/2.6-SNAPSHOT/maven-metadata.xml
[INFO] Downloaded: http://repository.mygrid.org.uk/artifactory/repo/net/sf/taverna/t2/infrastructure/spi-discovery-api/2.6-SNAPSHOT/maven-metadata.xml (2 KB at 29.5 KB/sec)
[INFO] Downloading: http://repository.mygrid.org.uk/artifactory/repo/net/sf/taverna/t2/infrastructure/spi-discovery-api/2.6-SNAPSHOT/spi-discovery-api-2.6-20141103.170553-9.pom
[INFO] Downloaded: http://repository.mygrid.org.uk/artifactory/repo/net/sf/taverna/t2/infrastructure/spi-discovery-api/2.6-SNAPSHOT/spi-discovery-api-2.6-20141103.170553-9.pom (2 KB at 29.4 KB/sec)
[INFO] Downloading: http://repository.mygrid.org.uk/artifactory/repo/net/sf/taverna/t2/infrastructure/2.6-SNAPSHOT/maven-metadata.xml
[INFO] Downloaded: http://repository.mygrid.org.uk/artifactory/repo/net/sf/taverna/t2/infrastructure/2.6-SNAPSHOT/maven-metadata.xml (802 B at 19.6 KB/sec)
[INFO] Downloading: http://repository.mygrid.org.uk/artifactory/repo/net/sf/taverna/t2/infrastructure/2.6-SNAPSHOT/infrastructure-2.6-20141103.170553-9.pom
[INFO] Downloaded: http://repository.mygrid.org.uk/artifactory/repo/net/sf/taverna/t2/infrastructure/2.6-SNAPSHOT/infrastructure-2.6-20141103.170553-9.pom (4 KB at 74.5 KB/sec)
[INFO] Downloading: http://repository.mygrid.org.uk/artifactory/repo/net/sf/taverna/t2/lang/observer/1.6-SNAPSHOT/maven-metadata.xml
[INFO] Downloaded: http://repository.mygrid.org.uk/artifactory/repo/net/sf/taverna/t2/lang/observer/1.6-SNAPSHOT/maven-metadata.xml (2 KB at 41.5 KB/sec)
[INFO] Downloading: http://repository.mygrid.org.uk/artifactory/repo/net/sf/taverna/t2/lang/observer/1.6-SNAPSHOT/observer-1.6-20141103.170458-9.pom
[INFO] Downloaded: http://repository.mygrid.org.uk/artifactory/repo/net/sf/taverna/t2/lang/observer/1.6-SNAPSHOT/observer-1.6-20141103.170458-9.pom (833 B at 19.4 KB/sec)
[INFO] Downloading: http://repository.mygrid.org.uk/artifactory/repo/net/sf/taverna/t2/lang/1.6-SNAPSHOT/maven-metadata.xml
[INFO] Downloaded: http://repository.mygrid.org.uk/artifactory/repo/net/sf/taverna/t2/lang/1.6-SNAPSHOT/maven-metadata.xml (792 B at 16.5 KB/sec)
[INFO] Downloading: http://repository.mygrid.org.uk/artifactory/repo/net/sf/taverna/t2/lang/1.6-SNAPSHOT/lang-1.6-20141103.170458-9.pom
[INFO] Downloaded: http://repository.mygrid.org.uk/artifactory/repo/net/sf/taverna/t2/lang/1.6-SNAPSHOT/lang-1.6-20141103.170458-9.pom (3 KB at 26.6 KB/sec)
[INFO] Downloading: http://repository.mygrid.org.uk/artifactory/repo/net/sf/taverna/t2/infrastructure/raven/2.6-SNAPSHOT/maven-metadata.xml
[INFO] Downloaded: http://repository.mygrid.org.uk/artifactory/repo/net/sf/taverna/t2/infrastructure/raven/2.6-SNAPSHOT/maven-metadata.xml (2 KB at 27.5 KB/sec)
[INFO] Downloading: http://repository.mygrid.org.uk/artifactory/repo/net/sf/taverna/t2/infrastructure/raven/2.6-SNAPSHOT/raven-2.6-20141103.170553-9.pom
[INFO] Downloaded: http://repository.mygrid.org.uk/artifactory/repo/net/sf/taverna/t2/infrastructure/raven/2.6-SNAPSHOT/raven-2.6-20141103.170553-9.pom (2 KB at 17.2 KB/sec)
[INFO] Downloading: http://repository.mygrid.org.uk/artifactory/repo/net/sf/taverna/t2/infrastructure/raven-log4j/2.6-SNAPSHOT/maven-metadata.xml
[INFO] Downloaded: http://repository.mygrid.org.uk/artifactory/repo/net/sf/taverna/t2/infrastructure/raven-log4j/2.6-SNAPSHOT/maven-metadata.xml (2 KB at 28.5 KB/sec)
[INFO] Downloading: http://repository.mygrid.org.uk/artifactory/repo/net/sf/taverna/t2/infrastructure/raven-log4j/2.6-SNAPSHOT/raven-log4j-2.6-20141103.170553-9.pom
[INFO] Downloaded: http://repository.mygrid.org.uk/artifactory/repo/net/sf/taverna/t2/infrastructure/raven-log4j/2.6-SNAPSHOT/raven-log4j-2.6-20141103.170553-9.pom (952 B at 19.8 KB/sec)
[INFO] Downloading: http://repository.mygrid.org.uk/artifactory/repo/net/sf/taverna/t2/infrastructure/appconfig/2.6-SNAPSHOT/maven-metadata.xml
[INFO] Downloaded: http://repository.mygrid.org.uk/artifactory/repo/net/sf/taverna/t2/infrastructure/appconfig/2.6-SNAPSHOT/maven-metadata.xml (2 KB at 38.3 KB/sec)
[INFO] Downloading: http://repository.mygrid.org.uk/artifactory/repo/net/sf/taverna/t2/infrastructure/appconfig/2.6-SNAPSHOT/appconfig-2.6-20141103.170553-9.pom
[INFO] Downloaded: http://repository.mygrid.org.uk/artifactory/repo/net/sf/taverna/t2/infrastructure/appconfig/2.6-SNAPSHOT/appconfig-2.6-20141103.170553-9.pom (2 KB at 35.0 KB/sec)
[INFO] Downloading: http://repository.mygrid.org.uk/artifactory/repo/net/sf/taverna/t2/infrastructure/launcher-api/2.6-SNAPSHOT/maven-metadata.xml
[INFO] Downloaded: http://repository.mygrid.org.uk/artifactory/repo/net/sf/taverna/t2/infrastructure/launcher-api/2.6-SNAPSHOT/maven-metadata.xml (2 KB at 33.4 KB/sec)
[INFO] Downloading: http://repository.mygrid.org.uk/artifactory/repo/net/sf/taverna/t2/infrastructure/launcher-api/2.6-SNAPSHOT/launcher-api-2.6-20141103.170553-9.pom
[INFO] Downloaded: http://repository.mygrid.org.uk/artifactory/repo/net/sf/taverna/t2/infrastructure/launcher-api/2.6-SNAPSHOT/launcher-api-2.6-20141103.170553-9.pom (549 B at 12.2 KB/sec)
[INFO] Downloading: http://repository.mygrid.org.uk/artifactory/repo/net/sf/taverna/t2/infrastructure/prelauncher/2.6-SNAPSHOT/maven-metadata.xml
[INFO] Downloaded: http://repository.mygrid.org.uk/artifactory/repo/net/sf/taverna/t2/infrastructure/prelauncher/2.6-SNAPSHOT/maven-metadata.xml (2 KB at 39.5 KB/sec)
[INFO] Downloading: http://repository.mygrid.org.uk/artifactory/repo/net/sf/taverna/t2/infrastructure/prelauncher/2.6-SNAPSHOT/prelauncher-2.6-20141103.170553-9.pom
[INFO] Downloaded: http://repository.mygrid.org.uk/artifactory/repo/net/sf/taverna/t2/infrastructure/prelauncher/2.6-SNAPSHOT/prelauncher-2.6-20141103.170553-9.pom (2 KB at 30.2 KB/sec)
[INFO] Downloading: http://repository.mygrid.org.uk/artifactory/repo/net/sf/taverna/t2/infrastructure/spi-discovery-api/2.6-SNAPSHOT/spi-discovery-api-2.6-20141103.170553-9.jar
[INFO] Downloading: http://repository.mygrid.org.uk/artifactory/repo/net/sf/taverna/t2/lang/observer/1.6-SNAPSHOT/observer-1.6-20141103.170458-9.jar
[INFO] Downloading: http://repository.mygrid.org.uk/artifactory/repo/net/sf/taverna/t2/infrastructure/raven/2.6-SNAPSHOT/raven-2.6-20141103.170553-9.jar
[INFO] Downloading: http://repository.mygrid.org.uk/artifactory/repo/net/sf/taverna/t2/infrastructure/raven-log4j/2.6-SNAPSHOT/raven-log4j-2.6-20141103.170553-9.jar
[INFO] Downloading: http://repository.mygrid.org.uk/artifactory/repo/net/sf/taverna/t2/infrastructure/appconfig/2.6-SNAPSHOT/appconfig-2.6-20141103.170553-9.jar
[INFO] Downloaded: http://repository.mygrid.org.uk/artifactory/repo/net/sf/taverna/t2/infrastructure/spi-discovery-api/2.6-SNAPSHOT/spi-discovery-api-2.6-20141103.170553-9.jar (6 KB at 53.8 KB/sec)
[INFO] Downloading: http://repository.mygrid.org.uk/artifactory/repo/net/sf/taverna/t2/infrastructure/launcher-api/2.6-SNAPSHOT/launcher-api-2.6-20141103.170553-9.jar
[INFO] Downloaded: http://repository.mygrid.org.uk/artifactory/repo/net/sf/taverna/t2/infrastructure/appconfig/2.6-SNAPSHOT/appconfig-2.6-20141103.170553-9.jar (29 KB at 188.3 KB/sec)
[INFO] Downloading: http://repository.mygrid.org.uk/artifactory/repo/net/sf/taverna/t2/infrastructure/prelauncher/2.6-SNAPSHOT/prelauncher-2.6-20141103.170553-9.jar
[INFO] Downloaded: http://repository.mygrid.org.uk/artifactory/repo/net/sf/taverna/t2/infrastructure/raven-log4j/2.6-SNAPSHOT/raven-log4j-2.6-20141103.170553-9.jar (4 KB at 19.4 KB/sec)
[INFO] Downloaded: http://repository.mygrid.org.uk/artifactory/repo/net/sf/taverna/t2/lang/observer/1.6-SNAPSHOT/observer-1.6-20141103.170458-9.jar (5 KB at 23.5 KB/sec)
[INFO] Downloaded: http://repository.mygrid.org.uk/artifactory/repo/net/sf/taverna/t2/infrastructure/raven/2.6-SNAPSHOT/raven-2.6-20141103.170553-9.jar (85 KB at 437.8 KB/sec)
[INFO] Downloaded: http://repository.mygrid.org.uk/artifactory/repo/net/sf/taverna/t2/infrastructure/launcher-api/2.6-SNAPSHOT/launcher-api-2.6-20141103.170553-9.jar (3 KB at 20.2 KB/sec)
[INFO] Downloaded: http://repository.mygrid.org.uk/artifactory/repo/net/sf/taverna/t2/infrastructure/prelauncher/2.6-SNAPSHOT/prelauncher-2.6-20141103.170553-9.jar (9 KB at 78.3 KB/sec)
[INFO] 
[INFO] --- maven-clean-plugin:2.5:clean (default-clean) @ credential-manager ---
[INFO] Deleting /var/lib/jenkins/workspace/taverna-engine-credential-manager-maintenance/credential-manager/target
[INFO] 
[INFO] --- maven-resources-plugin:2.6:resources (default-resources) @ credential-manager ---
[INFO] Using 'UTF-8' encoding to copy filtered resources.
[INFO] Copying 7 resources
[INFO] 
[INFO] --- maven-compiler-plugin:3.1:compile (default-compile) @ credential-manager ---
[INFO] Changes detected - recompiling the module!
[INFO] Compiling 10 source files to /var/lib/jenkins/workspace/taverna-engine-credential-manager-maintenance/credential-manager/target/classes
[INFO] 
[INFO] --- maven-resources-plugin:2.6:testResources (default-testResources) @ credential-manager ---
[INFO] Using 'UTF-8' encoding to copy filtered resources.
[INFO] Copying 3 resources
[INFO] 
[INFO] --- maven-compiler-plugin:3.1:testCompile (default-testCompile) @ credential-manager ---
[INFO] Changes detected - recompiling the module!
[INFO] Compiling 4 source files to /var/lib/jenkins/workspace/taverna-engine-credential-manager-maintenance/credential-manager/target/test-classes
[INFO] 
[INFO] --- maven-surefire-plugin:2.17:test (default-test) @ credential-manager ---
[INFO] Surefire report directory: /var/lib/jenkins/workspace/taverna-engine-credential-manager-maintenance/credential-manager/target/surefire-reports

-------------------------------------------------------
 T E S T S
-------------------------------------------------------
Running net.sf.taverna.t2.security.credentialmanager.PossibleLookupsTest
log4j:WARN No appenders could be found for logger (net.sf.taverna.raven.log.Log).
log4j:WARN Please initialize the log4j system properly.
log4j:WARN See http://logging.apache.org/log4j/1.2/faq.html#noconfig for more info.
Tests run: 8, Failures: 0, Errors: 0, Skipped: 0, Time elapsed: 0.507 sec - in net.sf.taverna.t2.security.credentialmanager.PossibleLookupsTest
Running net.sf.taverna.t2.security.credentialmanager.BasicAuthTest
2014-11-03 17:08:19.173:INFO::Logging to STDERR via org.mortbay.log.StdErrLog
2014-11-03 17:08:19.276:INFO::jetty-6.1.24
2014-11-03 17:08:19.491:INFO::NO JSP Support for /, did not find org.apache.jasper.servlet.JspServlet
2014-11-03 17:08:19.597:INFO::Started SelectChannelConnector@0.0.0.0:9638
ApplicationConfig could not determine application name, using unknownApplication-07a8f280-77bf-4ff9-a8f9-42dea20ed2f2
ApplicationConfig could not determine application name, using unknownApplication-07a8f280-77bf-4ff9-a8f9-42dea20ed2f2
2014-11-03 17:08:21.326:WARN::AUTH FAILURE: user basicUser
2014-11-03 17:08:21.330:WARN::AUTH FAILURE: user basicUser
2014-11-03 17:08:21.334:WARN::AUTH FAILURE: user basicUser
2014-11-03 17:08:21.338:WARN::AUTH FAILURE: user basicUser
2014-11-03 17:08:21.341:WARN::AUTH FAILURE: user basicUser
2014-11-03 17:08:21.345:WARN::AUTH FAILURE: user basicUser
2014-11-03 17:08:21.348:WARN::AUTH FAILURE: user basicUser
2014-11-03 17:08:21.351:WARN::AUTH FAILURE: user basicUser
2014-11-03 17:08:21.354:WARN::AUTH FAILURE: user basicUser
2014-11-03 17:08:21.356:WARN::AUTH FAILURE: user basicUser
2014-11-03 17:08:21.359:WARN::AUTH FAILURE: user basicUser
2014-11-03 17:08:21.362:WARN::AUTH FAILURE: user basicUser
2014-11-03 17:08:21.365:WARN::AUTH FAILURE: user basicUser
2014-11-03 17:08:21.368:WARN::AUTH FAILURE: user basicUser
2014-11-03 17:08:21.370:WARN::AUTH FAILURE: user basicUser
2014-11-03 17:08:21.373:WARN::AUTH FAILURE: user basicUser
2014-11-03 17:08:21.376:WARN::AUTH FAILURE: user basicUser
2014-11-03 17:08:21.379:WARN::AUTH FAILURE: user basicUser
2014-11-03 17:08:21.383:WARN::AUTH FAILURE: user basicUser
2014-11-03 17:08:21.439:WARN::AUTH FAILURE: user basicUser
2014-11-03 17:08:21.447:WARN::AUTH FAILURE: user basicUser
2014-11-03 17:08:21.452:WARN::AUTH FAILURE: user basicUser
2014-11-03 17:08:21.459:WARN::AUTH FAILURE: user basicUser
2014-11-03 17:08:21.467:WARN::AUTH FAILURE: user basicUser
2014-11-03 17:08:21.477:WARN::AUTH FAILURE: user basicUser
2014-11-03 17:08:21.484:WARN::AUTH FAILURE: user basicUser
2014-11-03 17:08:21.492:WARN::AUTH FAILURE: user basicUser
2014-11-03 17:08:21.498:WARN::AUTH FAILURE: user basicUser
2014-11-03 17:08:21.505:WARN::AUTH FAILURE: user basicUser
2014-11-03 17:08:21.511:WARN::AUTH FAILURE: user basicUser
2014-11-03 17:08:21.520:WARN::AUTH FAILURE: user basicUser
2014-11-03 17:08:21.527:WARN::AUTH FAILURE: user basicUser
2014-11-03 17:08:21.534:WARN::AUTH FAILURE: user basicUser
2014-11-03 17:08:21.540:WARN::AUTH FAILURE: user basicUser
2014-11-03 17:08:21.564:WARN::AUTH FAILURE: user basicUser
2014-11-03 17:08:21.570:WARN::AUTH FAILURE: user basicUser
2014-11-03 17:08:21.578:WARN::AUTH FAILURE: user basicUser
2014-11-03 17:08:21.590:WARN::AUTH FAILURE: user basicUser
2014-11-03 17:08:21.603:INFO::Stopped SelectChannelConnector@0.0.0.0:9638
Tests run: 6, Failures: 0, Errors: 0, Skipped: 0, Time elapsed: 2.549 sec - in net.sf.taverna.t2.security.credentialmanager.BasicAuthTest

Results :

Tests run: 14, Failures: 0, Errors: 0, Skipped: 0

[JENKINS] Recording test results
[INFO] 
[INFO] --- maven-jar-plugin:2.4:jar (default-jar) @ credential-manager ---
[INFO] Building jar: /var/lib/jenkins/workspace/taverna-engine-credential-manager-maintenance/credential-manager/target/credential-manager-1.6-SNAPSHOT.jar
[INFO] 
[INFO] >>> maven-source-plugin:2.2.1:jar (default) @ credential-manager >>>
[WARNING] Failed to getClass for org.apache.maven.plugin.source.SourceJarMojo
[INFO] 
[INFO] <<< maven-source-plugin:2.2.1:jar (default) @ credential-manager <<<
[INFO] 
[INFO] --- maven-source-plugin:2.2.1:jar (default) @ credential-manager ---
[INFO] Building jar: /var/lib/jenkins/workspace/taverna-engine-credential-manager-maintenance/credential-manager/target/credential-manager-1.6-SNAPSHOT-sources.jar
[INFO] 
[INFO] >>> maven-source-plugin:2.2.1:test-jar (default) @ credential-manager >>>
[WARNING] Failed to getClass for org.apache.maven.plugin.source.TestSourceJarMojo
[INFO] 
[INFO] <<< maven-source-plugin:2.2.1:test-jar (default) @ credential-manager <<<
[INFO] 
[INFO] --- maven-source-plugin:2.2.1:test-jar (default) @ credential-manager ---
[INFO] Building jar: /var/lib/jenkins/workspace/taverna-engine-credential-manager-maintenance/credential-manager/target/credential-manager-1.6-SNAPSHOT-test-sources.jar
[INFO] 
[INFO] --- maven-jar-plugin:2.4:test-jar (default) @ credential-manager ---
[INFO] Building jar: /var/lib/jenkins/workspace/taverna-engine-credential-manager-maintenance/credential-manager/target/credential-manager-1.6-SNAPSHOT-tests.jar
[INFO] 
[INFO] --- maven-install-plugin:2.4:install (default-install) @ credential-manager ---
[INFO] Installing /var/lib/jenkins/workspace/taverna-engine-credential-manager-maintenance/credential-manager/target/credential-manager-1.6-SNAPSHOT.jar to /var/lib/jenkins/workspace/taverna-engine-credential-manager-maintenance/.repository/net/sf/taverna/t2/security/credential-manager/1.6-SNAPSHOT/credential-manager-1.6-SNAPSHOT.jar
[INFO] Installing /var/lib/jenkins/workspace/taverna-engine-credential-manager-maintenance/credential-manager/pom.xml to /var/lib/jenkins/workspace/taverna-engine-credential-manager-maintenance/.repository/net/sf/taverna/t2/security/credential-manager/1.6-SNAPSHOT/credential-manager-1.6-SNAPSHOT.pom
[INFO] Installing /var/lib/jenkins/workspace/taverna-engine-credential-manager-maintenance/credential-manager/target/credential-manager-1.6-SNAPSHOT-sources.jar to /var/lib/jenkins/workspace/taverna-engine-credential-manager-maintenance/.repository/net/sf/taverna/t2/security/credential-manager/1.6-SNAPSHOT/credential-manager-1.6-SNAPSHOT-sources.jar
[INFO] Installing /var/lib/jenkins/workspace/taverna-engine-credential-manager-maintenance/credential-manager/target/credential-manager-1.6-SNAPSHOT-test-sources.jar to /var/lib/jenkins/workspace/taverna-engine-credential-manager-maintenance/.repository/net/sf/taverna/t2/security/credential-manager/1.6-SNAPSHOT/credential-manager-1.6-SNAPSHOT-test-sources.jar
[INFO] Installing /var/lib/jenkins/workspace/taverna-engine-credential-manager-maintenance/credential-manager/target/credential-manager-1.6-SNAPSHOT-tests.jar to /var/lib/jenkins/workspace/taverna-engine-credential-manager-maintenance/.repository/net/sf/taverna/t2/security/credential-manager/1.6-SNAPSHOT/credential-manager-1.6-SNAPSHOT-tests.jar