SuccessConsole Output

[INFO]                                                                         
[INFO] ------------------------------------------------------------------------
[INFO] Building Credential manager 1.6-SNAPSHOT
[INFO] ------------------------------------------------------------------------
[INFO] Downloading: http://repository.mygrid.org.uk/artifactory/repo/org/apache/maven/plugins/maven-resources-plugin/2.6/maven-resources-plugin-2.6.pom
[INFO] Downloaded: http://repository.mygrid.org.uk/artifactory/repo/org/apache/maven/plugins/maven-resources-plugin/2.6/maven-resources-plugin-2.6.pom (8 KB at 264.2 KB/sec)
[INFO] Downloading: http://repository.mygrid.org.uk/artifactory/repo/org/apache/maven/plugins/maven-resources-plugin/2.6/maven-resources-plugin-2.6.jar
[INFO] Downloaded: http://repository.mygrid.org.uk/artifactory/repo/org/apache/maven/plugins/maven-resources-plugin/2.6/maven-resources-plugin-2.6.jar (29 KB at 994.0 KB/sec)
[INFO] Downloading: http://repository.mygrid.org.uk/artifactory/repo/org/apache/maven/plugins/maven-compiler-plugin/3.1/maven-compiler-plugin-3.1.pom
[INFO] Downloaded: http://repository.mygrid.org.uk/artifactory/repo/org/apache/maven/plugins/maven-compiler-plugin/3.1/maven-compiler-plugin-3.1.pom (10 KB at 433.5 KB/sec)
[INFO] Downloading: http://repository.mygrid.org.uk/artifactory/repo/org/apache/maven/plugins/maven-plugins/24/maven-plugins-24.pom
[INFO] Downloaded: http://repository.mygrid.org.uk/artifactory/repo/org/apache/maven/plugins/maven-plugins/24/maven-plugins-24.pom (11 KB at 340.4 KB/sec)
[INFO] Downloading: http://repository.mygrid.org.uk/artifactory/repo/org/apache/maven/maven-parent/23/maven-parent-23.pom
[INFO] Downloaded: http://repository.mygrid.org.uk/artifactory/repo/org/apache/maven/maven-parent/23/maven-parent-23.pom (32 KB at 1383.6 KB/sec)
[INFO] Downloading: http://repository.mygrid.org.uk/artifactory/repo/org/apache/apache/13/apache-13.pom
[INFO] Downloaded: http://repository.mygrid.org.uk/artifactory/repo/org/apache/apache/13/apache-13.pom (14 KB at 524.9 KB/sec)
[INFO] Downloading: http://repository.mygrid.org.uk/artifactory/repo/org/apache/maven/plugins/maven-compiler-plugin/3.1/maven-compiler-plugin-3.1.jar
[INFO] Downloaded: http://repository.mygrid.org.uk/artifactory/repo/org/apache/maven/plugins/maven-compiler-plugin/3.1/maven-compiler-plugin-3.1.jar (42 KB at 1677.7 KB/sec)
[INFO] Downloading: http://repository.mygrid.org.uk/artifactory/repo/org/apache/maven/plugins/maven-surefire-plugin/2.17/maven-surefire-plugin-2.17.pom
[INFO] Downloaded: http://repository.mygrid.org.uk/artifactory/repo/org/apache/maven/plugins/maven-surefire-plugin/2.17/maven-surefire-plugin-2.17.pom (5 KB at 222.0 KB/sec)
[INFO] Downloading: http://repository.mygrid.org.uk/artifactory/repo/org/apache/maven/surefire/surefire/2.17/surefire-2.17.pom
[INFO] Downloaded: http://repository.mygrid.org.uk/artifactory/repo/org/apache/maven/surefire/surefire/2.17/surefire-2.17.pom (17 KB at 734.8 KB/sec)
[INFO] Downloading: http://repository.mygrid.org.uk/artifactory/repo/org/apache/maven/plugins/maven-surefire-plugin/2.17/maven-surefire-plugin-2.17.jar
[INFO] Downloaded: http://repository.mygrid.org.uk/artifactory/repo/org/apache/maven/plugins/maven-surefire-plugin/2.17/maven-surefire-plugin-2.17.jar (34 KB at 1238.1 KB/sec)
[INFO] Downloading: http://repository.mygrid.org.uk/artifactory/repo/net/sf/taverna/t2/infrastructure/spi-discovery-api/2.6-SNAPSHOT/maven-metadata.xml
[INFO] Downloaded: http://repository.mygrid.org.uk/artifactory/repo/net/sf/taverna/t2/infrastructure/spi-discovery-api/2.6-SNAPSHOT/maven-metadata.xml (2 KB at 43.3 KB/sec)
[INFO] Downloading: http://repository.mygrid.org.uk/artifactory/repo/net/sf/taverna/t2/infrastructure/spi-discovery-api/2.6-SNAPSHOT/spi-discovery-api-2.6-20141027.154808-2.pom
[INFO] Downloaded: http://repository.mygrid.org.uk/artifactory/repo/net/sf/taverna/t2/infrastructure/spi-discovery-api/2.6-SNAPSHOT/spi-discovery-api-2.6-20141027.154808-2.pom (2 KB at 46.0 KB/sec)
[INFO] Downloading: http://repository.mygrid.org.uk/artifactory/repo/net/sf/taverna/t2/infrastructure/2.6-SNAPSHOT/maven-metadata.xml
[INFO] Downloaded: http://repository.mygrid.org.uk/artifactory/repo/net/sf/taverna/t2/infrastructure/2.6-SNAPSHOT/maven-metadata.xml (802 B at 22.4 KB/sec)
[INFO] Downloading: http://repository.mygrid.org.uk/artifactory/repo/net/sf/taverna/t2/infrastructure/2.6-SNAPSHOT/infrastructure-2.6-20141027.154808-2.pom
[INFO] Downloaded: http://repository.mygrid.org.uk/artifactory/repo/net/sf/taverna/t2/infrastructure/2.6-SNAPSHOT/infrastructure-2.6-20141027.154808-2.pom (4 KB at 149.0 KB/sec)
[INFO] Downloading: http://repository.mygrid.org.uk/artifactory/repo/net/sf/taverna/t2/lang/observer/1.6-SNAPSHOT/maven-metadata.xml
[INFO] Downloaded: http://repository.mygrid.org.uk/artifactory/repo/net/sf/taverna/t2/lang/observer/1.6-SNAPSHOT/maven-metadata.xml (2 KB at 41.5 KB/sec)
[INFO] Downloading: http://repository.mygrid.org.uk/artifactory/repo/net/sf/taverna/t2/lang/observer/1.6-SNAPSHOT/observer-1.6-20141027.154218-2.pom
[INFO] Downloaded: http://repository.mygrid.org.uk/artifactory/repo/net/sf/taverna/t2/lang/observer/1.6-SNAPSHOT/observer-1.6-20141027.154218-2.pom (833 B at 27.1 KB/sec)
[INFO] Downloading: http://repository.mygrid.org.uk/artifactory/repo/net/sf/taverna/t2/lang/1.6-SNAPSHOT/maven-metadata.xml
[INFO] Downloaded: http://repository.mygrid.org.uk/artifactory/repo/net/sf/taverna/t2/lang/1.6-SNAPSHOT/maven-metadata.xml (792 B at 17.6 KB/sec)
[INFO] Downloading: http://repository.mygrid.org.uk/artifactory/repo/net/sf/taverna/t2/lang/1.6-SNAPSHOT/lang-1.6-20141027.154218-2.pom
[INFO] Downloaded: http://repository.mygrid.org.uk/artifactory/repo/net/sf/taverna/t2/lang/1.6-SNAPSHOT/lang-1.6-20141027.154218-2.pom (3 KB at 89.1 KB/sec)
[INFO] Downloading: http://repository.mygrid.org.uk/artifactory/repo/log4j/log4j/1.2.16/log4j-1.2.16.pom
[INFO] Downloaded: http://repository.mygrid.org.uk/artifactory/repo/log4j/log4j/1.2.16/log4j-1.2.16.pom (20 KB at 567.5 KB/sec)
[INFO] Downloading: http://repository.mygrid.org.uk/artifactory/repo/net/sf/taverna/t2/infrastructure/raven/2.6-SNAPSHOT/maven-metadata.xml
[INFO] Downloaded: http://repository.mygrid.org.uk/artifactory/repo/net/sf/taverna/t2/infrastructure/raven/2.6-SNAPSHOT/maven-metadata.xml (2 KB at 59.8 KB/sec)
[INFO] Downloading: http://repository.mygrid.org.uk/artifactory/repo/net/sf/taverna/t2/infrastructure/raven/2.6-SNAPSHOT/raven-2.6-20141027.154808-2.pom
[INFO] Downloaded: http://repository.mygrid.org.uk/artifactory/repo/net/sf/taverna/t2/infrastructure/raven/2.6-SNAPSHOT/raven-2.6-20141027.154808-2.pom (2 KB at 48.7 KB/sec)
[INFO] Downloading: http://repository.mygrid.org.uk/artifactory/repo/net/sf/taverna/t2/infrastructure/raven-log4j/2.6-SNAPSHOT/maven-metadata.xml
[INFO] Downloaded: http://repository.mygrid.org.uk/artifactory/repo/net/sf/taverna/t2/infrastructure/raven-log4j/2.6-SNAPSHOT/maven-metadata.xml (2 KB at 53.1 KB/sec)
[INFO] Downloading: http://repository.mygrid.org.uk/artifactory/repo/net/sf/taverna/t2/infrastructure/raven-log4j/2.6-SNAPSHOT/raven-log4j-2.6-20141027.154808-2.pom
[INFO] Downloaded: http://repository.mygrid.org.uk/artifactory/repo/net/sf/taverna/t2/infrastructure/raven-log4j/2.6-SNAPSHOT/raven-log4j-2.6-20141027.154808-2.pom (952 B at 38.7 KB/sec)
[INFO] Downloading: http://repository.mygrid.org.uk/artifactory/repo/net/sf/taverna/t2/infrastructure/appconfig/2.6-SNAPSHOT/maven-metadata.xml
[INFO] Downloaded: http://repository.mygrid.org.uk/artifactory/repo/net/sf/taverna/t2/infrastructure/appconfig/2.6-SNAPSHOT/maven-metadata.xml (2 KB at 65.7 KB/sec)
[INFO] Downloading: http://repository.mygrid.org.uk/artifactory/repo/net/sf/taverna/t2/infrastructure/appconfig/2.6-SNAPSHOT/appconfig-2.6-20141027.154808-2.pom
[INFO] Downloaded: http://repository.mygrid.org.uk/artifactory/repo/net/sf/taverna/t2/infrastructure/appconfig/2.6-SNAPSHOT/appconfig-2.6-20141027.154808-2.pom (2 KB at 69.9 KB/sec)
[INFO] Downloading: http://repository.mygrid.org.uk/artifactory/repo/net/sf/taverna/t2/infrastructure/launcher-api/2.6-SNAPSHOT/maven-metadata.xml
[INFO] Downloaded: http://repository.mygrid.org.uk/artifactory/repo/net/sf/taverna/t2/infrastructure/launcher-api/2.6-SNAPSHOT/maven-metadata.xml (2 KB at 53.2 KB/sec)
[INFO] Downloading: http://repository.mygrid.org.uk/artifactory/repo/net/sf/taverna/t2/infrastructure/launcher-api/2.6-SNAPSHOT/launcher-api-2.6-20141027.154808-2.pom
[INFO] Downloaded: http://repository.mygrid.org.uk/artifactory/repo/net/sf/taverna/t2/infrastructure/launcher-api/2.6-SNAPSHOT/launcher-api-2.6-20141027.154808-2.pom (549 B at 22.3 KB/sec)
[INFO] Downloading: http://repository.mygrid.org.uk/artifactory/repo/net/sf/taverna/t2/infrastructure/prelauncher/2.6-SNAPSHOT/maven-metadata.xml
[INFO] Downloaded: http://repository.mygrid.org.uk/artifactory/repo/net/sf/taverna/t2/infrastructure/prelauncher/2.6-SNAPSHOT/maven-metadata.xml (2 KB at 60.0 KB/sec)
[INFO] Downloading: http://repository.mygrid.org.uk/artifactory/repo/net/sf/taverna/t2/infrastructure/prelauncher/2.6-SNAPSHOT/prelauncher-2.6-20141027.154808-2.pom
[INFO] Downloaded: http://repository.mygrid.org.uk/artifactory/repo/net/sf/taverna/t2/infrastructure/prelauncher/2.6-SNAPSHOT/prelauncher-2.6-20141027.154808-2.pom (2 KB at 56.4 KB/sec)
[INFO] Downloading: http://repository.mygrid.org.uk/artifactory/repo/bouncycastle/bcprov-jdk16/140/bcprov-jdk16-140.pom
[INFO] Downloaded: http://repository.mygrid.org.uk/artifactory/repo/bouncycastle/bcprov-jdk16/140/bcprov-jdk16-140.pom (2 KB at 2.6 KB/sec)
[INFO] Downloading: http://repository.mygrid.org.uk/artifactory/repo/junit/junit/4.8.1/junit-4.8.1.pom
[INFO] Downloaded: http://repository.mygrid.org.uk/artifactory/repo/junit/junit/4.8.1/junit-4.8.1.pom (949 B at 48.8 KB/sec)
[INFO] Downloading: http://repository.mygrid.org.uk/artifactory/repo/commons-io/commons-io/1.4/commons-io-1.4.pom
[INFO] Downloaded: http://repository.mygrid.org.uk/artifactory/repo/commons-io/commons-io/1.4/commons-io-1.4.pom (13 KB at 414.8 KB/sec)
[INFO] Downloading: http://repository.mygrid.org.uk/artifactory/repo/org/apache/commons/commons-parent/7/commons-parent-7.pom
[INFO] Downloaded: http://repository.mygrid.org.uk/artifactory/repo/org/apache/commons/commons-parent/7/commons-parent-7.pom (18 KB at 632.8 KB/sec)
[INFO] Downloading: http://repository.mygrid.org.uk/artifactory/repo/org/mortbay/jetty/jetty/6.1.24/jetty-6.1.24.pom
[INFO] Downloaded: http://repository.mygrid.org.uk/artifactory/repo/org/mortbay/jetty/jetty/6.1.24/jetty-6.1.24.pom (7 KB at 17.8 KB/sec)
[INFO] Downloading: http://repository.mygrid.org.uk/artifactory/repo/org/mortbay/jetty/project/6.1.24/project-6.1.24.pom
[INFO] Downloaded: http://repository.mygrid.org.uk/artifactory/repo/org/mortbay/jetty/project/6.1.24/project-6.1.24.pom (10 KB at 29.4 KB/sec)
[INFO] Downloading: http://repository.mygrid.org.uk/artifactory/repo/org/mortbay/jetty/jetty-parent/9/jetty-parent-9.pom
[INFO] Downloaded: http://repository.mygrid.org.uk/artifactory/repo/org/mortbay/jetty/jetty-parent/9/jetty-parent-9.pom (3 KB at 8.3 KB/sec)
[INFO] Downloading: http://repository.mygrid.org.uk/artifactory/repo/org/eclipse/jetty/jetty-parent/12/jetty-parent-12.pom
[INFO] Downloaded: http://repository.mygrid.org.uk/artifactory/repo/org/eclipse/jetty/jetty-parent/12/jetty-parent-12.pom (16 KB at 48.8 KB/sec)
[INFO] Downloading: http://repository.mygrid.org.uk/artifactory/repo/org/mortbay/jetty/jetty-util/6.1.24/jetty-util-6.1.24.pom
[INFO] Downloaded: http://repository.mygrid.org.uk/artifactory/repo/org/mortbay/jetty/jetty-util/6.1.24/jetty-util-6.1.24.pom (4 KB at 9.8 KB/sec)
[INFO] Downloading: http://repository.mygrid.org.uk/artifactory/repo/org/mortbay/jetty/servlet-api/2.5-20081211/servlet-api-2.5-20081211.pom
[INFO] Downloaded: http://repository.mygrid.org.uk/artifactory/repo/org/mortbay/jetty/servlet-api/2.5-20081211/servlet-api-2.5-20081211.pom (3 KB at 7.6 KB/sec)
[INFO] Downloading: http://repository.mygrid.org.uk/artifactory/repo/org/mortbay/jetty/jetty-parent/7/jetty-parent-7.pom
[INFO] Downloaded: http://repository.mygrid.org.uk/artifactory/repo/org/mortbay/jetty/jetty-parent/7/jetty-parent-7.pom (13 KB at 9.3 KB/sec)
[INFO] Downloading: http://repository.mygrid.org.uk/artifactory/repo/net/sf/taverna/t2/infrastructure/spi-discovery-api/2.6-SNAPSHOT/spi-discovery-api-2.6-20141027.154808-2.jar
[INFO] Downloading: http://repository.mygrid.org.uk/artifactory/repo/net/sf/taverna/t2/lang/observer/1.6-SNAPSHOT/observer-1.6-20141027.154218-2.jar
[INFO] Downloading: http://repository.mygrid.org.uk/artifactory/repo/net/sf/taverna/t2/infrastructure/raven/2.6-SNAPSHOT/raven-2.6-20141027.154808-2.jar
[INFO] Downloading: http://repository.mygrid.org.uk/artifactory/repo/net/sf/taverna/t2/infrastructure/raven-log4j/2.6-SNAPSHOT/raven-log4j-2.6-20141027.154808-2.jar
[INFO] Downloading: http://repository.mygrid.org.uk/artifactory/repo/bouncycastle/bcprov-jdk16/140/bcprov-jdk16-140.jar
[INFO] Downloaded: http://repository.mygrid.org.uk/artifactory/repo/net/sf/taverna/t2/lang/observer/1.6-SNAPSHOT/observer-1.6-20141027.154218-2.jar (5 KB at 32.8 KB/sec)
[INFO] Downloading: http://repository.mygrid.org.uk/artifactory/repo/net/sf/taverna/t2/infrastructure/appconfig/2.6-SNAPSHOT/appconfig-2.6-20141027.154808-2.jar
[INFO] Downloaded: http://repository.mygrid.org.uk/artifactory/repo/net/sf/taverna/t2/infrastructure/spi-discovery-api/2.6-SNAPSHOT/spi-discovery-api-2.6-20141027.154808-2.jar (6 KB at 24.2 KB/sec)
[INFO] Downloading: http://repository.mygrid.org.uk/artifactory/repo/net/sf/taverna/t2/infrastructure/launcher-api/2.6-SNAPSHOT/launcher-api-2.6-20141027.154808-2.jar
[INFO] Downloaded: http://repository.mygrid.org.uk/artifactory/repo/net/sf/taverna/t2/infrastructure/raven-log4j/2.6-SNAPSHOT/raven-log4j-2.6-20141027.154808-2.jar (4 KB at 14.6 KB/sec)
[INFO] Downloading: http://repository.mygrid.org.uk/artifactory/repo/net/sf/taverna/t2/infrastructure/prelauncher/2.6-SNAPSHOT/prelauncher-2.6-20141027.154808-2.jar
[INFO] Downloaded: http://repository.mygrid.org.uk/artifactory/repo/net/sf/taverna/t2/infrastructure/raven/2.6-SNAPSHOT/raven-2.6-20141027.154808-2.jar (85 KB at 268.2 KB/sec)
[INFO] Downloading: http://repository.mygrid.org.uk/artifactory/repo/log4j/log4j/1.2.16/log4j-1.2.16.jar
[INFO] Downloaded: http://repository.mygrid.org.uk/artifactory/repo/net/sf/taverna/t2/infrastructure/appconfig/2.6-SNAPSHOT/appconfig-2.6-20141027.154808-2.jar (29 KB at 104.7 KB/sec)
[INFO] Downloading: http://repository.mygrid.org.uk/artifactory/repo/junit/junit/4.8.1/junit-4.8.1.jar
[INFO] Downloaded: http://repository.mygrid.org.uk/artifactory/repo/net/sf/taverna/t2/infrastructure/launcher-api/2.6-SNAPSHOT/launcher-api-2.6-20141027.154808-2.jar (3 KB at 8.4 KB/sec)
[INFO] Downloading: http://repository.mygrid.org.uk/artifactory/repo/commons-io/commons-io/1.4/commons-io-1.4.jar
[INFO] Downloaded: http://repository.mygrid.org.uk/artifactory/repo/net/sf/taverna/t2/infrastructure/prelauncher/2.6-SNAPSHOT/prelauncher-2.6-20141027.154808-2.jar (9 KB at 32.8 KB/sec)
[INFO] Downloading: http://repository.mygrid.org.uk/artifactory/repo/org/mortbay/jetty/jetty/6.1.24/jetty-6.1.24.jar
[INFO] Downloaded: http://repository.mygrid.org.uk/artifactory/repo/junit/junit/4.8.1/junit-4.8.1.jar (232 KB at 1265.0 KB/sec)
[INFO] Downloaded: http://repository.mygrid.org.uk/artifactory/repo/commons-io/commons-io/1.4/commons-io-1.4.jar (107 KB at 1075.6 KB/sec)
[INFO] Downloading: http://repository.mygrid.org.uk/artifactory/repo/org/mortbay/jetty/jetty-util/6.1.24/jetty-util-6.1.24.jar
[INFO] Downloading: http://repository.mygrid.org.uk/artifactory/repo/org/mortbay/jetty/servlet-api/2.5-20081211/servlet-api-2.5-20081211.jar
[INFO] Downloaded: http://repository.mygrid.org.uk/artifactory/repo/log4j/log4j/1.2.16/log4j-1.2.16.jar (471 KB at 1306.2 KB/sec)
[INFO] Downloaded: http://repository.mygrid.org.uk/artifactory/repo/org/mortbay/jetty/servlet-api/2.5-20081211/servlet-api-2.5-20081211.jar (131 KB at 141.6 KB/sec)
[INFO] Downloaded: http://repository.mygrid.org.uk/artifactory/repo/org/mortbay/jetty/jetty/6.1.24/jetty-6.1.24.jar (526 KB at 426.2 KB/sec)
[INFO] Downloaded: http://repository.mygrid.org.uk/artifactory/repo/org/mortbay/jetty/jetty-util/6.1.24/jetty-util-6.1.24.jar (174 KB at 148.8 KB/sec)
[INFO] Downloaded: http://repository.mygrid.org.uk/artifactory/repo/bouncycastle/bcprov-jdk16/140/bcprov-jdk16-140.jar (1614 KB at 534.5 KB/sec)
[INFO] 
[INFO] --- maven-clean-plugin:2.5:clean (default-clean) @ credential-manager ---
[INFO] 
[INFO] --- maven-resources-plugin:2.6:resources (default-resources) @ credential-manager ---
[INFO] Downloading: http://repository.mygrid.org.uk/artifactory/repo/org/codehaus/plexus/plexus-utils/2.0.5/plexus-utils-2.0.5.pom
[INFO] Downloaded: http://repository.mygrid.org.uk/artifactory/repo/org/codehaus/plexus/plexus-utils/2.0.5/plexus-utils-2.0.5.pom (4 KB at 116.3 KB/sec)
[INFO] Downloading: http://repository.mygrid.org.uk/artifactory/repo/org/codehaus/plexus/plexus/2.0.6/plexus-2.0.6.pom
[INFO] Downloaded: http://repository.mygrid.org.uk/artifactory/repo/org/codehaus/plexus/plexus/2.0.6/plexus-2.0.6.pom (17 KB at 308.9 KB/sec)
[INFO] Downloading: http://repository.mygrid.org.uk/artifactory/repo/org/apache/maven/shared/maven-filtering/1.1/maven-filtering-1.1.pom
[INFO] Downloaded: http://repository.mygrid.org.uk/artifactory/repo/org/apache/maven/shared/maven-filtering/1.1/maven-filtering-1.1.pom (6 KB at 257.0 KB/sec)
[INFO] Downloading: http://repository.mygrid.org.uk/artifactory/repo/org/codehaus/plexus/plexus-utils/1.5.15/plexus-utils-1.5.15.pom
[INFO] Downloaded: http://repository.mygrid.org.uk/artifactory/repo/org/codehaus/plexus/plexus-utils/1.5.15/plexus-utils-1.5.15.pom (7 KB at 56.2 KB/sec)
[INFO] Downloading: http://repository.mygrid.org.uk/artifactory/repo/org/codehaus/plexus/plexus/2.0.2/plexus-2.0.2.pom
[INFO] Downloaded: http://repository.mygrid.org.uk/artifactory/repo/org/codehaus/plexus/plexus/2.0.2/plexus-2.0.2.pom (12 KB at 354.3 KB/sec)
[INFO] Downloading: http://repository.mygrid.org.uk/artifactory/repo/org/codehaus/plexus/plexus-interpolation/1.12/plexus-interpolation-1.12.pom
[INFO] Downloaded: http://repository.mygrid.org.uk/artifactory/repo/org/codehaus/plexus/plexus-interpolation/1.12/plexus-interpolation-1.12.pom (889 B at 33.4 KB/sec)
[INFO] Downloading: http://repository.mygrid.org.uk/artifactory/repo/org/codehaus/plexus/plexus-components/1.1.14/plexus-components-1.1.14.pom
[INFO] Downloaded: http://repository.mygrid.org.uk/artifactory/repo/org/codehaus/plexus/plexus-components/1.1.14/plexus-components-1.1.14.pom (6 KB at 196.7 KB/sec)
[INFO] Downloading: http://repository.mygrid.org.uk/artifactory/repo/org/sonatype/plexus/plexus-build-api/0.0.4/plexus-build-api-0.0.4.pom
[INFO] Downloaded: http://repository.mygrid.org.uk/artifactory/repo/org/sonatype/plexus/plexus-build-api/0.0.4/plexus-build-api-0.0.4.pom (3 KB at 103.6 KB/sec)
[INFO] Downloading: http://repository.mygrid.org.uk/artifactory/repo/org/sonatype/spice/spice-parent/10/spice-parent-10.pom
[INFO] Downloaded: http://repository.mygrid.org.uk/artifactory/repo/org/sonatype/spice/spice-parent/10/spice-parent-10.pom (3 KB at 128.0 KB/sec)
[INFO] Downloading: http://repository.mygrid.org.uk/artifactory/repo/org/sonatype/forge/forge-parent/3/forge-parent-3.pom
[INFO] Downloaded: http://repository.mygrid.org.uk/artifactory/repo/org/sonatype/forge/forge-parent/3/forge-parent-3.pom (5 KB at 234.0 KB/sec)
[INFO] Downloading: http://repository.mygrid.org.uk/artifactory/repo/org/codehaus/plexus/plexus-utils/1.5.8/plexus-utils-1.5.8.pom
[INFO] Downloaded: http://repository.mygrid.org.uk/artifactory/repo/org/codehaus/plexus/plexus-utils/1.5.8/plexus-utils-1.5.8.pom (8 KB at 463.2 KB/sec)
[INFO] Downloading: http://repository.mygrid.org.uk/artifactory/repo/org/codehaus/plexus/plexus-interpolation/1.13/plexus-interpolation-1.13.pom
[INFO] Downloaded: http://repository.mygrid.org.uk/artifactory/repo/org/codehaus/plexus/plexus-interpolation/1.13/plexus-interpolation-1.13.pom (890 B at 36.2 KB/sec)
[INFO] Downloading: http://repository.mygrid.org.uk/artifactory/repo/org/codehaus/plexus/plexus-components/1.1.15/plexus-components-1.1.15.pom
[INFO] Downloaded: http://repository.mygrid.org.uk/artifactory/repo/org/codehaus/plexus/plexus-components/1.1.15/plexus-components-1.1.15.pom (3 KB at 64.7 KB/sec)
[INFO] Downloading: http://repository.mygrid.org.uk/artifactory/repo/org/codehaus/plexus/plexus/2.0.3/plexus-2.0.3.pom
[INFO] Downloaded: http://repository.mygrid.org.uk/artifactory/repo/org/codehaus/plexus/plexus/2.0.3/plexus-2.0.3.pom (16 KB at 656.5 KB/sec)
[INFO] Downloading: http://repository.mygrid.org.uk/artifactory/repo/org/codehaus/plexus/plexus-utils/2.0.5/plexus-utils-2.0.5.jar
[INFO] Downloading: http://repository.mygrid.org.uk/artifactory/repo/org/apache/maven/shared/maven-filtering/1.1/maven-filtering-1.1.jar
[INFO] Downloading: http://repository.mygrid.org.uk/artifactory/repo/org/sonatype/plexus/plexus-build-api/0.0.4/plexus-build-api-0.0.4.jar
[INFO] Downloading: http://repository.mygrid.org.uk/artifactory/repo/org/codehaus/plexus/plexus-interpolation/1.13/plexus-interpolation-1.13.jar
[INFO] Downloaded: http://repository.mygrid.org.uk/artifactory/repo/org/apache/maven/shared/maven-filtering/1.1/maven-filtering-1.1.jar (43 KB at 489.5 KB/sec)
[INFO] Downloaded: http://repository.mygrid.org.uk/artifactory/repo/org/sonatype/plexus/plexus-build-api/0.0.4/plexus-build-api-0.0.4.jar (7 KB at 96.4 KB/sec)
[INFO] Downloaded: http://repository.mygrid.org.uk/artifactory/repo/org/codehaus/plexus/plexus-utils/2.0.5/plexus-utils-2.0.5.jar (218 KB at 1757.6 KB/sec)
[INFO] Downloaded: http://repository.mygrid.org.uk/artifactory/repo/org/codehaus/plexus/plexus-interpolation/1.13/plexus-interpolation-1.13.jar (60 KB at 784.6 KB/sec)
[INFO] Using 'UTF-8' encoding to copy filtered resources.
[INFO] Copying 7 resources
[INFO] 
[INFO] --- maven-compiler-plugin:3.1:compile (default-compile) @ credential-manager ---
[INFO] Downloading: http://repository.mygrid.org.uk/artifactory/repo/org/apache/maven/maven-core/2.0.9/maven-core-2.0.9.pom
[INFO] Downloaded: http://repository.mygrid.org.uk/artifactory/repo/org/apache/maven/maven-core/2.0.9/maven-core-2.0.9.pom (8 KB at 304.1 KB/sec)
[INFO] Downloading: http://repository.mygrid.org.uk/artifactory/repo/org/apache/maven/maven-plugin-parameter-documenter/2.0.9/maven-plugin-parameter-documenter-2.0.9.pom
[INFO] Downloaded: http://repository.mygrid.org.uk/artifactory/repo/org/apache/maven/maven-plugin-parameter-documenter/2.0.9/maven-plugin-parameter-documenter-2.0.9.pom (2 KB at 79.9 KB/sec)
[INFO] Downloading: http://repository.mygrid.org.uk/artifactory/repo/org/apache/maven/maven-error-diagnostics/2.0.9/maven-error-diagnostics-2.0.9.pom
[INFO] Downloaded: http://repository.mygrid.org.uk/artifactory/repo/org/apache/maven/maven-error-diagnostics/2.0.9/maven-error-diagnostics-2.0.9.pom (2 KB at 89.6 KB/sec)
[INFO] Downloading: http://repository.mygrid.org.uk/artifactory/repo/org/apache/maven/maven-plugin-descriptor/2.0.9/maven-plugin-descriptor-2.0.9.pom
[INFO] Downloaded: http://repository.mygrid.org.uk/artifactory/repo/org/apache/maven/maven-plugin-descriptor/2.0.9/maven-plugin-descriptor-2.0.9.pom (3 KB at 65.4 KB/sec)
[INFO] Downloading: http://repository.mygrid.org.uk/artifactory/repo/org/apache/maven/maven-monitor/2.0.9/maven-monitor-2.0.9.pom
[INFO] Downloaded: http://repository.mygrid.org.uk/artifactory/repo/org/apache/maven/maven-monitor/2.0.9/maven-monitor-2.0.9.pom (2 KB at 33.9 KB/sec)
[INFO] Downloading: http://repository.mygrid.org.uk/artifactory/repo/org/apache/maven/maven-toolchain/1.0/maven-toolchain-1.0.pom
[INFO] Downloaded: http://repository.mygrid.org.uk/artifactory/repo/org/apache/maven/maven-toolchain/1.0/maven-toolchain-1.0.pom (4 KB at 90.1 KB/sec)
[INFO] Downloading: http://repository.mygrid.org.uk/artifactory/repo/org/apache/maven/shared/maven-shared-utils/0.1/maven-shared-utils-0.1.pom
[INFO] Downloaded: http://repository.mygrid.org.uk/artifactory/repo/org/apache/maven/shared/maven-shared-utils/0.1/maven-shared-utils-0.1.pom (4 KB at 104.0 KB/sec)
[INFO] Downloading: http://repository.mygrid.org.uk/artifactory/repo/org/apache/maven/shared/maven-shared-components/18/maven-shared-components-18.pom
[INFO] Downloaded: http://repository.mygrid.org.uk/artifactory/repo/org/apache/maven/shared/maven-shared-components/18/maven-shared-components-18.pom (5 KB at 155.4 KB/sec)
[INFO] Downloading: http://repository.mygrid.org.uk/artifactory/repo/com/google/code/findbugs/jsr305/2.0.1/jsr305-2.0.1.pom
[INFO] Downloaded: http://repository.mygrid.org.uk/artifactory/repo/com/google/code/findbugs/jsr305/2.0.1/jsr305-2.0.1.pom (965 B at 37.7 KB/sec)
[INFO] Downloading: http://repository.mygrid.org.uk/artifactory/repo/org/apache/maven/shared/maven-shared-incremental/1.1/maven-shared-incremental-1.1.pom
[INFO] Downloaded: http://repository.mygrid.org.uk/artifactory/repo/org/apache/maven/shared/maven-shared-incremental/1.1/maven-shared-incremental-1.1.pom (5 KB at 201.3 KB/sec)
[INFO] Downloading: http://repository.mygrid.org.uk/artifactory/repo/org/apache/maven/shared/maven-shared-components/19/maven-shared-components-19.pom
[INFO] Downloaded: http://repository.mygrid.org.uk/artifactory/repo/org/apache/maven/shared/maven-shared-components/19/maven-shared-components-19.pom (7 KB at 238.8 KB/sec)
[INFO] Downloading: http://repository.mygrid.org.uk/artifactory/repo/org/apache/maven/maven-plugin-api/2.2.1/maven-plugin-api-2.2.1.pom
[INFO] Downloaded: http://repository.mygrid.org.uk/artifactory/repo/org/apache/maven/maven-plugin-api/2.2.1/maven-plugin-api-2.2.1.pom (2 KB at 40.7 KB/sec)
[INFO] Downloading: http://repository.mygrid.org.uk/artifactory/repo/org/apache/maven/maven/2.2.1/maven-2.2.1.pom
[INFO] Downloaded: http://repository.mygrid.org.uk/artifactory/repo/org/apache/maven/maven/2.2.1/maven-2.2.1.pom (22 KB at 810.5 KB/sec)
[INFO] Downloading: http://repository.mygrid.org.uk/artifactory/repo/org/apache/maven/maven-parent/11/maven-parent-11.pom
[INFO] Downloaded: http://repository.mygrid.org.uk/artifactory/repo/org/apache/maven/maven-parent/11/maven-parent-11.pom (32 KB at 989.0 KB/sec)
[INFO] Downloading: http://repository.mygrid.org.uk/artifactory/repo/org/apache/apache/5/apache-5.pom
[INFO] Downloaded: http://repository.mygrid.org.uk/artifactory/repo/org/apache/apache/5/apache-5.pom (5 KB at 142.9 KB/sec)
[INFO] Downloading: http://repository.mygrid.org.uk/artifactory/repo/org/apache/maven/maven-core/2.2.1/maven-core-2.2.1.pom
[INFO] Downloaded: http://repository.mygrid.org.uk/artifactory/repo/org/apache/maven/maven-core/2.2.1/maven-core-2.2.1.pom (12 KB at 516.4 KB/sec)
[INFO] Downloading: http://repository.mygrid.org.uk/artifactory/repo/org/apache/maven/maven-settings/2.2.1/maven-settings-2.2.1.pom
[INFO] Downloaded: http://repository.mygrid.org.uk/artifactory/repo/org/apache/maven/maven-settings/2.2.1/maven-settings-2.2.1.pom (3 KB at 42.6 KB/sec)
[INFO] Downloading: http://repository.mygrid.org.uk/artifactory/repo/org/apache/maven/maven-model/2.2.1/maven-model-2.2.1.pom
[INFO] Downloaded: http://repository.mygrid.org.uk/artifactory/repo/org/apache/maven/maven-model/2.2.1/maven-model-2.2.1.pom (4 KB at 62.0 KB/sec)
[INFO] Downloading: http://repository.mygrid.org.uk/artifactory/repo/org/codehaus/plexus/plexus-interpolation/1.11/plexus-interpolation-1.11.pom
[INFO] Downloaded: http://repository.mygrid.org.uk/artifactory/repo/org/codehaus/plexus/plexus-interpolation/1.11/plexus-interpolation-1.11.pom (889 B at 26.3 KB/sec)
[INFO] Downloading: http://repository.mygrid.org.uk/artifactory/repo/org/apache/maven/maven-plugin-parameter-documenter/2.2.1/maven-plugin-parameter-documenter-2.2.1.pom
[INFO] Downloaded: http://repository.mygrid.org.uk/artifactory/repo/org/apache/maven/maven-plugin-parameter-documenter/2.2.1/maven-plugin-parameter-documenter-2.2.1.pom (2 KB at 61.6 KB/sec)
[INFO] Downloading: http://repository.mygrid.org.uk/artifactory/repo/org/slf4j/slf4j-jdk14/1.5.6/slf4j-jdk14-1.5.6.pom
[INFO] Downloaded: http://repository.mygrid.org.uk/artifactory/repo/org/slf4j/slf4j-jdk14/1.5.6/slf4j-jdk14-1.5.6.pom (2 KB at 71.3 KB/sec)
[INFO] Downloading: http://repository.mygrid.org.uk/artifactory/repo/org/slf4j/slf4j-parent/1.5.6/slf4j-parent-1.5.6.pom
[INFO] Downloaded: http://repository.mygrid.org.uk/artifactory/repo/org/slf4j/slf4j-parent/1.5.6/slf4j-parent-1.5.6.pom (8 KB at 257.8 KB/sec)
[INFO] Downloading: http://repository.mygrid.org.uk/artifactory/repo/org/slf4j/slf4j-api/1.5.6/slf4j-api-1.5.6.pom
[INFO] Downloaded: http://repository.mygrid.org.uk/artifactory/repo/org/slf4j/slf4j-api/1.5.6/slf4j-api-1.5.6.pom (3 KB at 107.9 KB/sec)
[INFO] Downloading: http://repository.mygrid.org.uk/artifactory/repo/org/slf4j/jcl-over-slf4j/1.5.6/jcl-over-slf4j-1.5.6.pom
[INFO] Downloaded: http://repository.mygrid.org.uk/artifactory/repo/org/slf4j/jcl-over-slf4j/1.5.6/jcl-over-slf4j-1.5.6.pom (3 KB at 62.3 KB/sec)
[INFO] Downloading: http://repository.mygrid.org.uk/artifactory/repo/org/apache/maven/maven-profile/2.2.1/maven-profile-2.2.1.pom
[INFO] Downloaded: http://repository.mygrid.org.uk/artifactory/repo/org/apache/maven/maven-profile/2.2.1/maven-profile-2.2.1.pom (3 KB at 55.8 KB/sec)
[INFO] Downloading: http://repository.mygrid.org.uk/artifactory/repo/org/apache/maven/maven-artifact/2.2.1/maven-artifact-2.2.1.pom
[INFO] Downloaded: http://repository.mygrid.org.uk/artifactory/repo/org/apache/maven/maven-artifact/2.2.1/maven-artifact-2.2.1.pom (2 KB at 48.2 KB/sec)
[INFO] Downloading: http://repository.mygrid.org.uk/artifactory/repo/org/apache/maven/maven-repository-metadata/2.2.1/maven-repository-metadata-2.2.1.pom
[INFO] Downloaded: http://repository.mygrid.org.uk/artifactory/repo/org/apache/maven/maven-repository-metadata/2.2.1/maven-repository-metadata-2.2.1.pom (2 KB at 53.7 KB/sec)
[INFO] Downloading: http://repository.mygrid.org.uk/artifactory/repo/org/apache/maven/maven-error-diagnostics/2.2.1/maven-error-diagnostics-2.2.1.pom
[INFO] Downloaded: http://repository.mygrid.org.uk/artifactory/repo/org/apache/maven/maven-error-diagnostics/2.2.1/maven-error-diagnostics-2.2.1.pom (2 KB at 42.8 KB/sec)
[INFO] Downloading: http://repository.mygrid.org.uk/artifactory/repo/org/apache/maven/maven-project/2.2.1/maven-project-2.2.1.pom
[INFO] Downloaded: http://repository.mygrid.org.uk/artifactory/repo/org/apache/maven/maven-project/2.2.1/maven-project-2.2.1.pom (3 KB at 87.4 KB/sec)
[INFO] Downloading: http://repository.mygrid.org.uk/artifactory/repo/org/apache/maven/maven-artifact-manager/2.2.1/maven-artifact-manager-2.2.1.pom
[INFO] Downloaded: http://repository.mygrid.org.uk/artifactory/repo/org/apache/maven/maven-artifact-manager/2.2.1/maven-artifact-manager-2.2.1.pom (4 KB at 101.0 KB/sec)
[INFO] Downloading: http://repository.mygrid.org.uk/artifactory/repo/backport-util-concurrent/backport-util-concurrent/3.1/backport-util-concurrent-3.1.pom
[INFO] Downloaded: http://repository.mygrid.org.uk/artifactory/repo/backport-util-concurrent/backport-util-concurrent/3.1/backport-util-concurrent-3.1.pom (880 B at 34.4 KB/sec)
[INFO] Downloading: http://repository.mygrid.org.uk/artifactory/repo/org/apache/maven/maven-plugin-registry/2.2.1/maven-plugin-registry-2.2.1.pom
[INFO] Downloaded: http://repository.mygrid.org.uk/artifactory/repo/org/apache/maven/maven-plugin-registry/2.2.1/maven-plugin-registry-2.2.1.pom (2 KB at 81.9 KB/sec)
[INFO] Downloading: http://repository.mygrid.org.uk/artifactory/repo/org/apache/maven/maven-plugin-descriptor/2.2.1/maven-plugin-descriptor-2.2.1.pom
[INFO] Downloaded: http://repository.mygrid.org.uk/artifactory/repo/org/apache/maven/maven-plugin-descriptor/2.2.1/maven-plugin-descriptor-2.2.1.pom (3 KB at 53.0 KB/sec)
[INFO] Downloading: http://repository.mygrid.org.uk/artifactory/repo/org/apache/maven/maven-monitor/2.2.1/maven-monitor-2.2.1.pom
[INFO] Downloaded: http://repository.mygrid.org.uk/artifactory/repo/org/apache/maven/maven-monitor/2.2.1/maven-monitor-2.2.1.pom (2 KB at 33.2 KB/sec)
[INFO] Downloading: http://repository.mygrid.org.uk/artifactory/repo/org/sonatype/plexus/plexus-sec-dispatcher/1.3/plexus-sec-dispatcher-1.3.pom
[INFO] Downloaded: http://repository.mygrid.org.uk/artifactory/repo/org/sonatype/plexus/plexus-sec-dispatcher/1.3/plexus-sec-dispatcher-1.3.pom (3 KB at 125.7 KB/sec)
[INFO] Downloading: http://repository.mygrid.org.uk/artifactory/repo/org/sonatype/spice/spice-parent/12/spice-parent-12.pom
[INFO] Downloaded: http://repository.mygrid.org.uk/artifactory/repo/org/sonatype/spice/spice-parent/12/spice-parent-12.pom (7 KB at 228.9 KB/sec)
[INFO] Downloading: http://repository.mygrid.org.uk/artifactory/repo/org/sonatype/forge/forge-parent/4/forge-parent-4.pom
[INFO] Downloaded: http://repository.mygrid.org.uk/artifactory/repo/org/sonatype/forge/forge-parent/4/forge-parent-4.pom (9 KB at 174.5 KB/sec)
[INFO] Downloading: http://repository.mygrid.org.uk/artifactory/repo/org/codehaus/plexus/plexus-utils/1.5.5/plexus-utils-1.5.5.pom
[INFO] Downloaded: http://repository.mygrid.org.uk/artifactory/repo/org/codehaus/plexus/plexus-utils/1.5.5/plexus-utils-1.5.5.pom (6 KB at 251.3 KB/sec)
[INFO] Downloading: http://repository.mygrid.org.uk/artifactory/repo/org/sonatype/plexus/plexus-cipher/1.4/plexus-cipher-1.4.pom
[INFO] Downloaded: http://repository.mygrid.org.uk/artifactory/repo/org/sonatype/plexus/plexus-cipher/1.4/plexus-cipher-1.4.pom (3 KB at 100.8 KB/sec)
[INFO] Downloading: http://repository.mygrid.org.uk/artifactory/repo/org/codehaus/plexus/plexus-component-annotations/1.5.5/plexus-component-annotations-1.5.5.pom
[INFO] Downloaded: http://repository.mygrid.org.uk/artifactory/repo/org/codehaus/plexus/plexus-component-annotations/1.5.5/plexus-component-annotations-1.5.5.pom (815 B at 34.6 KB/sec)
[INFO] Downloading: http://repository.mygrid.org.uk/artifactory/repo/org/codehaus/plexus/plexus-containers/1.5.5/plexus-containers-1.5.5.pom
[INFO] Downloaded: http://repository.mygrid.org.uk/artifactory/repo/org/codehaus/plexus/plexus-containers/1.5.5/plexus-containers-1.5.5.pom (5 KB at 172.5 KB/sec)
[INFO] Downloading: http://repository.mygrid.org.uk/artifactory/repo/org/codehaus/plexus/plexus/2.0.7/plexus-2.0.7.pom
[INFO] Downloaded: http://repository.mygrid.org.uk/artifactory/repo/org/codehaus/plexus/plexus/2.0.7/plexus-2.0.7.pom (17 KB at 804.3 KB/sec)
[INFO] Downloading: http://repository.mygrid.org.uk/artifactory/repo/org/codehaus/plexus/plexus-compiler-api/2.2/plexus-compiler-api-2.2.pom
[INFO] Downloaded: http://repository.mygrid.org.uk/artifactory/repo/org/codehaus/plexus/plexus-compiler-api/2.2/plexus-compiler-api-2.2.pom (865 B at 31.3 KB/sec)
[INFO] Downloading: http://repository.mygrid.org.uk/artifactory/repo/org/codehaus/plexus/plexus-compiler/2.2/plexus-compiler-2.2.pom
[INFO] Downloaded: http://repository.mygrid.org.uk/artifactory/repo/org/codehaus/plexus/plexus-compiler/2.2/plexus-compiler-2.2.pom (4 KB at 153.4 KB/sec)
[INFO] Downloading: http://repository.mygrid.org.uk/artifactory/repo/org/codehaus/plexus/plexus-components/1.3.1/plexus-components-1.3.1.pom
[INFO] Downloaded: http://repository.mygrid.org.uk/artifactory/repo/org/codehaus/plexus/plexus-components/1.3.1/plexus-components-1.3.1.pom (3 KB at 115.1 KB/sec)
[INFO] Downloading: http://repository.mygrid.org.uk/artifactory/repo/org/codehaus/plexus/plexus/3.3.1/plexus-3.3.1.pom
[INFO] Downloaded: http://repository.mygrid.org.uk/artifactory/repo/org/codehaus/plexus/plexus/3.3.1/plexus-3.3.1.pom (20 KB at 554.6 KB/sec)
[INFO] Downloading: http://repository.mygrid.org.uk/artifactory/repo/org/codehaus/plexus/plexus-compiler-manager/2.2/plexus-compiler-manager-2.2.pom
[INFO] Downloaded: http://repository.mygrid.org.uk/artifactory/repo/org/codehaus/plexus/plexus-compiler-manager/2.2/plexus-compiler-manager-2.2.pom (690 B at 29.3 KB/sec)
[INFO] Downloading: http://repository.mygrid.org.uk/artifactory/repo/org/codehaus/plexus/plexus-compiler-javac/2.2/plexus-compiler-javac-2.2.pom
[INFO] Downloaded: http://repository.mygrid.org.uk/artifactory/repo/org/codehaus/plexus/plexus-compiler-javac/2.2/plexus-compiler-javac-2.2.pom (769 B at 30.0 KB/sec)
[INFO] Downloading: http://repository.mygrid.org.uk/artifactory/repo/org/codehaus/plexus/plexus-compilers/2.2/plexus-compilers-2.2.pom
[INFO] Downloaded: http://repository.mygrid.org.uk/artifactory/repo/org/codehaus/plexus/plexus-compilers/2.2/plexus-compilers-2.2.pom (2 KB at 46.6 KB/sec)
[INFO] Downloading: http://repository.mygrid.org.uk/artifactory/repo/org/codehaus/plexus/plexus-container-default/1.5.5/plexus-container-default-1.5.5.pom
[INFO] Downloaded: http://repository.mygrid.org.uk/artifactory/repo/org/codehaus/plexus/plexus-container-default/1.5.5/plexus-container-default-1.5.5.pom (3 KB at 56.1 KB/sec)
[INFO] Downloading: http://repository.mygrid.org.uk/artifactory/repo/org/codehaus/plexus/plexus-utils/1.4.5/plexus-utils-1.4.5.pom
[INFO] Downloaded: http://repository.mygrid.org.uk/artifactory/repo/org/codehaus/plexus/plexus-utils/1.4.5/plexus-utils-1.4.5.pom (3 KB at 53.9 KB/sec)
[INFO] Downloading: http://repository.mygrid.org.uk/artifactory/repo/org/codehaus/plexus/plexus-classworlds/2.2.2/plexus-classworlds-2.2.2.pom
[INFO] Downloaded: http://repository.mygrid.org.uk/artifactory/repo/org/codehaus/plexus/plexus-classworlds/2.2.2/plexus-classworlds-2.2.2.pom (4 KB at 109.4 KB/sec)
[INFO] Downloading: http://repository.mygrid.org.uk/artifactory/repo/org/apache/xbean/xbean-reflect/3.4/xbean-reflect-3.4.pom
[INFO] Downloaded: http://repository.mygrid.org.uk/artifactory/repo/org/apache/xbean/xbean-reflect/3.4/xbean-reflect-3.4.pom (3 KB at 70.3 KB/sec)
[INFO] Downloading: http://repository.mygrid.org.uk/artifactory/repo/org/apache/xbean/xbean/3.4/xbean-3.4.pom
[INFO] Downloaded: http://repository.mygrid.org.uk/artifactory/repo/org/apache/xbean/xbean/3.4/xbean-3.4.pom (19 KB at 335.1 KB/sec)
[INFO] Downloading: http://repository.mygrid.org.uk/artifactory/repo/log4j/log4j/1.2.12/log4j-1.2.12.pom
[INFO] Downloaded: http://repository.mygrid.org.uk/artifactory/repo/log4j/log4j/1.2.12/log4j-1.2.12.pom (145 B at 4.3 KB/sec)
[INFO] Downloading: http://repository.mygrid.org.uk/artifactory/repo/commons-logging/commons-logging-api/1.1/commons-logging-api-1.1.pom
[INFO] Downloaded: http://repository.mygrid.org.uk/artifactory/repo/commons-logging/commons-logging-api/1.1/commons-logging-api-1.1.pom (6 KB at 163.2 KB/sec)
[INFO] Downloading: http://repository.mygrid.org.uk/artifactory/repo/com/google/collections/google-collections/1.0/google-collections-1.0.pom
[INFO] Downloaded: http://repository.mygrid.org.uk/artifactory/repo/com/google/collections/google-collections/1.0/google-collections-1.0.pom (3 KB at 73.3 KB/sec)
[INFO] Downloading: http://repository.mygrid.org.uk/artifactory/repo/com/google/google/1/google-1.pom
[INFO] Downloaded: http://repository.mygrid.org.uk/artifactory/repo/com/google/google/1/google-1.pom (2 KB at 63.2 KB/sec)
[INFO] Downloading: http://repository.mygrid.org.uk/artifactory/repo/junit/junit/3.8.2/junit-3.8.2.pom
[INFO] Downloaded: http://repository.mygrid.org.uk/artifactory/repo/junit/junit/3.8.2/junit-3.8.2.pom (747 B at 27.0 KB/sec)
[INFO] Downloading: http://repository.mygrid.org.uk/artifactory/repo/org/codehaus/plexus/plexus-utils/1.5.1/plexus-utils-1.5.1.jar
[INFO] Downloading: http://repository.mygrid.org.uk/artifactory/repo/org/apache/maven/shared/maven-shared-utils/0.1/maven-shared-utils-0.1.jar
[INFO] Downloading: http://repository.mygrid.org.uk/artifactory/repo/com/google/code/findbugs/jsr305/2.0.1/jsr305-2.0.1.jar
[INFO] Downloading: http://repository.mygrid.org.uk/artifactory/repo/org/apache/maven/shared/maven-shared-incremental/1.1/maven-shared-incremental-1.1.jar
[INFO] Downloading: http://repository.mygrid.org.uk/artifactory/repo/org/codehaus/plexus/plexus-component-annotations/1.5.5/plexus-component-annotations-1.5.5.jar
[INFO] Downloaded: http://repository.mygrid.org.uk/artifactory/repo/com/google/code/findbugs/jsr305/2.0.1/jsr305-2.0.1.jar (32 KB at 399.0 KB/sec)
[INFO] Downloading: http://repository.mygrid.org.uk/artifactory/repo/org/codehaus/plexus/plexus-compiler-api/2.2/plexus-compiler-api-2.2.jar
[INFO] Downloaded: http://repository.mygrid.org.uk/artifactory/repo/org/codehaus/plexus/plexus-utils/1.5.1/plexus-utils-1.5.1.jar (206 KB at 1645.9 KB/sec)
[INFO] Downloaded: http://repository.mygrid.org.uk/artifactory/repo/org/apache/maven/shared/maven-shared-utils/0.1/maven-shared-utils-0.1.jar (151 KB at 1226.8 KB/sec)
[INFO] Downloaded: http://repository.mygrid.org.uk/artifactory/repo/org/apache/maven/shared/maven-shared-incremental/1.1/maven-shared-incremental-1.1.jar (14 KB at 145.3 KB/sec)
[INFO] Downloading: http://repository.mygrid.org.uk/artifactory/repo/org/codehaus/plexus/plexus-compiler-manager/2.2/plexus-compiler-manager-2.2.jar
[INFO] Downloading: http://repository.mygrid.org.uk/artifactory/repo/org/codehaus/plexus/plexus-compiler-javac/2.2/plexus-compiler-javac-2.2.jar
[INFO] Downloading: http://repository.mygrid.org.uk/artifactory/repo/org/apache/xbean/xbean-reflect/3.4/xbean-reflect-3.4.jar
[INFO] Downloaded: http://repository.mygrid.org.uk/artifactory/repo/org/codehaus/plexus/plexus-compiler-api/2.2/plexus-compiler-api-2.2.jar (25 KB at 239.3 KB/sec)
[INFO] Downloading: http://repository.mygrid.org.uk/artifactory/repo/log4j/log4j/1.2.12/log4j-1.2.12.jar
[INFO] Downloaded: http://repository.mygrid.org.uk/artifactory/repo/org/codehaus/plexus/plexus-component-annotations/1.5.5/plexus-component-annotations-1.5.5.jar (5 KB at 32.4 KB/sec)
[INFO] Downloading: http://repository.mygrid.org.uk/artifactory/repo/commons-logging/commons-logging-api/1.1/commons-logging-api-1.1.jar
[INFO] Downloaded: http://repository.mygrid.org.uk/artifactory/repo/org/codehaus/plexus/plexus-compiler-javac/2.2/plexus-compiler-javac-2.2.jar (19 KB at 343.1 KB/sec)
[INFO] Downloading: http://repository.mygrid.org.uk/artifactory/repo/com/google/collections/google-collections/1.0/google-collections-1.0.jar
[INFO] Downloaded: http://repository.mygrid.org.uk/artifactory/repo/org/codehaus/plexus/plexus-compiler-manager/2.2/plexus-compiler-manager-2.2.jar (5 KB at 44.1 KB/sec)
[INFO] Downloading: http://repository.mygrid.org.uk/artifactory/repo/junit/junit/3.8.2/junit-3.8.2.jar
[INFO] Downloaded: http://repository.mygrid.org.uk/artifactory/repo/commons-logging/commons-logging-api/1.1/commons-logging-api-1.1.jar (44 KB at 458.4 KB/sec)
[INFO] Downloaded: http://repository.mygrid.org.uk/artifactory/repo/org/apache/xbean/xbean-reflect/3.4/xbean-reflect-3.4.jar (131 KB at 1098.2 KB/sec)
[INFO] Downloaded: http://repository.mygrid.org.uk/artifactory/repo/junit/junit/3.8.2/junit-3.8.2.jar (118 KB at 1369.9 KB/sec)
[INFO] Downloaded: http://repository.mygrid.org.uk/artifactory/repo/log4j/log4j/1.2.12/log4j-1.2.12.jar (350 KB at 1998.2 KB/sec)
[INFO] Downloaded: http://repository.mygrid.org.uk/artifactory/repo/com/google/collections/google-collections/1.0/google-collections-1.0.jar (625 KB at 3186.7 KB/sec)
[INFO] Changes detected - recompiling the module!
[INFO] Compiling 10 source files to /local/jenkins/jobs/taverna-engine-credential-manager-maintenance/workspace/credential-manager/target/classes
[INFO] 
[INFO] --- maven-resources-plugin:2.6:testResources (default-testResources) @ credential-manager ---
[INFO] Using 'UTF-8' encoding to copy filtered resources.
[INFO] Copying 3 resources
[INFO] 
[INFO] --- maven-compiler-plugin:3.1:testCompile (default-testCompile) @ credential-manager ---
[INFO] Changes detected - recompiling the module!
[INFO] Compiling 4 source files to /local/jenkins/jobs/taverna-engine-credential-manager-maintenance/workspace/credential-manager/target/test-classes
[INFO] 
[INFO] --- maven-surefire-plugin:2.17:test (default-test) @ credential-manager ---
[INFO] Downloading: http://repository.mygrid.org.uk/artifactory/repo/org/apache/maven/surefire/maven-surefire-common/2.17/maven-surefire-common-2.17.pom
[INFO] Downloaded: http://repository.mygrid.org.uk/artifactory/repo/org/apache/maven/surefire/maven-surefire-common/2.17/maven-surefire-common-2.17.pom (6 KB at 1.5 KB/sec)
[INFO] Downloading: http://repository.mygrid.org.uk/artifactory/repo/org/apache/maven/plugin-tools/maven-plugin-annotations/3.2/maven-plugin-annotations-3.2.pom
[INFO] Downloaded: http://repository.mygrid.org.uk/artifactory/repo/org/apache/maven/plugin-tools/maven-plugin-annotations/3.2/maven-plugin-annotations-3.2.pom (2 KB at 17.2 KB/sec)
[INFO] Downloading: http://repository.mygrid.org.uk/artifactory/repo/org/apache/maven/plugin-tools/maven-plugin-tools/3.2/maven-plugin-tools-3.2.pom
[INFO] Downloaded: http://repository.mygrid.org.uk/artifactory/repo/org/apache/maven/plugin-tools/maven-plugin-tools/3.2/maven-plugin-tools-3.2.pom (17 KB at 107.6 KB/sec)
[INFO] Downloading: http://repository.mygrid.org.uk/artifactory/repo/org/apache/maven/surefire/surefire-api/2.17/surefire-api-2.17.pom
[INFO] Downloaded: http://repository.mygrid.org.uk/artifactory/repo/org/apache/maven/surefire/surefire-api/2.17/surefire-api-2.17.pom (3 KB at 19.1 KB/sec)
[INFO] Downloading: http://repository.mygrid.org.uk/artifactory/repo/org/apache/maven/surefire/surefire-booter/2.17/surefire-booter-2.17.pom
[INFO] Downloaded: http://repository.mygrid.org.uk/artifactory/repo/org/apache/maven/surefire/surefire-booter/2.17/surefire-booter-2.17.pom (3 KB at 2.4 KB/sec)
[INFO] Downloading: http://repository.mygrid.org.uk/artifactory/repo/org/apache/maven/reporting/maven-reporting-api/2.0.9/maven-reporting-api-2.0.9.pom
[INFO] Downloaded: http://repository.mygrid.org.uk/artifactory/repo/org/apache/maven/reporting/maven-reporting-api/2.0.9/maven-reporting-api-2.0.9.pom (2 KB at 4.2 KB/sec)
[INFO] Downloading: http://repository.mygrid.org.uk/artifactory/repo/org/apache/maven/reporting/maven-reporting/2.0.9/maven-reporting-2.0.9.pom
[INFO] Downloaded: http://repository.mygrid.org.uk/artifactory/repo/org/apache/maven/reporting/maven-reporting/2.0.9/maven-reporting-2.0.9.pom (2 KB at 16.6 KB/sec)
[INFO] Downloading: http://repository.mygrid.org.uk/artifactory/repo/org/apache/maven/maven-toolchain/2.0.9/maven-toolchain-2.0.9.pom
[INFO] Downloaded: http://repository.mygrid.org.uk/artifactory/repo/org/apache/maven/maven-toolchain/2.0.9/maven-toolchain-2.0.9.pom (4 KB at 53.0 KB/sec)
[INFO] Downloading: http://repository.mygrid.org.uk/artifactory/repo/org/apache/commons/commons-lang3/3.1/commons-lang3-3.1.pom
[INFO] Downloaded: http://repository.mygrid.org.uk/artifactory/repo/org/apache/commons/commons-lang3/3.1/commons-lang3-3.1.pom (17 KB at 72.2 KB/sec)
[INFO] Downloading: http://repository.mygrid.org.uk/artifactory/repo/org/apache/commons/commons-parent/22/commons-parent-22.pom
[INFO] Downloaded: http://repository.mygrid.org.uk/artifactory/repo/org/apache/commons/commons-parent/22/commons-parent-22.pom (41 KB at 40.6 KB/sec)
[INFO] Downloading: http://repository.mygrid.org.uk/artifactory/repo/org/apache/apache/9/apache-9.pom
[INFO] Downloaded: http://repository.mygrid.org.uk/artifactory/repo/org/apache/apache/9/apache-9.pom (15 KB at 42.8 KB/sec)
[INFO] Downloading: http://repository.mygrid.org.uk/artifactory/repo/org/apache/maven/surefire/maven-surefire-common/2.17/maven-surefire-common-2.17.jar
[INFO] Downloading: http://repository.mygrid.org.uk/artifactory/repo/org/apache/maven/surefire/surefire-booter/2.17/surefire-booter-2.17.jar
[INFO] Downloading: http://repository.mygrid.org.uk/artifactory/repo/org/apache/maven/reporting/maven-reporting-api/2.0.9/maven-reporting-api-2.0.9.jar
[INFO] Downloading: http://repository.mygrid.org.uk/artifactory/repo/org/apache/commons/commons-lang3/3.1/commons-lang3-3.1.jar
[INFO] Downloading: http://repository.mygrid.org.uk/artifactory/repo/org/apache/maven/surefire/surefire-api/2.17/surefire-api-2.17.jar
[INFO] Downloaded: http://repository.mygrid.org.uk/artifactory/repo/org/apache/maven/reporting/maven-reporting-api/2.0.9/maven-reporting-api-2.0.9.jar (10 KB at 71.7 KB/sec)
[INFO] Downloading: http://repository.mygrid.org.uk/artifactory/repo/org/apache/maven/plugin-tools/maven-plugin-annotations/3.2/maven-plugin-annotations-3.2.jar
[INFO] Downloaded: http://repository.mygrid.org.uk/artifactory/repo/org/apache/maven/surefire/surefire-booter/2.17/surefire-booter-2.17.jar (39 KB at 213.5 KB/sec)
[INFO] Downloaded: http://repository.mygrid.org.uk/artifactory/repo/org/apache/maven/plugin-tools/maven-plugin-annotations/3.2/maven-plugin-annotations-3.2.jar (15 KB at 95.0 KB/sec)
[INFO] Downloaded: http://repository.mygrid.org.uk/artifactory/repo/org/apache/maven/surefire/maven-surefire-common/2.17/maven-surefire-common-2.17.jar (260 KB at 822.8 KB/sec)
[INFO] Downloaded: http://repository.mygrid.org.uk/artifactory/repo/org/apache/maven/surefire/surefire-api/2.17/surefire-api-2.17.jar (144 KB at 486.0 KB/sec)
[INFO] Downloaded: http://repository.mygrid.org.uk/artifactory/repo/org/apache/commons/commons-lang3/3.1/commons-lang3-3.1.jar (309 KB at 794.9 KB/sec)
[INFO] Surefire report directory: /local/jenkins/jobs/taverna-engine-credential-manager-maintenance/workspace/credential-manager/target/surefire-reports
[INFO] Downloading: http://repository.mygrid.org.uk/artifactory/repo/org/apache/maven/surefire/surefire-junit4/2.17/surefire-junit4-2.17.pom
[INFO] Downloaded: http://repository.mygrid.org.uk/artifactory/repo/org/apache/maven/surefire/surefire-junit4/2.17/surefire-junit4-2.17.pom (3 KB at 3.7 KB/sec)
[INFO] Downloading: http://repository.mygrid.org.uk/artifactory/repo/org/apache/maven/surefire/surefire-providers/2.17/surefire-providers-2.17.pom
[INFO] Downloaded: http://repository.mygrid.org.uk/artifactory/repo/org/apache/maven/surefire/surefire-providers/2.17/surefire-providers-2.17.pom (3 KB at 22.3 KB/sec)
[INFO] Downloading: http://repository.mygrid.org.uk/artifactory/repo/org/apache/maven/surefire/surefire-junit4/2.17/surefire-junit4-2.17.jar
[INFO] Downloaded: http://repository.mygrid.org.uk/artifactory/repo/org/apache/maven/surefire/surefire-junit4/2.17/surefire-junit4-2.17.jar (63 KB at 1281.8 KB/sec)

-------------------------------------------------------
 T E S T S
-------------------------------------------------------
Running net.sf.taverna.t2.security.credentialmanager.BasicAuthTest
2014-10-27 15:53:16.367:INFO::Logging to STDERR via org.mortbay.log.StdErrLog
2014-10-27 15:53:16.537:INFO::jetty-6.1.24
2014-10-27 15:53:16.879:INFO::NO JSP Support for /, did not find org.apache.jasper.servlet.JspServlet
2014-10-27 15:53:17.265:INFO::Started SelectChannelConnector@0.0.0.0:9638
log4j:WARN No appenders could be found for logger (net.sf.taverna.raven.log.Log).
log4j:WARN Please initialize the log4j system properly.
log4j:WARN See http://logging.apache.org/log4j/1.2/faq.html#noconfig for more info.
ApplicationConfig could not determine application name, using unknownApplication-38caac96-b5ec-4853-abfc-1b687ffd90ea
ApplicationConfig could not determine application name, using unknownApplication-38caac96-b5ec-4853-abfc-1b687ffd90ea
2014-10-27 15:53:29.588:WARN::AUTH FAILURE: user basicUser
2014-10-27 15:53:29.594:WARN::AUTH FAILURE: user basicUser
2014-10-27 15:53:29.598:WARN::AUTH FAILURE: user basicUser
2014-10-27 15:53:29.621:WARN::AUTH FAILURE: user basicUser
2014-10-27 15:53:29.638:WARN::AUTH FAILURE: user basicUser
2014-10-27 15:53:29.650:WARN::AUTH FAILURE: user basicUser
2014-10-27 15:53:29.659:WARN::AUTH FAILURE: user basicUser
2014-10-27 15:53:29.669:WARN::AUTH FAILURE: user basicUser
2014-10-27 15:53:29.678:WARN::AUTH FAILURE: user basicUser
2014-10-27 15:53:29.691:WARN::AUTH FAILURE: user basicUser
2014-10-27 15:53:29.695:WARN::AUTH FAILURE: user basicUser
2014-10-27 15:53:29.707:WARN::AUTH FAILURE: user basicUser
2014-10-27 15:53:29.713:WARN::AUTH FAILURE: user basicUser
2014-10-27 15:53:29.718:WARN::AUTH FAILURE: user basicUser
2014-10-27 15:53:29.730:WARN::AUTH FAILURE: user basicUser
2014-10-27 15:53:29.741:WARN::AUTH FAILURE: user basicUser
2014-10-27 15:53:29.751:WARN::AUTH FAILURE: user basicUser
2014-10-27 15:53:29.754:WARN::AUTH FAILURE: user basicUser
2014-10-27 15:53:29.769:WARN::AUTH FAILURE: user basicUser
2014-10-27 15:53:30.069:WARN::AUTH FAILURE: user basicUser
2014-10-27 15:53:30.090:WARN::AUTH FAILURE: user basicUser
2014-10-27 15:53:30.115:WARN::AUTH FAILURE: user basicUser
2014-10-27 15:53:30.143:WARN::AUTH FAILURE: user basicUser
2014-10-27 15:53:30.172:WARN::AUTH FAILURE: user basicUser
2014-10-27 15:53:30.197:WARN::AUTH FAILURE: user basicUser
2014-10-27 15:53:30.228:WARN::AUTH FAILURE: user basicUser
2014-10-27 15:53:30.258:WARN::AUTH FAILURE: user basicUser
2014-10-27 15:53:30.273:WARN::AUTH FAILURE: user basicUser
2014-10-27 15:53:30.281:WARN::AUTH FAILURE: user basicUser
2014-10-27 15:53:30.289:WARN::AUTH FAILURE: user basicUser
2014-10-27 15:53:30.320:WARN::AUTH FAILURE: user basicUser
2014-10-27 15:53:30.332:WARN::AUTH FAILURE: user basicUser
2014-10-27 15:53:30.362:WARN::AUTH FAILURE: user basicUser
2014-10-27 15:53:30.384:WARN::AUTH FAILURE: user basicUser
2014-10-27 15:53:30.420:WARN::AUTH FAILURE: user basicUser
2014-10-27 15:53:30.467:WARN::AUTH FAILURE: user basicUser
2014-10-27 15:53:30.495:WARN::AUTH FAILURE: user basicUser
2014-10-27 15:53:30.530:WARN::AUTH FAILURE: user basicUser
2014-10-27 15:53:30.589:INFO::Stopped SelectChannelConnector@0.0.0.0:9638
Tests run: 6, Failures: 0, Errors: 0, Skipped: 0, Time elapsed: 14.494 sec - in net.sf.taverna.t2.security.credentialmanager.BasicAuthTest
Running net.sf.taverna.t2.security.credentialmanager.PossibleLookupsTest
Tests run: 8, Failures: 0, Errors: 0, Skipped: 0, Time elapsed: 0.001 sec - in net.sf.taverna.t2.security.credentialmanager.PossibleLookupsTest

Results :

Tests run: 14, Failures: 0, Errors: 0, Skipped: 0

[JENKINS] Recording test results
[INFO] 
[INFO] --- maven-jar-plugin:2.4:jar (default-jar) @ credential-manager ---
[INFO] Building jar: /local/jenkins/jobs/taverna-engine-credential-manager-maintenance/workspace/credential-manager/target/credential-manager-1.6-SNAPSHOT.jar
[INFO] 
[INFO] >>> maven-source-plugin:2.2.1:jar (default) @ credential-manager >>>
[WARNING] Failed to getClass for org.apache.maven.plugin.source.SourceJarMojo
[INFO] 
[INFO] <<< maven-source-plugin:2.2.1:jar (default) @ credential-manager <<<
[INFO] 
[INFO] --- maven-source-plugin:2.2.1:jar (default) @ credential-manager ---
[INFO] Building jar: /local/jenkins/jobs/taverna-engine-credential-manager-maintenance/workspace/credential-manager/target/credential-manager-1.6-SNAPSHOT-sources.jar
[INFO] 
[INFO] >>> maven-source-plugin:2.2.1:test-jar (default) @ credential-manager >>>
[WARNING] Failed to getClass for org.apache.maven.plugin.source.TestSourceJarMojo
[INFO] 
[INFO] <<< maven-source-plugin:2.2.1:test-jar (default) @ credential-manager <<<
[INFO] 
[INFO] --- maven-source-plugin:2.2.1:test-jar (default) @ credential-manager ---
[INFO] Building jar: /local/jenkins/jobs/taverna-engine-credential-manager-maintenance/workspace/credential-manager/target/credential-manager-1.6-SNAPSHOT-test-sources.jar
[INFO] 
[INFO] --- maven-jar-plugin:2.4:test-jar (default) @ credential-manager ---
[INFO] Building jar: /local/jenkins/jobs/taverna-engine-credential-manager-maintenance/workspace/credential-manager/target/credential-manager-1.6-SNAPSHOT-tests.jar
[INFO] 
[INFO] --- maven-install-plugin:2.4:install (default-install) @ credential-manager ---
[INFO] Installing /local/jenkins/jobs/taverna-engine-credential-manager-maintenance/workspace/credential-manager/target/credential-manager-1.6-SNAPSHOT.jar to /local/jenkins/jobs/taverna-engine-credential-manager-maintenance/workspace/.repository/net/sf/taverna/t2/security/credential-manager/1.6-SNAPSHOT/credential-manager-1.6-SNAPSHOT.jar
[INFO] Installing /local/jenkins/jobs/taverna-engine-credential-manager-maintenance/workspace/credential-manager/pom.xml to /local/jenkins/jobs/taverna-engine-credential-manager-maintenance/workspace/.repository/net/sf/taverna/t2/security/credential-manager/1.6-SNAPSHOT/credential-manager-1.6-SNAPSHOT.pom
[INFO] Installing /local/jenkins/jobs/taverna-engine-credential-manager-maintenance/workspace/credential-manager/target/credential-manager-1.6-SNAPSHOT-sources.jar to /local/jenkins/jobs/taverna-engine-credential-manager-maintenance/workspace/.repository/net/sf/taverna/t2/security/credential-manager/1.6-SNAPSHOT/credential-manager-1.6-SNAPSHOT-sources.jar
[INFO] Installing /local/jenkins/jobs/taverna-engine-credential-manager-maintenance/workspace/credential-manager/target/credential-manager-1.6-SNAPSHOT-test-sources.jar to /local/jenkins/jobs/taverna-engine-credential-manager-maintenance/workspace/.repository/net/sf/taverna/t2/security/credential-manager/1.6-SNAPSHOT/credential-manager-1.6-SNAPSHOT-test-sources.jar
[INFO] Installing /local/jenkins/jobs/taverna-engine-credential-manager-maintenance/workspace/credential-manager/target/credential-manager-1.6-SNAPSHOT-tests.jar to /local/jenkins/jobs/taverna-engine-credential-manager-maintenance/workspace/.repository/net/sf/taverna/t2/security/credential-manager/1.6-SNAPSHOT/credential-manager-1.6-SNAPSHOT-tests.jar