SuccessConsole Output

[INFO]                                                                         
[INFO] ------------------------------------------------------------------------
[INFO] Building Credential manager 1.6-SNAPSHOT
[INFO] ------------------------------------------------------------------------
[INFO] Downloading: http://repository.mygrid.org.uk/artifactory/repo/net/sf/taverna/t2/infrastructure/spi-discovery-api/2.6-SNAPSHOT/maven-metadata.xml
[INFO] Downloaded: http://repository.mygrid.org.uk/artifactory/repo/net/sf/taverna/t2/infrastructure/spi-discovery-api/2.6-SNAPSHOT/maven-metadata.xml (2 KB at 3.9 KB/sec)
[INFO] Downloading: http://repository.mygrid.org.uk/artifactory/repo/net/sf/taverna/t2/infrastructure/spi-discovery-api/2.6-SNAPSHOT/spi-discovery-api-2.6-20141027.145407-1.pom
[INFO] Downloaded: http://repository.mygrid.org.uk/artifactory/repo/net/sf/taverna/t2/infrastructure/spi-discovery-api/2.6-SNAPSHOT/spi-discovery-api-2.6-20141027.145407-1.pom (2 KB at 28.8 KB/sec)
[INFO] Downloading: http://repository.mygrid.org.uk/artifactory/repo/net/sf/taverna/t2/infrastructure/2.6-SNAPSHOT/maven-metadata.xml
[INFO] Downloaded: http://repository.mygrid.org.uk/artifactory/repo/net/sf/taverna/t2/infrastructure/2.6-SNAPSHOT/maven-metadata.xml (802 B at 2.3 KB/sec)
[INFO] Downloading: http://repository.mygrid.org.uk/artifactory/repo/net/sf/taverna/t2/infrastructure/2.6-SNAPSHOT/infrastructure-2.6-20141027.145407-1.pom
[INFO] Downloaded: http://repository.mygrid.org.uk/artifactory/repo/net/sf/taverna/t2/infrastructure/2.6-SNAPSHOT/infrastructure-2.6-20141027.145407-1.pom (4 KB at 82.4 KB/sec)
[INFO] Downloading: http://repository.mygrid.org.uk/artifactory/repo/net/sf/taverna/t2/lang/observer/1.6-SNAPSHOT/maven-metadata.xml
[INFO] Downloaded: http://repository.mygrid.org.uk/artifactory/repo/net/sf/taverna/t2/lang/observer/1.6-SNAPSHOT/maven-metadata.xml (2 KB at 26.8 KB/sec)
[INFO] Downloading: http://repository.mygrid.org.uk/artifactory/repo/net/sf/taverna/t2/lang/observer/1.6-SNAPSHOT/observer-1.6-20141027.145309-1.pom
[INFO] Downloaded: http://repository.mygrid.org.uk/artifactory/repo/net/sf/taverna/t2/lang/observer/1.6-SNAPSHOT/observer-1.6-20141027.145309-1.pom (833 B at 13.8 KB/sec)
[INFO] Downloading: http://repository.mygrid.org.uk/artifactory/repo/net/sf/taverna/t2/lang/1.6-SNAPSHOT/maven-metadata.xml
[INFO] Downloaded: http://repository.mygrid.org.uk/artifactory/repo/net/sf/taverna/t2/lang/1.6-SNAPSHOT/maven-metadata.xml (792 B at 16.1 KB/sec)
[INFO] Downloading: http://repository.mygrid.org.uk/artifactory/repo/net/sf/taverna/t2/lang/1.6-SNAPSHOT/lang-1.6-20141027.145309-1.pom
[INFO] Downloaded: http://repository.mygrid.org.uk/artifactory/repo/net/sf/taverna/t2/lang/1.6-SNAPSHOT/lang-1.6-20141027.145309-1.pom (3 KB at 47.3 KB/sec)
[INFO] Downloading: http://repository.mygrid.org.uk/artifactory/repo/net/sf/taverna/t2/infrastructure/raven/2.6-SNAPSHOT/maven-metadata.xml
[INFO] Downloaded: http://repository.mygrid.org.uk/artifactory/repo/net/sf/taverna/t2/infrastructure/raven/2.6-SNAPSHOT/maven-metadata.xml (2 KB at 4.0 KB/sec)
[INFO] Downloading: http://repository.mygrid.org.uk/artifactory/repo/net/sf/taverna/t2/infrastructure/raven/2.6-SNAPSHOT/raven-2.6-20141027.145407-1.pom
[INFO] Downloaded: http://repository.mygrid.org.uk/artifactory/repo/net/sf/taverna/t2/infrastructure/raven/2.6-SNAPSHOT/raven-2.6-20141027.145407-1.pom (2 KB at 15.8 KB/sec)
[INFO] Downloading: http://repository.mygrid.org.uk/artifactory/repo/net/sf/taverna/t2/infrastructure/raven-log4j/2.6-SNAPSHOT/maven-metadata.xml
[INFO] Downloaded: http://repository.mygrid.org.uk/artifactory/repo/net/sf/taverna/t2/infrastructure/raven-log4j/2.6-SNAPSHOT/maven-metadata.xml (2 KB at 3.4 KB/sec)
[INFO] Downloading: http://repository.mygrid.org.uk/artifactory/repo/net/sf/taverna/t2/infrastructure/raven-log4j/2.6-SNAPSHOT/raven-log4j-2.6-20141027.145407-1.pom
[INFO] Downloaded: http://repository.mygrid.org.uk/artifactory/repo/net/sf/taverna/t2/infrastructure/raven-log4j/2.6-SNAPSHOT/raven-log4j-2.6-20141027.145407-1.pom (952 B at 25.1 KB/sec)
[INFO] Downloading: http://repository.mygrid.org.uk/artifactory/repo/net/sf/taverna/t2/infrastructure/appconfig/2.6-SNAPSHOT/maven-metadata.xml
[INFO] Downloaded: http://repository.mygrid.org.uk/artifactory/repo/net/sf/taverna/t2/infrastructure/appconfig/2.6-SNAPSHOT/maven-metadata.xml (2 KB at 4.1 KB/sec)
[INFO] Downloading: http://repository.mygrid.org.uk/artifactory/repo/net/sf/taverna/t2/infrastructure/appconfig/2.6-SNAPSHOT/appconfig-2.6-20141027.145407-1.pom
[INFO] Downloaded: http://repository.mygrid.org.uk/artifactory/repo/net/sf/taverna/t2/infrastructure/appconfig/2.6-SNAPSHOT/appconfig-2.6-20141027.145407-1.pom (2 KB at 40.0 KB/sec)
[INFO] Downloading: http://repository.mygrid.org.uk/artifactory/repo/net/sf/taverna/t2/infrastructure/launcher-api/2.6-SNAPSHOT/maven-metadata.xml
[INFO] Downloaded: http://repository.mygrid.org.uk/artifactory/repo/net/sf/taverna/t2/infrastructure/launcher-api/2.6-SNAPSHOT/maven-metadata.xml (2 KB at 3.4 KB/sec)
[INFO] Downloading: http://repository.mygrid.org.uk/artifactory/repo/net/sf/taverna/t2/infrastructure/launcher-api/2.6-SNAPSHOT/launcher-api-2.6-20141027.145407-1.pom
[INFO] Downloaded: http://repository.mygrid.org.uk/artifactory/repo/net/sf/taverna/t2/infrastructure/launcher-api/2.6-SNAPSHOT/launcher-api-2.6-20141027.145407-1.pom (549 B at 12.8 KB/sec)
[INFO] Downloading: http://repository.mygrid.org.uk/artifactory/repo/net/sf/taverna/t2/infrastructure/prelauncher/2.6-SNAPSHOT/maven-metadata.xml
[INFO] Downloaded: http://repository.mygrid.org.uk/artifactory/repo/net/sf/taverna/t2/infrastructure/prelauncher/2.6-SNAPSHOT/maven-metadata.xml (2 KB at 3.9 KB/sec)
[INFO] Downloading: http://repository.mygrid.org.uk/artifactory/repo/net/sf/taverna/t2/infrastructure/prelauncher/2.6-SNAPSHOT/prelauncher-2.6-20141027.145407-1.pom
[INFO] Downloaded: http://repository.mygrid.org.uk/artifactory/repo/net/sf/taverna/t2/infrastructure/prelauncher/2.6-SNAPSHOT/prelauncher-2.6-20141027.145407-1.pom (2 KB at 31.0 KB/sec)
[INFO] Downloading: http://repository.mygrid.org.uk/artifactory/repo/net/sf/taverna/t2/infrastructure/spi-discovery-api/2.6-SNAPSHOT/spi-discovery-api-2.6-20141027.145407-1.jar
[INFO] Downloading: http://repository.mygrid.org.uk/artifactory/repo/net/sf/taverna/t2/lang/observer/1.6-SNAPSHOT/observer-1.6-20141027.145309-1.jar
[INFO] Downloading: http://repository.mygrid.org.uk/artifactory/repo/net/sf/taverna/t2/infrastructure/raven/2.6-SNAPSHOT/raven-2.6-20141027.145407-1.jar
[INFO] Downloading: http://repository.mygrid.org.uk/artifactory/repo/net/sf/taverna/t2/infrastructure/raven-log4j/2.6-SNAPSHOT/raven-log4j-2.6-20141027.145407-1.jar
[INFO] Downloading: http://repository.mygrid.org.uk/artifactory/repo/net/sf/taverna/t2/infrastructure/appconfig/2.6-SNAPSHOT/appconfig-2.6-20141027.145407-1.jar
[INFO] Downloaded: http://repository.mygrid.org.uk/artifactory/repo/net/sf/taverna/t2/infrastructure/appconfig/2.6-SNAPSHOT/appconfig-2.6-20141027.145407-1.jar (29 KB at 252.1 KB/sec)
[INFO] Downloading: http://repository.mygrid.org.uk/artifactory/repo/net/sf/taverna/t2/infrastructure/launcher-api/2.6-SNAPSHOT/launcher-api-2.6-20141027.145407-1.jar
[INFO] Downloaded: http://repository.mygrid.org.uk/artifactory/repo/net/sf/taverna/t2/infrastructure/raven/2.6-SNAPSHOT/raven-2.6-20141027.145407-1.jar (85 KB at 393.0 KB/sec)
[INFO] Downloading: http://repository.mygrid.org.uk/artifactory/repo/net/sf/taverna/t2/infrastructure/prelauncher/2.6-SNAPSHOT/prelauncher-2.6-20141027.145407-1.jar
[INFO] Downloaded: http://repository.mygrid.org.uk/artifactory/repo/net/sf/taverna/t2/infrastructure/spi-discovery-api/2.6-SNAPSHOT/spi-discovery-api-2.6-20141027.145407-1.jar (6 KB at 23.0 KB/sec)
[INFO] Downloaded: http://repository.mygrid.org.uk/artifactory/repo/net/sf/taverna/t2/lang/observer/1.6-SNAPSHOT/observer-1.6-20141027.145309-1.jar (5 KB at 18.7 KB/sec)
[INFO] Downloaded: http://repository.mygrid.org.uk/artifactory/repo/net/sf/taverna/t2/infrastructure/raven-log4j/2.6-SNAPSHOT/raven-log4j-2.6-20141027.145407-1.jar (4 KB at 15.3 KB/sec)
[INFO] Downloaded: http://repository.mygrid.org.uk/artifactory/repo/net/sf/taverna/t2/infrastructure/launcher-api/2.6-SNAPSHOT/launcher-api-2.6-20141027.145407-1.jar (3 KB at 24.9 KB/sec)
[INFO] Downloaded: http://repository.mygrid.org.uk/artifactory/repo/net/sf/taverna/t2/infrastructure/prelauncher/2.6-SNAPSHOT/prelauncher-2.6-20141027.145407-1.jar (9 KB at 141.4 KB/sec)
[INFO] 
[INFO] --- maven-clean-plugin:2.5:clean (default-clean) @ credential-manager ---
[INFO] Deleting /var/lib/jenkins/workspace/taverna-engine-credential-manager-maintenance/credential-manager/target
[INFO] 
[INFO] --- maven-resources-plugin:2.6:resources (default-resources) @ credential-manager ---
[INFO] Using 'UTF-8' encoding to copy filtered resources.
[INFO] Copying 7 resources
[INFO] 
[INFO] --- maven-compiler-plugin:3.1:compile (default-compile) @ credential-manager ---
[INFO] Changes detected - recompiling the module!
[INFO] Compiling 10 source files to /var/lib/jenkins/workspace/taverna-engine-credential-manager-maintenance/credential-manager/target/classes
[INFO] 
[INFO] --- maven-resources-plugin:2.6:testResources (default-testResources) @ credential-manager ---
[INFO] Using 'UTF-8' encoding to copy filtered resources.
[INFO] Copying 3 resources
[INFO] 
[INFO] --- maven-compiler-plugin:3.1:testCompile (default-testCompile) @ credential-manager ---
[INFO] Changes detected - recompiling the module!
[INFO] Compiling 4 source files to /var/lib/jenkins/workspace/taverna-engine-credential-manager-maintenance/credential-manager/target/test-classes
[INFO] 
[INFO] --- maven-surefire-plugin:2.17:test (default-test) @ credential-manager ---
[INFO] Surefire report directory: /var/lib/jenkins/workspace/taverna-engine-credential-manager-maintenance/credential-manager/target/surefire-reports

-------------------------------------------------------
 T E S T S
-------------------------------------------------------
Running net.sf.taverna.t2.security.credentialmanager.PossibleLookupsTest
log4j:WARN No appenders could be found for logger (net.sf.taverna.raven.log.Log).
log4j:WARN Please initialize the log4j system properly.
log4j:WARN See http://logging.apache.org/log4j/1.2/faq.html#noconfig for more info.
Tests run: 8, Failures: 0, Errors: 0, Skipped: 0, Time elapsed: 0.611 sec - in net.sf.taverna.t2.security.credentialmanager.PossibleLookupsTest
Running net.sf.taverna.t2.security.credentialmanager.BasicAuthTest
2014-10-27 14:57:00.959:INFO::Logging to STDERR via org.mortbay.log.StdErrLog
2014-10-27 14:57:01.121:INFO::jetty-6.1.24
2014-10-27 14:57:01.414:INFO::NO JSP Support for /, did not find org.apache.jasper.servlet.JspServlet
2014-10-27 14:57:01.549:INFO::Started SelectChannelConnector@0.0.0.0:9638
ApplicationConfig could not determine application name, using unknownApplication-d0ca4527-d1c5-4502-946c-3b96e52ddf70
ApplicationConfig could not determine application name, using unknownApplication-d0ca4527-d1c5-4502-946c-3b96e52ddf70
2014-10-27 14:57:05.905:WARN::AUTH FAILURE: user basicUser
2014-10-27 14:57:05.925:WARN::AUTH FAILURE: user basicUser
2014-10-27 14:57:05.930:WARN::AUTH FAILURE: user basicUser
2014-10-27 14:57:05.935:WARN::AUTH FAILURE: user basicUser
2014-10-27 14:57:05.971:WARN::AUTH FAILURE: user basicUser
2014-10-27 14:57:05.976:WARN::AUTH FAILURE: user basicUser
2014-10-27 14:57:05.983:WARN::AUTH FAILURE: user basicUser
2014-10-27 14:57:05.988:WARN::AUTH FAILURE: user basicUser
2014-10-27 14:57:05.992:WARN::AUTH FAILURE: user basicUser
2014-10-27 14:57:06.018:WARN::AUTH FAILURE: user basicUser
2014-10-27 14:57:06.030:WARN::AUTH FAILURE: user basicUser
2014-10-27 14:57:06.034:WARN::AUTH FAILURE: user basicUser
2014-10-27 14:57:06.038:WARN::AUTH FAILURE: user basicUser
2014-10-27 14:57:06.042:WARN::AUTH FAILURE: user basicUser
2014-10-27 14:57:06.058:WARN::AUTH FAILURE: user basicUser
2014-10-27 14:57:06.071:WARN::AUTH FAILURE: user basicUser
2014-10-27 14:57:06.087:WARN::AUTH FAILURE: user basicUser
2014-10-27 14:57:06.097:WARN::AUTH FAILURE: user basicUser
2014-10-27 14:57:06.104:WARN::AUTH FAILURE: user basicUser
2014-10-27 14:57:06.268:WARN::AUTH FAILURE: user basicUser
2014-10-27 14:57:06.289:WARN::AUTH FAILURE: user basicUser
2014-10-27 14:57:06.306:WARN::AUTH FAILURE: user basicUser
2014-10-27 14:57:06.325:WARN::AUTH FAILURE: user basicUser
2014-10-27 14:57:06.333:WARN::AUTH FAILURE: user basicUser
2014-10-27 14:57:06.346:WARN::AUTH FAILURE: user basicUser
2014-10-27 14:57:06.357:WARN::AUTH FAILURE: user basicUser
2014-10-27 14:57:06.366:WARN::AUTH FAILURE: user basicUser
2014-10-27 14:57:06.374:WARN::AUTH FAILURE: user basicUser
2014-10-27 14:57:06.381:WARN::AUTH FAILURE: user basicUser
2014-10-27 14:57:06.388:WARN::AUTH FAILURE: user basicUser
2014-10-27 14:57:06.396:WARN::AUTH FAILURE: user basicUser
2014-10-27 14:57:06.404:WARN::AUTH FAILURE: user basicUser
2014-10-27 14:57:06.420:WARN::AUTH FAILURE: user basicUser
2014-10-27 14:57:06.427:WARN::AUTH FAILURE: user basicUser
2014-10-27 14:57:06.465:WARN::AUTH FAILURE: user basicUser
2014-10-27 14:57:06.483:WARN::AUTH FAILURE: user basicUser
2014-10-27 14:57:06.491:WARN::AUTH FAILURE: user basicUser
2014-10-27 14:57:06.503:WARN::AUTH FAILURE: user basicUser
2014-10-27 14:57:06.526:INFO::Stopped SelectChannelConnector@0.0.0.0:9638
Tests run: 6, Failures: 0, Errors: 0, Skipped: 0, Time elapsed: 5.829 sec - in net.sf.taverna.t2.security.credentialmanager.BasicAuthTest

Results :

Tests run: 14, Failures: 0, Errors: 0, Skipped: 0

[JENKINS] Recording test results
[INFO] 
[INFO] --- maven-jar-plugin:2.4:jar (default-jar) @ credential-manager ---
[INFO] Building jar: /var/lib/jenkins/workspace/taverna-engine-credential-manager-maintenance/credential-manager/target/credential-manager-1.6-SNAPSHOT.jar
[INFO] 
[INFO] >>> maven-source-plugin:2.2.1:jar (default) @ credential-manager >>>
[WARNING] Failed to getClass for org.apache.maven.plugin.source.SourceJarMojo
[INFO] 
[INFO] <<< maven-source-plugin:2.2.1:jar (default) @ credential-manager <<<
[INFO] 
[INFO] --- maven-source-plugin:2.2.1:jar (default) @ credential-manager ---
[INFO] Building jar: /var/lib/jenkins/workspace/taverna-engine-credential-manager-maintenance/credential-manager/target/credential-manager-1.6-SNAPSHOT-sources.jar
[INFO] 
[INFO] >>> maven-source-plugin:2.2.1:test-jar (default) @ credential-manager >>>
[WARNING] Failed to getClass for org.apache.maven.plugin.source.TestSourceJarMojo
[INFO] 
[INFO] <<< maven-source-plugin:2.2.1:test-jar (default) @ credential-manager <<<
[INFO] 
[INFO] --- maven-source-plugin:2.2.1:test-jar (default) @ credential-manager ---
[INFO] Building jar: /var/lib/jenkins/workspace/taverna-engine-credential-manager-maintenance/credential-manager/target/credential-manager-1.6-SNAPSHOT-test-sources.jar
[INFO] 
[INFO] --- maven-jar-plugin:2.4:test-jar (default) @ credential-manager ---
[INFO] Building jar: /var/lib/jenkins/workspace/taverna-engine-credential-manager-maintenance/credential-manager/target/credential-manager-1.6-SNAPSHOT-tests.jar
[INFO] 
[INFO] --- maven-install-plugin:2.4:install (default-install) @ credential-manager ---
[INFO] Installing /var/lib/jenkins/workspace/taverna-engine-credential-manager-maintenance/credential-manager/target/credential-manager-1.6-SNAPSHOT.jar to /var/lib/jenkins/workspace/taverna-engine-credential-manager-maintenance/.repository/net/sf/taverna/t2/security/credential-manager/1.6-SNAPSHOT/credential-manager-1.6-SNAPSHOT.jar
[INFO] Installing /var/lib/jenkins/workspace/taverna-engine-credential-manager-maintenance/credential-manager/pom.xml to /var/lib/jenkins/workspace/taverna-engine-credential-manager-maintenance/.repository/net/sf/taverna/t2/security/credential-manager/1.6-SNAPSHOT/credential-manager-1.6-SNAPSHOT.pom
[INFO] Installing /var/lib/jenkins/workspace/taverna-engine-credential-manager-maintenance/credential-manager/target/credential-manager-1.6-SNAPSHOT-sources.jar to /var/lib/jenkins/workspace/taverna-engine-credential-manager-maintenance/.repository/net/sf/taverna/t2/security/credential-manager/1.6-SNAPSHOT/credential-manager-1.6-SNAPSHOT-sources.jar
[INFO] Installing /var/lib/jenkins/workspace/taverna-engine-credential-manager-maintenance/credential-manager/target/credential-manager-1.6-SNAPSHOT-test-sources.jar to /var/lib/jenkins/workspace/taverna-engine-credential-manager-maintenance/.repository/net/sf/taverna/t2/security/credential-manager/1.6-SNAPSHOT/credential-manager-1.6-SNAPSHOT-test-sources.jar
[INFO] Installing /var/lib/jenkins/workspace/taverna-engine-credential-manager-maintenance/credential-manager/target/credential-manager-1.6-SNAPSHOT-tests.jar to /var/lib/jenkins/workspace/taverna-engine-credential-manager-maintenance/.repository/net/sf/taverna/t2/security/credential-manager/1.6-SNAPSHOT/credential-manager-1.6-SNAPSHOT-tests.jar