SuccessConsole Output

[INFO]                                                                         
[INFO] ------------------------------------------------------------------------
[INFO] Building Credential manager 1.6-SNAPSHOT
[INFO] ------------------------------------------------------------------------
[INFO] Downloading: http://repository.mygrid.org.uk/artifactory/repo/net/sf/taverna/t2/infrastructure/spi-discovery-api/2.6-SNAPSHOT/maven-metadata.xml
[INFO] Downloaded: http://repository.mygrid.org.uk/artifactory/repo/net/sf/taverna/t2/infrastructure/spi-discovery-api/2.6-SNAPSHOT/maven-metadata.xml (2 KB at 0.3 KB/sec)
[INFO] Downloading: http://repository.mygrid.org.uk/artifactory/repo/net/sf/taverna/t2/infrastructure/spi-discovery-api/2.6-SNAPSHOT/spi-discovery-api-2.6-20141022.100255-7.pom
[INFO] Downloaded: http://repository.mygrid.org.uk/artifactory/repo/net/sf/taverna/t2/infrastructure/spi-discovery-api/2.6-SNAPSHOT/spi-discovery-api-2.6-20141022.100255-7.pom (2 KB at 16.6 KB/sec)
[INFO] Downloading: http://repository.mygrid.org.uk/artifactory/repo/net/sf/taverna/t2/infrastructure/2.6-SNAPSHOT/maven-metadata.xml
[INFO] Downloaded: http://repository.mygrid.org.uk/artifactory/repo/net/sf/taverna/t2/infrastructure/2.6-SNAPSHOT/maven-metadata.xml (802 B at 0.6 KB/sec)
[INFO] Downloading: http://repository.mygrid.org.uk/artifactory/repo/net/sf/taverna/t2/infrastructure/2.6-SNAPSHOT/infrastructure-2.6-20141022.100255-7.pom
[INFO] Downloaded: http://repository.mygrid.org.uk/artifactory/repo/net/sf/taverna/t2/infrastructure/2.6-SNAPSHOT/infrastructure-2.6-20141022.100255-7.pom (4 KB at 64.6 KB/sec)
[INFO] Downloading: http://repository.mygrid.org.uk/artifactory/repo/net/sf/taverna/t2/lang/observer/1.6-SNAPSHOT/maven-metadata.xml
[INFO] Downloaded: http://repository.mygrid.org.uk/artifactory/repo/net/sf/taverna/t2/lang/observer/1.6-SNAPSHOT/maven-metadata.xml (2 KB at 47.2 KB/sec)
[INFO] Downloading: http://repository.mygrid.org.uk/artifactory/repo/net/sf/taverna/t2/lang/observer/1.6-SNAPSHOT/observer-1.6-20141022.100055-7.pom
[INFO] Downloaded: http://repository.mygrid.org.uk/artifactory/repo/net/sf/taverna/t2/lang/observer/1.6-SNAPSHOT/observer-1.6-20141022.100055-7.pom (833 B at 15.1 KB/sec)
[INFO] Downloading: http://repository.mygrid.org.uk/artifactory/repo/net/sf/taverna/t2/lang/1.6-SNAPSHOT/maven-metadata.xml
[INFO] Downloaded: http://repository.mygrid.org.uk/artifactory/repo/net/sf/taverna/t2/lang/1.6-SNAPSHOT/maven-metadata.xml (792 B at 18.9 KB/sec)
[INFO] Downloading: http://repository.mygrid.org.uk/artifactory/repo/net/sf/taverna/t2/lang/1.6-SNAPSHOT/lang-1.6-20141022.100055-7.pom
[INFO] Downloaded: http://repository.mygrid.org.uk/artifactory/repo/net/sf/taverna/t2/lang/1.6-SNAPSHOT/lang-1.6-20141022.100055-7.pom (3 KB at 57.9 KB/sec)
[INFO] Downloading: http://repository.mygrid.org.uk/artifactory/repo/net/sf/taverna/t2/infrastructure/raven/2.6-SNAPSHOT/maven-metadata.xml
[INFO] Downloaded: http://repository.mygrid.org.uk/artifactory/repo/net/sf/taverna/t2/infrastructure/raven/2.6-SNAPSHOT/maven-metadata.xml (2 KB at 1.2 KB/sec)
[INFO] Downloading: http://repository.mygrid.org.uk/artifactory/repo/net/sf/taverna/t2/infrastructure/raven/2.6-SNAPSHOT/raven-2.6-20141022.100255-7.pom
[INFO] Downloaded: http://repository.mygrid.org.uk/artifactory/repo/net/sf/taverna/t2/infrastructure/raven/2.6-SNAPSHOT/raven-2.6-20141022.100255-7.pom (2 KB at 23.4 KB/sec)
[INFO] Downloading: http://repository.mygrid.org.uk/artifactory/repo/net/sf/taverna/t2/infrastructure/raven-log4j/2.6-SNAPSHOT/maven-metadata.xml
[INFO] Downloaded: http://repository.mygrid.org.uk/artifactory/repo/net/sf/taverna/t2/infrastructure/raven-log4j/2.6-SNAPSHOT/maven-metadata.xml (2 KB at 1.0 KB/sec)
[INFO] Downloading: http://repository.mygrid.org.uk/artifactory/repo/net/sf/taverna/t2/infrastructure/raven-log4j/2.6-SNAPSHOT/raven-log4j-2.6-20141022.100255-7.pom
[INFO] Downloaded: http://repository.mygrid.org.uk/artifactory/repo/net/sf/taverna/t2/infrastructure/raven-log4j/2.6-SNAPSHOT/raven-log4j-2.6-20141022.100255-7.pom (952 B at 16.0 KB/sec)
[INFO] Downloading: http://repository.mygrid.org.uk/artifactory/repo/net/sf/taverna/t2/infrastructure/appconfig/2.6-SNAPSHOT/maven-metadata.xml
[INFO] Downloaded: http://repository.mygrid.org.uk/artifactory/repo/net/sf/taverna/t2/infrastructure/appconfig/2.6-SNAPSHOT/maven-metadata.xml (2 KB at 1.2 KB/sec)
[INFO] Downloading: http://repository.mygrid.org.uk/artifactory/repo/net/sf/taverna/t2/infrastructure/appconfig/2.6-SNAPSHOT/appconfig-2.6-20141022.100255-7.pom
[INFO] Downloaded: http://repository.mygrid.org.uk/artifactory/repo/net/sf/taverna/t2/infrastructure/appconfig/2.6-SNAPSHOT/appconfig-2.6-20141022.100255-7.pom (2 KB at 18.4 KB/sec)
[INFO] Downloading: http://repository.mygrid.org.uk/artifactory/repo/net/sf/taverna/t2/infrastructure/launcher-api/2.6-SNAPSHOT/maven-metadata.xml
[INFO] Downloaded: http://repository.mygrid.org.uk/artifactory/repo/net/sf/taverna/t2/infrastructure/launcher-api/2.6-SNAPSHOT/maven-metadata.xml (2 KB at 1.0 KB/sec)
[INFO] Downloading: http://repository.mygrid.org.uk/artifactory/repo/net/sf/taverna/t2/infrastructure/launcher-api/2.6-SNAPSHOT/launcher-api-2.6-20141022.100255-7.pom
[INFO] Downloaded: http://repository.mygrid.org.uk/artifactory/repo/net/sf/taverna/t2/infrastructure/launcher-api/2.6-SNAPSHOT/launcher-api-2.6-20141022.100255-7.pom (549 B at 0.9 KB/sec)
[INFO] Downloading: http://repository.mygrid.org.uk/artifactory/repo/net/sf/taverna/t2/infrastructure/prelauncher/2.6-SNAPSHOT/maven-metadata.xml
[INFO] Downloaded: http://repository.mygrid.org.uk/artifactory/repo/net/sf/taverna/t2/infrastructure/prelauncher/2.6-SNAPSHOT/maven-metadata.xml (2 KB at 0.3 KB/sec)
[INFO] Downloading: http://repository.mygrid.org.uk/artifactory/repo/net/sf/taverna/t2/infrastructure/prelauncher/2.6-SNAPSHOT/prelauncher-2.6-20141022.100255-7.pom
[INFO] Downloaded: http://repository.mygrid.org.uk/artifactory/repo/net/sf/taverna/t2/infrastructure/prelauncher/2.6-SNAPSHOT/prelauncher-2.6-20141022.100255-7.pom (2 KB at 10.6 KB/sec)
[INFO] Downloading: http://repository.mygrid.org.uk/artifactory/repo/net/sf/taverna/t2/infrastructure/spi-discovery-api/2.6-SNAPSHOT/spi-discovery-api-2.6-20141022.100255-7.jar
[INFO] Downloading: http://repository.mygrid.org.uk/artifactory/repo/net/sf/taverna/t2/lang/observer/1.6-SNAPSHOT/observer-1.6-20141022.100055-7.jar
[INFO] Downloading: http://repository.mygrid.org.uk/artifactory/repo/net/sf/taverna/t2/infrastructure/appconfig/2.6-SNAPSHOT/appconfig-2.6-20141022.100255-7.jar
[INFO] Downloading: http://repository.mygrid.org.uk/artifactory/repo/net/sf/taverna/t2/infrastructure/raven/2.6-SNAPSHOT/raven-2.6-20141022.100255-7.jar
[INFO] Downloading: http://repository.mygrid.org.uk/artifactory/repo/net/sf/taverna/t2/infrastructure/raven-log4j/2.6-SNAPSHOT/raven-log4j-2.6-20141022.100255-7.jar
[INFO] Downloaded: http://repository.mygrid.org.uk/artifactory/repo/net/sf/taverna/t2/infrastructure/raven-log4j/2.6-SNAPSHOT/raven-log4j-2.6-20141022.100255-7.jar (4 KB at 7.0 KB/sec)
[INFO] Downloading: http://repository.mygrid.org.uk/artifactory/repo/net/sf/taverna/t2/infrastructure/launcher-api/2.6-SNAPSHOT/launcher-api-2.6-20141022.100255-7.jar
[INFO] Downloaded: http://repository.mygrid.org.uk/artifactory/repo/net/sf/taverna/t2/infrastructure/spi-discovery-api/2.6-SNAPSHOT/spi-discovery-api-2.6-20141022.100255-7.jar (6 KB at 9.6 KB/sec)
[INFO] Downloading: http://repository.mygrid.org.uk/artifactory/repo/net/sf/taverna/t2/infrastructure/prelauncher/2.6-SNAPSHOT/prelauncher-2.6-20141022.100255-7.jar
[INFO] Downloaded: http://repository.mygrid.org.uk/artifactory/repo/net/sf/taverna/t2/infrastructure/launcher-api/2.6-SNAPSHOT/launcher-api-2.6-20141022.100255-7.jar (3 KB at 14.6 KB/sec)
[INFO] Downloaded: http://repository.mygrid.org.uk/artifactory/repo/net/sf/taverna/t2/lang/observer/1.6-SNAPSHOT/observer-1.6-20141022.100055-7.jar (5 KB at 6.3 KB/sec)
[INFO] Downloaded: http://repository.mygrid.org.uk/artifactory/repo/net/sf/taverna/t2/infrastructure/appconfig/2.6-SNAPSHOT/appconfig-2.6-20141022.100255-7.jar (29 KB at 41.8 KB/sec)
[INFO] Downloaded: http://repository.mygrid.org.uk/artifactory/repo/net/sf/taverna/t2/infrastructure/raven/2.6-SNAPSHOT/raven-2.6-20141022.100255-7.jar (85 KB at 121.6 KB/sec)
[INFO] Downloaded: http://repository.mygrid.org.uk/artifactory/repo/net/sf/taverna/t2/infrastructure/prelauncher/2.6-SNAPSHOT/prelauncher-2.6-20141022.100255-7.jar (9 KB at 43.9 KB/sec)
[INFO] 
[INFO] --- maven-clean-plugin:2.5:clean (default-clean) @ credential-manager ---
[INFO] Deleting /var/lib/jenkins/workspace/taverna-engine-credential-manager-maintenance/credential-manager/target
[INFO] 
[INFO] --- maven-resources-plugin:2.6:resources (default-resources) @ credential-manager ---
[INFO] Using 'UTF-8' encoding to copy filtered resources.
[INFO] Copying 7 resources
[INFO] 
[INFO] --- maven-compiler-plugin:3.1:compile (default-compile) @ credential-manager ---
[INFO] Changes detected - recompiling the module!
[INFO] Compiling 10 source files to /var/lib/jenkins/workspace/taverna-engine-credential-manager-maintenance/credential-manager/target/classes
[INFO] 
[INFO] --- maven-resources-plugin:2.6:testResources (default-testResources) @ credential-manager ---
[INFO] Using 'UTF-8' encoding to copy filtered resources.
[INFO] Copying 3 resources
[INFO] 
[INFO] --- maven-compiler-plugin:3.1:testCompile (default-testCompile) @ credential-manager ---
[INFO] Changes detected - recompiling the module!
[INFO] Compiling 4 source files to /var/lib/jenkins/workspace/taverna-engine-credential-manager-maintenance/credential-manager/target/test-classes
[INFO] 
[INFO] --- maven-surefire-plugin:2.17:test (default-test) @ credential-manager ---
[INFO] Surefire report directory: /var/lib/jenkins/workspace/taverna-engine-credential-manager-maintenance/credential-manager/target/surefire-reports

-------------------------------------------------------
 T E S T S
-------------------------------------------------------
Running net.sf.taverna.t2.security.credentialmanager.PossibleLookupsTest
log4j:WARN No appenders could be found for logger (net.sf.taverna.raven.log.Log).
log4j:WARN Please initialize the log4j system properly.
log4j:WARN See http://logging.apache.org/log4j/1.2/faq.html#noconfig for more info.
Tests run: 8, Failures: 0, Errors: 0, Skipped: 0, Time elapsed: 0.726 sec - in net.sf.taverna.t2.security.credentialmanager.PossibleLookupsTest
Running net.sf.taverna.t2.security.credentialmanager.BasicAuthTest
ApplicationConfig could not determine application name, using unknownApplication-e3d2c067-a00d-444f-83b3-9c02ce552797
ApplicationConfig could not determine application name, using unknownApplication-e3d2c067-a00d-444f-83b3-9c02ce552797
2014-10-22 11:05:53.009:INFO::Logging to STDERR via org.mortbay.log.StdErrLog
2014-10-22 11:05:53.128:INFO::jetty-6.1.24
2014-10-22 11:05:53.389:INFO::NO JSP Support for /, did not find org.apache.jasper.servlet.JspServlet
2014-10-22 11:05:53.492:INFO::Started SelectChannelConnector@0.0.0.0:9638
2014-10-22 11:05:53.901:WARN::AUTH FAILURE: user basicUser
2014-10-22 11:05:53.919:WARN::AUTH FAILURE: user basicUser
2014-10-22 11:05:53.923:WARN::AUTH FAILURE: user basicUser
2014-10-22 11:05:53.939:WARN::AUTH FAILURE: user basicUser
2014-10-22 11:05:53.943:WARN::AUTH FAILURE: user basicUser
2014-10-22 11:05:53.947:WARN::AUTH FAILURE: user basicUser
2014-10-22 11:05:53.955:WARN::AUTH FAILURE: user basicUser
2014-10-22 11:05:53.961:WARN::AUTH FAILURE: user basicUser
2014-10-22 11:05:53.984:WARN::AUTH FAILURE: user basicUser
2014-10-22 11:05:53.990:WARN::AUTH FAILURE: user basicUser
2014-10-22 11:05:53.995:WARN::AUTH FAILURE: user basicUser
2014-10-22 11:05:53.999:WARN::AUTH FAILURE: user basicUser
2014-10-22 11:05:54.005:WARN::AUTH FAILURE: user basicUser
2014-10-22 11:05:54.010:WARN::AUTH FAILURE: user basicUser
2014-10-22 11:05:54.015:WARN::AUTH FAILURE: user basicUser
2014-10-22 11:05:54.019:WARN::AUTH FAILURE: user basicUser
2014-10-22 11:05:54.024:WARN::AUTH FAILURE: user basicUser
2014-10-22 11:05:54.028:WARN::AUTH FAILURE: user basicUser
2014-10-22 11:05:54.033:WARN::AUTH FAILURE: user basicUser
2014-10-22 11:05:54.162:WARN::AUTH FAILURE: user basicUser
2014-10-22 11:05:54.172:WARN::AUTH FAILURE: user basicUser
2014-10-22 11:05:54.199:WARN::AUTH FAILURE: user basicUser
2014-10-22 11:05:54.221:WARN::AUTH FAILURE: user basicUser
2014-10-22 11:05:54.234:WARN::AUTH FAILURE: user basicUser
2014-10-22 11:05:54.252:WARN::AUTH FAILURE: user basicUser
2014-10-22 11:05:54.272:WARN::AUTH FAILURE: user basicUser
2014-10-22 11:05:54.288:WARN::AUTH FAILURE: user basicUser
2014-10-22 11:05:54.296:WARN::AUTH FAILURE: user basicUser
2014-10-22 11:05:54.305:WARN::AUTH FAILURE: user basicUser
2014-10-22 11:05:54.315:WARN::AUTH FAILURE: user basicUser
2014-10-22 11:05:54.323:WARN::AUTH FAILURE: user basicUser
2014-10-22 11:05:54.331:WARN::AUTH FAILURE: user basicUser
2014-10-22 11:05:54.348:WARN::AUTH FAILURE: user basicUser
2014-10-22 11:05:54.355:WARN::AUTH FAILURE: user basicUser
2014-10-22 11:05:54.396:WARN::AUTH FAILURE: user basicUser
2014-10-22 11:05:54.409:WARN::AUTH FAILURE: user basicUser
2014-10-22 11:05:54.417:WARN::AUTH FAILURE: user basicUser
2014-10-22 11:05:54.436:WARN::AUTH FAILURE: user basicUser
2014-10-22 11:05:54.460:INFO::Stopped SelectChannelConnector@0.0.0.0:9638
Tests run: 6, Failures: 0, Errors: 0, Skipped: 0, Time elapsed: 3.49 sec - in net.sf.taverna.t2.security.credentialmanager.BasicAuthTest

Results :

Tests run: 14, Failures: 0, Errors: 0, Skipped: 0

[JENKINS] Recording test results
[INFO] 
[INFO] --- maven-jar-plugin:2.4:jar (default-jar) @ credential-manager ---
[INFO] Building jar: /var/lib/jenkins/workspace/taverna-engine-credential-manager-maintenance/credential-manager/target/credential-manager-1.6-SNAPSHOT.jar
[INFO] 
[INFO] >>> maven-source-plugin:2.2.1:jar (default) @ credential-manager >>>
[WARNING] Failed to getClass for org.apache.maven.plugin.source.SourceJarMojo
[INFO] 
[INFO] <<< maven-source-plugin:2.2.1:jar (default) @ credential-manager <<<
[INFO] 
[INFO] --- maven-source-plugin:2.2.1:jar (default) @ credential-manager ---
[INFO] Building jar: /var/lib/jenkins/workspace/taverna-engine-credential-manager-maintenance/credential-manager/target/credential-manager-1.6-SNAPSHOT-sources.jar
[INFO] 
[INFO] >>> maven-source-plugin:2.2.1:test-jar (default) @ credential-manager >>>
[WARNING] Failed to getClass for org.apache.maven.plugin.source.TestSourceJarMojo
[INFO] 
[INFO] <<< maven-source-plugin:2.2.1:test-jar (default) @ credential-manager <<<
[INFO] 
[INFO] --- maven-source-plugin:2.2.1:test-jar (default) @ credential-manager ---
[INFO] Building jar: /var/lib/jenkins/workspace/taverna-engine-credential-manager-maintenance/credential-manager/target/credential-manager-1.6-SNAPSHOT-test-sources.jar
[INFO] 
[INFO] --- maven-jar-plugin:2.4:test-jar (default) @ credential-manager ---
[INFO] Building jar: /var/lib/jenkins/workspace/taverna-engine-credential-manager-maintenance/credential-manager/target/credential-manager-1.6-SNAPSHOT-tests.jar
[INFO] 
[INFO] --- maven-install-plugin:2.4:install (default-install) @ credential-manager ---
[INFO] Installing /var/lib/jenkins/workspace/taverna-engine-credential-manager-maintenance/credential-manager/target/credential-manager-1.6-SNAPSHOT.jar to /var/lib/jenkins/workspace/taverna-engine-credential-manager-maintenance/.repository/net/sf/taverna/t2/security/credential-manager/1.6-SNAPSHOT/credential-manager-1.6-SNAPSHOT.jar
[INFO] Installing /var/lib/jenkins/workspace/taverna-engine-credential-manager-maintenance/credential-manager/pom.xml to /var/lib/jenkins/workspace/taverna-engine-credential-manager-maintenance/.repository/net/sf/taverna/t2/security/credential-manager/1.6-SNAPSHOT/credential-manager-1.6-SNAPSHOT.pom
[INFO] Installing /var/lib/jenkins/workspace/taverna-engine-credential-manager-maintenance/credential-manager/target/credential-manager-1.6-SNAPSHOT-sources.jar to /var/lib/jenkins/workspace/taverna-engine-credential-manager-maintenance/.repository/net/sf/taverna/t2/security/credential-manager/1.6-SNAPSHOT/credential-manager-1.6-SNAPSHOT-sources.jar
[INFO] Installing /var/lib/jenkins/workspace/taverna-engine-credential-manager-maintenance/credential-manager/target/credential-manager-1.6-SNAPSHOT-test-sources.jar to /var/lib/jenkins/workspace/taverna-engine-credential-manager-maintenance/.repository/net/sf/taverna/t2/security/credential-manager/1.6-SNAPSHOT/credential-manager-1.6-SNAPSHOT-test-sources.jar
[INFO] Installing /var/lib/jenkins/workspace/taverna-engine-credential-manager-maintenance/credential-manager/target/credential-manager-1.6-SNAPSHOT-tests.jar to /var/lib/jenkins/workspace/taverna-engine-credential-manager-maintenance/.repository/net/sf/taverna/t2/security/credential-manager/1.6-SNAPSHOT/credential-manager-1.6-SNAPSHOT-tests.jar