FailedConsole Output

Skipping 57 KB.. Full Log
5.pom
[INFO] Downloaded: http://repository.mygrid.org.uk/artifactory/repo/org/apache/apache/5/apache-5.pom (5 KB at 13.8 KB/sec)
[INFO] Downloading: http://repository.mygrid.org.uk/artifactory/repo/org/apache/maven/maven-core/2.2.1/maven-core-2.2.1.pom
[INFO] Downloaded: http://repository.mygrid.org.uk/artifactory/repo/org/apache/maven/maven-core/2.2.1/maven-core-2.2.1.pom (12 KB at 72.8 KB/sec)
[INFO] Downloading: http://repository.mygrid.org.uk/artifactory/repo/org/apache/maven/maven-settings/2.2.1/maven-settings-2.2.1.pom
[INFO] Downloaded: http://repository.mygrid.org.uk/artifactory/repo/org/apache/maven/maven-settings/2.2.1/maven-settings-2.2.1.pom (3 KB at 20.9 KB/sec)
[INFO] Downloading: http://repository.mygrid.org.uk/artifactory/repo/org/apache/maven/maven-model/2.2.1/maven-model-2.2.1.pom
[INFO] Downloaded: http://repository.mygrid.org.uk/artifactory/repo/org/apache/maven/maven-model/2.2.1/maven-model-2.2.1.pom (4 KB at 51.0 KB/sec)
[INFO] Downloading: http://repository.mygrid.org.uk/artifactory/repo/org/codehaus/plexus/plexus-interpolation/1.11/plexus-interpolation-1.11.pom
[INFO] Downloaded: http://repository.mygrid.org.uk/artifactory/repo/org/codehaus/plexus/plexus-interpolation/1.11/plexus-interpolation-1.11.pom (889 B at 7.3 KB/sec)
[INFO] Downloading: http://repository.mygrid.org.uk/artifactory/repo/org/apache/maven/maven-plugin-parameter-documenter/2.2.1/maven-plugin-parameter-documenter-2.2.1.pom
[INFO] Downloaded: http://repository.mygrid.org.uk/artifactory/repo/org/apache/maven/maven-plugin-parameter-documenter/2.2.1/maven-plugin-parameter-documenter-2.2.1.pom (2 KB at 24.2 KB/sec)
[INFO] Downloading: http://repository.mygrid.org.uk/artifactory/repo/org/slf4j/slf4j-jdk14/1.5.6/slf4j-jdk14-1.5.6.pom
[INFO] Downloaded: http://repository.mygrid.org.uk/artifactory/repo/org/slf4j/slf4j-jdk14/1.5.6/slf4j-jdk14-1.5.6.pom (2 KB at 18.4 KB/sec)
[INFO] Downloading: http://repository.mygrid.org.uk/artifactory/repo/org/slf4j/slf4j-parent/1.5.6/slf4j-parent-1.5.6.pom
[INFO] Downloaded: http://repository.mygrid.org.uk/artifactory/repo/org/slf4j/slf4j-parent/1.5.6/slf4j-parent-1.5.6.pom (8 KB at 148.7 KB/sec)
[INFO] Downloading: http://repository.mygrid.org.uk/artifactory/repo/org/slf4j/slf4j-api/1.5.6/slf4j-api-1.5.6.pom
[INFO] Downloaded: http://repository.mygrid.org.uk/artifactory/repo/org/slf4j/slf4j-api/1.5.6/slf4j-api-1.5.6.pom (3 KB at 40.5 KB/sec)
[INFO] Downloading: http://repository.mygrid.org.uk/artifactory/repo/org/slf4j/jcl-over-slf4j/1.5.6/jcl-over-slf4j-1.5.6.pom
[INFO] Downloaded: http://repository.mygrid.org.uk/artifactory/repo/org/slf4j/jcl-over-slf4j/1.5.6/jcl-over-slf4j-1.5.6.pom (3 KB at 16.3 KB/sec)
[INFO] Downloading: http://repository.mygrid.org.uk/artifactory/repo/org/apache/maven/maven-profile/2.2.1/maven-profile-2.2.1.pom
[INFO] Downloaded: http://repository.mygrid.org.uk/artifactory/repo/org/apache/maven/maven-profile/2.2.1/maven-profile-2.2.1.pom (3 KB at 43.3 KB/sec)
[INFO] Downloading: http://repository.mygrid.org.uk/artifactory/repo/org/apache/maven/maven-artifact/2.2.1/maven-artifact-2.2.1.pom
[INFO] Downloaded: http://repository.mygrid.org.uk/artifactory/repo/org/apache/maven/maven-artifact/2.2.1/maven-artifact-2.2.1.pom (2 KB at 21.4 KB/sec)
[INFO] Downloading: http://repository.mygrid.org.uk/artifactory/repo/org/apache/maven/maven-repository-metadata/2.2.1/maven-repository-metadata-2.2.1.pom
[INFO] Downloaded: http://repository.mygrid.org.uk/artifactory/repo/org/apache/maven/maven-repository-metadata/2.2.1/maven-repository-metadata-2.2.1.pom (2 KB at 19.9 KB/sec)
[INFO] Downloading: http://repository.mygrid.org.uk/artifactory/repo/org/apache/maven/maven-error-diagnostics/2.2.1/maven-error-diagnostics-2.2.1.pom
[INFO] Downloaded: http://repository.mygrid.org.uk/artifactory/repo/org/apache/maven/maven-error-diagnostics/2.2.1/maven-error-diagnostics-2.2.1.pom (2 KB at 14.9 KB/sec)
[INFO] Downloading: http://repository.mygrid.org.uk/artifactory/repo/org/apache/maven/maven-project/2.2.1/maven-project-2.2.1.pom
[INFO] Downloaded: http://repository.mygrid.org.uk/artifactory/repo/org/apache/maven/maven-project/2.2.1/maven-project-2.2.1.pom (3 KB at 15.8 KB/sec)
[INFO] Downloading: http://repository.mygrid.org.uk/artifactory/repo/org/apache/maven/maven-artifact-manager/2.2.1/maven-artifact-manager-2.2.1.pom
[INFO] Downloaded: http://repository.mygrid.org.uk/artifactory/repo/org/apache/maven/maven-artifact-manager/2.2.1/maven-artifact-manager-2.2.1.pom (4 KB at 16.9 KB/sec)
[INFO] Downloading: http://repository.mygrid.org.uk/artifactory/repo/backport-util-concurrent/backport-util-concurrent/3.1/backport-util-concurrent-3.1.pom
[INFO] Downloaded: http://repository.mygrid.org.uk/artifactory/repo/backport-util-concurrent/backport-util-concurrent/3.1/backport-util-concurrent-3.1.pom (880 B at 5.5 KB/sec)
[INFO] Downloading: http://repository.mygrid.org.uk/artifactory/repo/org/apache/maven/maven-plugin-registry/2.2.1/maven-plugin-registry-2.2.1.pom
[INFO] Downloaded: http://repository.mygrid.org.uk/artifactory/repo/org/apache/maven/maven-plugin-registry/2.2.1/maven-plugin-registry-2.2.1.pom (2 KB at 15.8 KB/sec)
[INFO] Downloading: http://repository.mygrid.org.uk/artifactory/repo/org/apache/maven/maven-plugin-descriptor/2.2.1/maven-plugin-descriptor-2.2.1.pom
[INFO] Downloaded: http://repository.mygrid.org.uk/artifactory/repo/org/apache/maven/maven-plugin-descriptor/2.2.1/maven-plugin-descriptor-2.2.1.pom (3 KB at 23.7 KB/sec)
[INFO] Downloading: http://repository.mygrid.org.uk/artifactory/repo/org/apache/maven/maven-monitor/2.2.1/maven-monitor-2.2.1.pom
[INFO] Downloaded: http://repository.mygrid.org.uk/artifactory/repo/org/apache/maven/maven-monitor/2.2.1/maven-monitor-2.2.1.pom (2 KB at 9.7 KB/sec)
[INFO] Downloading: http://repository.mygrid.org.uk/artifactory/repo/org/sonatype/plexus/plexus-sec-dispatcher/1.3/plexus-sec-dispatcher-1.3.pom
[INFO] Downloaded: http://repository.mygrid.org.uk/artifactory/repo/org/sonatype/plexus/plexus-sec-dispatcher/1.3/plexus-sec-dispatcher-1.3.pom (3 KB at 22.6 KB/sec)
[INFO] Downloading: http://repository.mygrid.org.uk/artifactory/repo/org/sonatype/spice/spice-parent/12/spice-parent-12.pom
[INFO] Downloaded: http://repository.mygrid.org.uk/artifactory/repo/org/sonatype/spice/spice-parent/12/spice-parent-12.pom (7 KB at 92.2 KB/sec)
[INFO] Downloading: http://repository.mygrid.org.uk/artifactory/repo/org/sonatype/forge/forge-parent/4/forge-parent-4.pom
[INFO] Downloaded: http://repository.mygrid.org.uk/artifactory/repo/org/sonatype/forge/forge-parent/4/forge-parent-4.pom (9 KB at 83.7 KB/sec)
[INFO] Downloading: http://repository.mygrid.org.uk/artifactory/repo/org/codehaus/plexus/plexus-utils/1.5.5/plexus-utils-1.5.5.pom
[INFO] Downloaded: http://repository.mygrid.org.uk/artifactory/repo/org/codehaus/plexus/plexus-utils/1.5.5/plexus-utils-1.5.5.pom (6 KB at 48.8 KB/sec)
[INFO] Downloading: http://repository.mygrid.org.uk/artifactory/repo/org/sonatype/plexus/plexus-cipher/1.4/plexus-cipher-1.4.pom
[INFO] Downloaded: http://repository.mygrid.org.uk/artifactory/repo/org/sonatype/plexus/plexus-cipher/1.4/plexus-cipher-1.4.pom (3 KB at 17.5 KB/sec)
[INFO] Downloading: http://repository.mygrid.org.uk/artifactory/repo/org/codehaus/plexus/plexus-component-annotations/1.5.5/plexus-component-annotations-1.5.5.pom
[INFO] Downloaded: http://repository.mygrid.org.uk/artifactory/repo/org/codehaus/plexus/plexus-component-annotations/1.5.5/plexus-component-annotations-1.5.5.pom (815 B at 1.5 KB/sec)
[INFO] Downloading: http://repository.mygrid.org.uk/artifactory/repo/org/codehaus/plexus/plexus-containers/1.5.5/plexus-containers-1.5.5.pom
[INFO] Downloaded: http://repository.mygrid.org.uk/artifactory/repo/org/codehaus/plexus/plexus-containers/1.5.5/plexus-containers-1.5.5.pom (5 KB at 44.5 KB/sec)
[INFO] Downloading: http://repository.mygrid.org.uk/artifactory/repo/org/codehaus/plexus/plexus/2.0.7/plexus-2.0.7.pom
[INFO] Downloaded: http://repository.mygrid.org.uk/artifactory/repo/org/codehaus/plexus/plexus/2.0.7/plexus-2.0.7.pom (17 KB at 281.5 KB/sec)
[INFO] Downloading: http://repository.mygrid.org.uk/artifactory/repo/org/codehaus/plexus/plexus-compiler-api/2.2/plexus-compiler-api-2.2.pom
[INFO] Downloaded: http://repository.mygrid.org.uk/artifactory/repo/org/codehaus/plexus/plexus-compiler-api/2.2/plexus-compiler-api-2.2.pom (865 B at 6.3 KB/sec)
[INFO] Downloading: http://repository.mygrid.org.uk/artifactory/repo/org/codehaus/plexus/plexus-compiler/2.2/plexus-compiler-2.2.pom
[INFO] Downloaded: http://repository.mygrid.org.uk/artifactory/repo/org/codehaus/plexus/plexus-compiler/2.2/plexus-compiler-2.2.pom (4 KB at 73.5 KB/sec)
[INFO] Downloading: http://repository.mygrid.org.uk/artifactory/repo/org/codehaus/plexus/plexus-components/1.3.1/plexus-components-1.3.1.pom
[INFO] Downloaded: http://repository.mygrid.org.uk/artifactory/repo/org/codehaus/plexus/plexus-components/1.3.1/plexus-components-1.3.1.pom (3 KB at 10.0 KB/sec)
[INFO] Downloading: http://repository.mygrid.org.uk/artifactory/repo/org/codehaus/plexus/plexus/3.3.1/plexus-3.3.1.pom
[INFO] Downloaded: http://repository.mygrid.org.uk/artifactory/repo/org/codehaus/plexus/plexus/3.3.1/plexus-3.3.1.pom (20 KB at 176.7 KB/sec)
[INFO] Downloading: http://repository.mygrid.org.uk/artifactory/repo/org/codehaus/plexus/plexus-compiler-manager/2.2/plexus-compiler-manager-2.2.pom
[INFO] Downloaded: http://repository.mygrid.org.uk/artifactory/repo/org/codehaus/plexus/plexus-compiler-manager/2.2/plexus-compiler-manager-2.2.pom (690 B at 6.2 KB/sec)
[INFO] Downloading: http://repository.mygrid.org.uk/artifactory/repo/org/codehaus/plexus/plexus-compiler-javac/2.2/plexus-compiler-javac-2.2.pom
[INFO] Downloaded: http://repository.mygrid.org.uk/artifactory/repo/org/codehaus/plexus/plexus-compiler-javac/2.2/plexus-compiler-javac-2.2.pom (769 B at 4.3 KB/sec)
[INFO] Downloading: http://repository.mygrid.org.uk/artifactory/repo/org/codehaus/plexus/plexus-compilers/2.2/plexus-compilers-2.2.pom
[INFO] Downloaded: http://repository.mygrid.org.uk/artifactory/repo/org/codehaus/plexus/plexus-compilers/2.2/plexus-compilers-2.2.pom (2 KB at 4.9 KB/sec)
[INFO] Downloading: http://repository.mygrid.org.uk/artifactory/repo/org/codehaus/plexus/plexus-container-default/1.5.5/plexus-container-default-1.5.5.pom
[INFO] Downloaded: http://repository.mygrid.org.uk/artifactory/repo/org/codehaus/plexus/plexus-container-default/1.5.5/plexus-container-default-1.5.5.pom (3 KB at 21.4 KB/sec)
[INFO] Downloading: http://repository.mygrid.org.uk/artifactory/repo/org/codehaus/plexus/plexus-utils/1.4.5/plexus-utils-1.4.5.pom
[INFO] Downloaded: http://repository.mygrid.org.uk/artifactory/repo/org/codehaus/plexus/plexus-utils/1.4.5/plexus-utils-1.4.5.pom (3 KB at 21.5 KB/sec)
[INFO] Downloading: http://repository.mygrid.org.uk/artifactory/repo/org/codehaus/plexus/plexus-classworlds/2.2.2/plexus-classworlds-2.2.2.pom
[INFO] Downloaded: http://repository.mygrid.org.uk/artifactory/repo/org/codehaus/plexus/plexus-classworlds/2.2.2/plexus-classworlds-2.2.2.pom (4 KB at 29.8 KB/sec)
[INFO] Downloading: http://repository.mygrid.org.uk/artifactory/repo/org/apache/xbean/xbean-reflect/3.4/xbean-reflect-3.4.pom
[INFO] Downloaded: http://repository.mygrid.org.uk/artifactory/repo/org/apache/xbean/xbean-reflect/3.4/xbean-reflect-3.4.pom (3 KB at 20.2 KB/sec)
[INFO] Downloading: http://repository.mygrid.org.uk/artifactory/repo/org/apache/xbean/xbean/3.4/xbean-3.4.pom
[INFO] Downloaded: http://repository.mygrid.org.uk/artifactory/repo/org/apache/xbean/xbean/3.4/xbean-3.4.pom (19 KB at 306.7 KB/sec)
[INFO] Downloading: http://repository.mygrid.org.uk/artifactory/repo/log4j/log4j/1.2.12/log4j-1.2.12.pom
[INFO] Downloaded: http://repository.mygrid.org.uk/artifactory/repo/log4j/log4j/1.2.12/log4j-1.2.12.pom (145 B at 1.7 KB/sec)
[INFO] Downloading: http://repository.mygrid.org.uk/artifactory/repo/commons-logging/commons-logging-api/1.1/commons-logging-api-1.1.pom
[INFO] Downloaded: http://repository.mygrid.org.uk/artifactory/repo/commons-logging/commons-logging-api/1.1/commons-logging-api-1.1.pom (6 KB at 66.1 KB/sec)
[INFO] Downloading: http://repository.mygrid.org.uk/artifactory/repo/com/google/collections/google-collections/1.0/google-collections-1.0.pom
[INFO] Downloaded: http://repository.mygrid.org.uk/artifactory/repo/com/google/collections/google-collections/1.0/google-collections-1.0.pom (3 KB at 28.5 KB/sec)
[INFO] Downloading: http://repository.mygrid.org.uk/artifactory/repo/com/google/google/1/google-1.pom
[INFO] Downloaded: http://repository.mygrid.org.uk/artifactory/repo/com/google/google/1/google-1.pom (2 KB at 17.9 KB/sec)
[INFO] Downloading: http://repository.mygrid.org.uk/artifactory/repo/junit/junit/3.8.2/junit-3.8.2.pom
[INFO] Downloaded: http://repository.mygrid.org.uk/artifactory/repo/junit/junit/3.8.2/junit-3.8.2.pom (747 B at 8.1 KB/sec)
[INFO] Downloading: http://repository.mygrid.org.uk/artifactory/repo/org/codehaus/plexus/plexus-utils/1.5.1/plexus-utils-1.5.1.jar
[INFO] Downloading: http://repository.mygrid.org.uk/artifactory/repo/org/apache/maven/shared/maven-shared-utils/0.1/maven-shared-utils-0.1.jar
[INFO] Downloading: http://repository.mygrid.org.uk/artifactory/repo/com/google/code/findbugs/jsr305/2.0.1/jsr305-2.0.1.jar
[INFO] Downloading: http://repository.mygrid.org.uk/artifactory/repo/org/apache/maven/shared/maven-shared-incremental/1.1/maven-shared-incremental-1.1.jar
[INFO] Downloading: http://repository.mygrid.org.uk/artifactory/repo/org/codehaus/plexus/plexus-component-annotations/1.5.5/plexus-component-annotations-1.5.5.jar
[INFO] Downloaded: http://repository.mygrid.org.uk/artifactory/repo/org/codehaus/plexus/plexus-component-annotations/1.5.5/plexus-component-annotations-1.5.5.jar (5 KB at 6.9 KB/sec)
[INFO] Downloading: http://repository.mygrid.org.uk/artifactory/repo/org/codehaus/plexus/plexus-compiler-api/2.2/plexus-compiler-api-2.2.jar
[INFO] Downloaded: http://repository.mygrid.org.uk/artifactory/repo/com/google/code/findbugs/jsr305/2.0.1/jsr305-2.0.1.jar (32 KB at 47.5 KB/sec)
[INFO] Downloading: http://repository.mygrid.org.uk/artifactory/repo/org/codehaus/plexus/plexus-compiler-manager/2.2/plexus-compiler-manager-2.2.jar
[INFO] Downloaded: http://repository.mygrid.org.uk/artifactory/repo/org/apache/maven/shared/maven-shared-utils/0.1/maven-shared-utils-0.1.jar (151 KB at 226.2 KB/sec)
[INFO] Downloading: http://repository.mygrid.org.uk/artifactory/repo/org/codehaus/plexus/plexus-compiler-javac/2.2/plexus-compiler-javac-2.2.jar
[INFO] Downloaded: http://repository.mygrid.org.uk/artifactory/repo/org/apache/maven/shared/maven-shared-incremental/1.1/maven-shared-incremental-1.1.jar (14 KB at 15.0 KB/sec)
[INFO] Downloading: http://repository.mygrid.org.uk/artifactory/repo/org/apache/xbean/xbean-reflect/3.4/xbean-reflect-3.4.jar
[INFO] Downloaded: http://repository.mygrid.org.uk/artifactory/repo/org/codehaus/plexus/plexus-compiler-manager/2.2/plexus-compiler-manager-2.2.jar (5 KB at 12.4 KB/sec)
[INFO] Downloading: http://repository.mygrid.org.uk/artifactory/repo/log4j/log4j/1.2.12/log4j-1.2.12.jar
[INFO] Downloaded: http://repository.mygrid.org.uk/artifactory/repo/org/codehaus/plexus/plexus-compiler-javac/2.2/plexus-compiler-javac-2.2.jar (19 KB at 15.1 KB/sec)
[INFO] Downloading: http://repository.mygrid.org.uk/artifactory/repo/commons-logging/commons-logging-api/1.1/commons-logging-api-1.1.jar
[INFO] Downloaded: http://repository.mygrid.org.uk/artifactory/repo/org/apache/xbean/xbean-reflect/3.4/xbean-reflect-3.4.jar (131 KB at 127.1 KB/sec)
[INFO] Downloading: http://repository.mygrid.org.uk/artifactory/repo/com/google/collections/google-collections/1.0/google-collections-1.0.jar
[INFO] Downloaded: http://repository.mygrid.org.uk/artifactory/repo/org/codehaus/plexus/plexus-utils/1.5.1/plexus-utils-1.5.1.jar (206 KB at 100.2 KB/sec)
[INFO] Downloading: http://repository.mygrid.org.uk/artifactory/repo/junit/junit/3.8.2/junit-3.8.2.jar
[INFO] Downloaded: http://repository.mygrid.org.uk/artifactory/repo/org/codehaus/plexus/plexus-compiler-api/2.2/plexus-compiler-api-2.2.jar (25 KB at 16.5 KB/sec)
[INFO] Downloaded: http://repository.mygrid.org.uk/artifactory/repo/log4j/log4j/1.2.12/log4j-1.2.12.jar (350 KB at 266.9 KB/sec)
[INFO] Downloaded: http://repository.mygrid.org.uk/artifactory/repo/commons-logging/commons-logging-api/1.1/commons-logging-api-1.1.jar (44 KB at 52.7 KB/sec)
[INFO] Downloaded: http://repository.mygrid.org.uk/artifactory/repo/junit/junit/3.8.2/junit-3.8.2.jar (118 KB at 159.4 KB/sec)
[INFO] Downloaded: http://repository.mygrid.org.uk/artifactory/repo/com/google/collections/google-collections/1.0/google-collections-1.0.jar (625 KB at 296.6 KB/sec)
[INFO] Changes detected - recompiling the module!
[INFO] Compiling 48 source files to /var/lib/jenkins/workspace/taverna-engine-core-maintenance/reference-api/target/classes
[INFO] 
[INFO] --- maven-resources-plugin:2.6:testResources (default-testResources) @ reference-api ---
[INFO] Using 'UTF-8' encoding to copy filtered resources.
[INFO] skip non existing resourceDirectory /var/lib/jenkins/workspace/taverna-engine-core-maintenance/reference-api/src/test/resources
[INFO] 
[INFO] --- maven-compiler-plugin:3.1:testCompile (default-testCompile) @ reference-api ---
[INFO] No sources to compile
[INFO] 
[INFO] --- maven-surefire-plugin:2.17:test (default-test) @ reference-api ---
[INFO] Downloading: http://repository.mygrid.org.uk/artifactory/repo/org/apache/maven/surefire/maven-surefire-common/2.17/maven-surefire-common-2.17.pom
[INFO] Downloaded: http://repository.mygrid.org.uk/artifactory/repo/org/apache/maven/surefire/maven-surefire-common/2.17/maven-surefire-common-2.17.pom (6 KB at 45.5 KB/sec)
[INFO] Downloading: http://repository.mygrid.org.uk/artifactory/repo/org/apache/maven/plugin-tools/maven-plugin-annotations/3.2/maven-plugin-annotations-3.2.pom
[INFO] Downloaded: http://repository.mygrid.org.uk/artifactory/repo/org/apache/maven/plugin-tools/maven-plugin-annotations/3.2/maven-plugin-annotations-3.2.pom (2 KB at 8.4 KB/sec)
[INFO] Downloading: http://repository.mygrid.org.uk/artifactory/repo/org/apache/maven/plugin-tools/maven-plugin-tools/3.2/maven-plugin-tools-3.2.pom
[INFO] Downloaded: http://repository.mygrid.org.uk/artifactory/repo/org/apache/maven/plugin-tools/maven-plugin-tools/3.2/maven-plugin-tools-3.2.pom (17 KB at 171.7 KB/sec)
[INFO] Downloading: http://repository.mygrid.org.uk/artifactory/repo/org/apache/maven/surefire/surefire-api/2.17/surefire-api-2.17.pom
[INFO] Downloaded: http://repository.mygrid.org.uk/artifactory/repo/org/apache/maven/surefire/surefire-api/2.17/surefire-api-2.17.pom (3 KB at 19.3 KB/sec)
[INFO] Downloading: http://repository.mygrid.org.uk/artifactory/repo/org/apache/maven/surefire/surefire-booter/2.17/surefire-booter-2.17.pom
[INFO] Downloaded: http://repository.mygrid.org.uk/artifactory/repo/org/apache/maven/surefire/surefire-booter/2.17/surefire-booter-2.17.pom (3 KB at 38.9 KB/sec)
[INFO] Downloading: http://repository.mygrid.org.uk/artifactory/repo/org/apache/maven/reporting/maven-reporting-api/2.0.9/maven-reporting-api-2.0.9.pom
[INFO] Downloaded: http://repository.mygrid.org.uk/artifactory/repo/org/apache/maven/reporting/maven-reporting-api/2.0.9/maven-reporting-api-2.0.9.pom (2 KB at 28.8 KB/sec)
[INFO] Downloading: http://repository.mygrid.org.uk/artifactory/repo/org/apache/maven/reporting/maven-reporting/2.0.9/maven-reporting-2.0.9.pom
[INFO] Downloaded: http://repository.mygrid.org.uk/artifactory/repo/org/apache/maven/reporting/maven-reporting/2.0.9/maven-reporting-2.0.9.pom (2 KB at 25.3 KB/sec)
[INFO] Downloading: http://repository.mygrid.org.uk/artifactory/repo/org/apache/maven/maven-toolchain/2.0.9/maven-toolchain-2.0.9.pom
[INFO] Downloaded: http://repository.mygrid.org.uk/artifactory/repo/org/apache/maven/maven-toolchain/2.0.9/maven-toolchain-2.0.9.pom (4 KB at 42.4 KB/sec)
[INFO] Downloading: http://repository.mygrid.org.uk/artifactory/repo/org/apache/commons/commons-lang3/3.1/commons-lang3-3.1.pom
[INFO] Downloaded: http://repository.mygrid.org.uk/artifactory/repo/org/apache/commons/commons-lang3/3.1/commons-lang3-3.1.pom (17 KB at 121.8 KB/sec)
[INFO] Downloading: http://repository.mygrid.org.uk/artifactory/repo/org/apache/commons/commons-parent/22/commons-parent-22.pom
[INFO] Downloaded: http://repository.mygrid.org.uk/artifactory/repo/org/apache/commons/commons-parent/22/commons-parent-22.pom (41 KB at 430.9 KB/sec)
[INFO] Downloading: http://repository.mygrid.org.uk/artifactory/repo/org/apache/apache/9/apache-9.pom
[INFO] Downloaded: http://repository.mygrid.org.uk/artifactory/repo/org/apache/apache/9/apache-9.pom (15 KB at 128.7 KB/sec)
[INFO] Downloading: http://repository.mygrid.org.uk/artifactory/repo/org/apache/maven/surefire/maven-surefire-common/2.17/maven-surefire-common-2.17.jar
[INFO] Downloading: http://repository.mygrid.org.uk/artifactory/repo/org/apache/maven/surefire/surefire-booter/2.17/surefire-booter-2.17.jar
[INFO] Downloading: http://repository.mygrid.org.uk/artifactory/repo/org/apache/maven/reporting/maven-reporting-api/2.0.9/maven-reporting-api-2.0.9.jar
[INFO] Downloading: http://repository.mygrid.org.uk/artifactory/repo/org/apache/commons/commons-lang3/3.1/commons-lang3-3.1.jar
[INFO] Downloading: http://repository.mygrid.org.uk/artifactory/repo/org/apache/maven/surefire/surefire-api/2.17/surefire-api-2.17.jar
[INFO] Downloaded: http://repository.mygrid.org.uk/artifactory/repo/org/apache/maven/surefire/maven-surefire-common/2.17/maven-surefire-common-2.17.jar (260 KB at 568.4 KB/sec)
[INFO] Downloading: http://repository.mygrid.org.uk/artifactory/repo/org/apache/maven/plugin-tools/maven-plugin-annotations/3.2/maven-plugin-annotations-3.2.jar
[INFO] Downloaded: http://repository.mygrid.org.uk/artifactory/repo/org/apache/maven/surefire/surefire-booter/2.17/surefire-booter-2.17.jar (39 KB at 79.0 KB/sec)
[INFO] Downloaded: http://repository.mygrid.org.uk/artifactory/repo/org/apache/maven/surefire/surefire-api/2.17/surefire-api-2.17.jar (144 KB at 236.6 KB/sec)
[INFO] Downloaded: http://repository.mygrid.org.uk/artifactory/repo/org/apache/maven/reporting/maven-reporting-api/2.0.9/maven-reporting-api-2.0.9.jar (10 KB at 15.6 KB/sec)
[INFO] Downloaded: http://repository.mygrid.org.uk/artifactory/repo/org/apache/maven/plugin-tools/maven-plugin-annotations/3.2/maven-plugin-annotations-3.2.jar (15 KB at 78.7 KB/sec)
[INFO] Downloaded: http://repository.mygrid.org.uk/artifactory/repo/org/apache/commons/commons-lang3/3.1/commons-lang3-3.1.jar (309 KB at 177.5 KB/sec)
[INFO] No tests to run.
[JENKINS] Recording test results
[INFO] 
[INFO] --- maven-jar-plugin:2.4:jar (default-jar) @ reference-api ---
[INFO] Building jar: /var/lib/jenkins/workspace/taverna-engine-core-maintenance/reference-api/target/reference-api-1.6-SNAPSHOT.jar
[INFO] 
[INFO] >>> maven-source-plugin:2.2.1:jar (default) @ reference-api >>>
[WARNING] Failed to getClass for org.apache.maven.plugin.source.SourceJarMojo
[INFO] 
[INFO] <<< maven-source-plugin:2.2.1:jar (default) @ reference-api <<<
[INFO] 
[INFO] --- maven-source-plugin:2.2.1:jar (default) @ reference-api ---
[INFO] Building jar: /var/lib/jenkins/workspace/taverna-engine-core-maintenance/reference-api/target/reference-api-1.6-SNAPSHOT-sources.jar
[INFO] 
[INFO] >>> maven-source-plugin:2.2.1:test-jar (default) @ reference-api >>>
[WARNING] Failed to getClass for org.apache.maven.plugin.source.TestSourceJarMojo
[INFO] 
[INFO] <<< maven-source-plugin:2.2.1:test-jar (default) @ reference-api <<<
[INFO] 
[INFO] --- maven-source-plugin:2.2.1:test-jar (default) @ reference-api ---
[INFO] No sources in project. Archive not created.
[INFO] 
[INFO] --- maven-jar-plugin:2.4:test-jar (default) @ reference-api ---
[WARNING] JAR will be empty - no content was marked for inclusion!
[INFO] Building jar: /var/lib/jenkins/workspace/taverna-engine-core-maintenance/reference-api/target/reference-api-1.6-SNAPSHOT-tests.jar
[INFO] 
[INFO] --- maven-install-plugin:2.4:install (default-install) @ reference-api ---
[INFO] Installing /var/lib/jenkins/workspace/taverna-engine-core-maintenance/reference-api/target/reference-api-1.6-SNAPSHOT.jar to /var/lib/jenkins/workspace/taverna-engine-core-maintenance/.repository/net/sf/taverna/t2/core/reference-api/1.6-SNAPSHOT/reference-api-1.6-SNAPSHOT.jar
[INFO] Installing /var/lib/jenkins/workspace/taverna-engine-core-maintenance/reference-api/pom.xml to /var/lib/jenkins/workspace/taverna-engine-core-maintenance/.repository/net/sf/taverna/t2/core/reference-api/1.6-SNAPSHOT/reference-api-1.6-SNAPSHOT.pom
[INFO] Installing /var/lib/jenkins/workspace/taverna-engine-core-maintenance/reference-api/target/reference-api-1.6-SNAPSHOT-sources.jar to /var/lib/jenkins/workspace/taverna-engine-core-maintenance/.repository/net/sf/taverna/t2/core/reference-api/1.6-SNAPSHOT/reference-api-1.6-SNAPSHOT-sources.jar
[INFO] Installing /var/lib/jenkins/workspace/taverna-engine-core-maintenance/reference-api/target/reference-api-1.6-SNAPSHOT-tests.jar to /var/lib/jenkins/workspace/taverna-engine-core-maintenance/.repository/net/sf/taverna/t2/core/reference-api/1.6-SNAPSHOT/reference-api-1.6-SNAPSHOT-tests.jar
[INFO]                                                                         
[INFO] ------------------------------------------------------------------------
[INFO] Building T2reference dummy implementations for testing 1.6-SNAPSHOT
[INFO] ------------------------------------------------------------------------
[INFO] Downloading: http://repository.mygrid.org.uk/artifactory/repo/net/sf/taverna/taverna-parent/2.6-SNAPSHOT/maven-metadata.xml
[INFO] Downloaded: http://repository.mygrid.org.uk/artifactory/repo/net/sf/taverna/taverna-parent/2.6-SNAPSHOT/maven-metadata.xml (799 B at 9.3 KB/sec)
[INFO] Downloading: http://repository.mygrid.org.uk/artifactory/repo/log4j/log4j/1.2.16/log4j-1.2.16.pom
[INFO] Downloaded: http://repository.mygrid.org.uk/artifactory/repo/log4j/log4j/1.2.16/log4j-1.2.16.pom (20 KB at 242.2 KB/sec)
[INFO] Downloading: http://repository.mygrid.org.uk/artifactory/repo/log4j/log4j/1.2.16/log4j-1.2.16.pom
[INFO] Downloaded: http://repository.mygrid.org.uk/artifactory/repo/log4j/log4j/1.2.16/log4j-1.2.16.pom (20 KB at 472.9 KB/sec)
[INFO] Downloading: http://repository.mygrid.org.uk/artifactory/repo/log4j/log4j/1.2.16/log4j-1.2.16.pom
[INFO] Downloaded: http://repository.mygrid.org.uk/artifactory/repo/log4j/log4j/1.2.16/log4j-1.2.16.pom (20 KB at 315.3 KB/sec)
[INFO] Downloading: http://repository.mygrid.org.uk/artifactory/repo/log4j/log4j/1.2.16/log4j-1.2.16.pom
[INFO] Downloaded: http://repository.mygrid.org.uk/artifactory/repo/log4j/log4j/1.2.16/log4j-1.2.16.pom (20 KB at 472.9 KB/sec)
[INFO] Downloading: http://repository.mygrid.org.uk/artifactory/repo/log4j/log4j/1.2.16/log4j-1.2.16.pom
[INFO] Downloaded: http://repository.mygrid.org.uk/artifactory/repo/log4j/log4j/1.2.16/log4j-1.2.16.pom (20 KB at 301.0 KB/sec)
[INFO] Downloading: http://repository.mygrid.org.uk/artifactory/repo/log4j/log4j/1.2.16/log4j-1.2.16.pom
[INFO] Downloaded: http://repository.mygrid.org.uk/artifactory/repo/log4j/log4j/1.2.16/log4j-1.2.16.pom (20 KB at 496.6 KB/sec)
[INFO] Downloading: http://repository.mygrid.org.uk/artifactory/repo/log4j/log4j/1.2.16/log4j-1.2.16.pom
[INFO] Downloaded: http://repository.mygrid.org.uk/artifactory/repo/log4j/log4j/1.2.16/log4j-1.2.16.pom (20 KB at 213.6 KB/sec)
[INFO] Downloading: http://repository.mygrid.org.uk/artifactory/repo/log4j/log4j/1.2.16/log4j-1.2.16.jar
[INFO] Downloaded: http://repository.mygrid.org.uk/artifactory/repo/log4j/log4j/1.2.16/log4j-1.2.16.jar (471 KB at 2293.9 KB/sec)
[INFO] 
[INFO] --- maven-clean-plugin:2.5:clean (default-clean) @ reference-testhelpers ---
[INFO] 
[INFO] --- maven-resources-plugin:2.6:resources (default-resources) @ reference-testhelpers ---
[INFO] Using 'UTF-8' encoding to copy filtered resources.
[INFO] Copying 7 resources
[INFO] 
[INFO] --- maven-compiler-plugin:3.1:compile (default-compile) @ reference-testhelpers ---
[INFO] Changes detected - recompiling the module!
[INFO] Compiling 7 source files to /var/lib/jenkins/workspace/taverna-engine-core-maintenance/reference-testhelpers/target/classes
[INFO] 
[INFO] --- maven-resources-plugin:2.6:testResources (default-testResources) @ reference-testhelpers ---
[INFO] Using 'UTF-8' encoding to copy filtered resources.
[INFO] skip non existing resourceDirectory /var/lib/jenkins/workspace/taverna-engine-core-maintenance/reference-testhelpers/src/test/resources
[INFO] 
[INFO] --- maven-compiler-plugin:3.1:testCompile (default-testCompile) @ reference-testhelpers ---
[INFO] No sources to compile
[INFO] 
[INFO] --- maven-surefire-plugin:2.17:test (default-test) @ reference-testhelpers ---
[INFO] No tests to run.
[JENKINS] Recording test results
[INFO] 
[INFO] --- maven-jar-plugin:2.4:jar (default-jar) @ reference-testhelpers ---
[INFO] Building jar: /var/lib/jenkins/workspace/taverna-engine-core-maintenance/reference-testhelpers/target/reference-testhelpers-1.6-SNAPSHOT.jar
[INFO] 
[INFO] >>> maven-source-plugin:2.2.1:jar (default) @ reference-testhelpers >>>
[WARNING] Failed to getClass for org.apache.maven.plugin.source.SourceJarMojo
[INFO] 
[INFO] <<< maven-source-plugin:2.2.1:jar (default) @ reference-testhelpers <<<
[INFO] 
[INFO] --- maven-source-plugin:2.2.1:jar (default) @ reference-testhelpers ---
[INFO] Building jar: /var/lib/jenkins/workspace/taverna-engine-core-maintenance/reference-testhelpers/target/reference-testhelpers-1.6-SNAPSHOT-sources.jar
[INFO] 
[INFO] >>> maven-source-plugin:2.2.1:test-jar (default) @ reference-testhelpers >>>
[WARNING] Failed to getClass for org.apache.maven.plugin.source.TestSourceJarMojo
[INFO] 
[INFO] <<< maven-source-plugin:2.2.1:test-jar (default) @ reference-testhelpers <<<
[INFO] 
[INFO] --- maven-source-plugin:2.2.1:test-jar (default) @ reference-testhelpers ---
[INFO] No sources in project. Archive not created.
[INFO] 
[INFO] --- maven-jar-plugin:2.4:test-jar (default) @ reference-testhelpers ---
[WARNING] JAR will be empty - no content was marked for inclusion!
[INFO] Building jar: /var/lib/jenkins/workspace/taverna-engine-core-maintenance/reference-testhelpers/target/reference-testhelpers-1.6-SNAPSHOT-tests.jar
[INFO] 
[INFO] --- maven-install-plugin:2.4:install (default-install) @ reference-testhelpers ---
[INFO] Installing /var/lib/jenkins/workspace/taverna-engine-core-maintenance/reference-testhelpers/target/reference-testhelpers-1.6-SNAPSHOT.jar to /var/lib/jenkins/workspace/taverna-engine-core-maintenance/.repository/net/sf/taverna/t2/core/reference-testhelpers/1.6-SNAPSHOT/reference-testhelpers-1.6-SNAPSHOT.jar
[INFO] Installing /var/lib/jenkins/workspace/taverna-engine-core-maintenance/reference-testhelpers/pom.xml to /var/lib/jenkins/workspace/taverna-engine-core-maintenance/.repository/net/sf/taverna/t2/core/reference-testhelpers/1.6-SNAPSHOT/reference-testhelpers-1.6-SNAPSHOT.pom
[INFO] Installing /var/lib/jenkins/workspace/taverna-engine-core-maintenance/reference-testhelpers/target/reference-testhelpers-1.6-SNAPSHOT-sources.jar to /var/lib/jenkins/workspace/taverna-engine-core-maintenance/.repository/net/sf/taverna/t2/core/reference-testhelpers/1.6-SNAPSHOT/reference-testhelpers-1.6-SNAPSHOT-sources.jar
[INFO] Installing /var/lib/jenkins/workspace/taverna-engine-core-maintenance/reference-testhelpers/target/reference-testhelpers-1.6-SNAPSHOT-tests.jar to /var/lib/jenkins/workspace/taverna-engine-core-maintenance/.repository/net/sf/taverna/t2/core/reference-testhelpers/1.6-SNAPSHOT/reference-testhelpers-1.6-SNAPSHOT-tests.jar
[INFO]                                                                         
[INFO] ------------------------------------------------------------------------
[INFO] Building Implementation package for the T2 reference manager 1.6-SNAPSHOT
[INFO] ------------------------------------------------------------------------
[INFO] Downloading: http://repository.mygrid.org.uk/artifactory/repo/net/sf/taverna/t2/infrastructure/raven/2.6-SNAPSHOT/maven-metadata.xml
[INFO] Downloaded: http://repository.mygrid.org.uk/artifactory/repo/net/sf/taverna/t2/infrastructure/raven/2.6-SNAPSHOT/maven-metadata.xml (2 KB at 2.0 KB/sec)
[INFO] Downloading: http://repository.mygrid.org.uk/artifactory/repo/net/sf/taverna/t2/infrastructure/raven/2.6-SNAPSHOT/raven-2.6-20140528.132154-6.pom
[INFO] Downloaded: http://repository.mygrid.org.uk/artifactory/repo/net/sf/taverna/t2/infrastructure/raven/2.6-SNAPSHOT/raven-2.6-20140528.132154-6.pom (2 KB at 2.5 KB/sec)
[INFO] Downloading: http://repository.mygrid.org.uk/artifactory/repo/net/sf/taverna/t2/infrastructure/2.6-SNAPSHOT/maven-metadata.xml
[INFO] Downloaded: http://repository.mygrid.org.uk/artifactory/repo/net/sf/taverna/t2/infrastructure/2.6-SNAPSHOT/maven-metadata.xml (802 B at 1.6 KB/sec)
[INFO] Downloading: http://repository.mygrid.org.uk/artifactory/repo/net/sf/taverna/t2/infrastructure/2.6-SNAPSHOT/infrastructure-2.6-20140528.132154-6.pom
[INFO] Downloaded: http://repository.mygrid.org.uk/artifactory/repo/net/sf/taverna/t2/infrastructure/2.6-SNAPSHOT/infrastructure-2.6-20140528.132154-6.pom (4 KB at 28.3 KB/sec)
[INFO] Downloading: http://repository.mygrid.org.uk/artifactory/repo/net/sf/taverna/t2/infrastructure/appconfig/2.6-SNAPSHOT/maven-metadata.xml
[INFO] Downloaded: http://repository.mygrid.org.uk/artifactory/repo/net/sf/taverna/t2/infrastructure/appconfig/2.6-SNAPSHOT/maven-metadata.xml (2 KB at 2.7 KB/sec)
[INFO] Downloading: http://repository.mygrid.org.uk/artifactory/repo/net/sf/taverna/t2/infrastructure/appconfig/2.6-SNAPSHOT/appconfig-2.6-20140528.132154-6.pom
[INFO] Downloaded: http://repository.mygrid.org.uk/artifactory/repo/net/sf/taverna/t2/infrastructure/appconfig/2.6-SNAPSHOT/appconfig-2.6-20140528.132154-6.pom (2 KB at 16.0 KB/sec)
[INFO] Downloading: http://repository.mygrid.org.uk/artifactory/repo/net/sf/taverna/t2/infrastructure/launcher-api/2.6-SNAPSHOT/maven-metadata.xml
[INFO] Downloaded: http://repository.mygrid.org.uk/artifactory/repo/net/sf/taverna/t2/infrastructure/launcher-api/2.6-SNAPSHOT/maven-metadata.xml (2 KB at 2.4 KB/sec)
[INFO] Downloading: http://repository.mygrid.org.uk/artifactory/repo/net/sf/taverna/t2/infrastructure/launcher-api/2.6-SNAPSHOT/launcher-api-2.6-20140528.132154-6.pom
[INFO] Downloaded: http://repository.mygrid.org.uk/artifactory/repo/net/sf/taverna/t2/infrastructure/launcher-api/2.6-SNAPSHOT/launcher-api-2.6-20140528.132154-6.pom (549 B at 0.5 KB/sec)
[INFO] Downloading: http://repository.mygrid.org.uk/artifactory/repo/net/sf/taverna/t2/infrastructure/prelauncher/2.6-SNAPSHOT/maven-metadata.xml
[INFO] Downloaded: http://repository.mygrid.org.uk/artifactory/repo/net/sf/taverna/t2/infrastructure/prelauncher/2.6-SNAPSHOT/maven-metadata.xml (2 KB at 3.5 KB/sec)
[INFO] Downloading: http://repository.mygrid.org.uk/artifactory/repo/net/sf/taverna/t2/infrastructure/prelauncher/2.6-SNAPSHOT/prelauncher-2.6-20140528.132154-6.pom
[INFO] Downloaded: http://repository.mygrid.org.uk/artifactory/repo/net/sf/taverna/t2/infrastructure/prelauncher/2.6-SNAPSHOT/prelauncher-2.6-20140528.132154-6.pom (2 KB at 11.3 KB/sec)
[INFO] Downloading: http://repository.mygrid.org.uk/artifactory/repo/net/sf/taverna/t2/infrastructure/raven-log4j/2.6-SNAPSHOT/maven-metadata.xml
[INFO] Downloaded: http://repository.mygrid.org.uk/artifactory/repo/net/sf/taverna/t2/infrastructure/raven-log4j/2.6-SNAPSHOT/maven-metadata.xml (2 KB at 3.2 KB/sec)
[INFO] Downloading: http://repository.mygrid.org.uk/artifactory/repo/net/sf/taverna/t2/infrastructure/raven-log4j/2.6-SNAPSHOT/raven-log4j-2.6-20140528.132154-6.pom
[INFO] Downloaded: http://repository.mygrid.org.uk/artifactory/repo/net/sf/taverna/t2/infrastructure/raven-log4j/2.6-SNAPSHOT/raven-log4j-2.6-20140528.132154-6.pom (952 B at 5.8 KB/sec)
[INFO] Downloading: http://repository.mygrid.org.uk/artifactory/repo/org/apache/derby/derby/10.6.1.0/derby-10.6.1.0.pom
[INFO] Downloaded: http://repository.mygrid.org.uk/artifactory/repo/org/apache/derby/derby/10.6.1.0/derby-10.6.1.0.pom (3 KB at 18.6 KB/sec)
[INFO] Downloading: http://repository.mygrid.org.uk/artifactory/repo/org/apache/derby/derby/10.6.1.0/derby-10.6.1.0.pom
[INFO] Downloaded: http://repository.mygrid.org.uk/artifactory/repo/org/apache/derby/derby/10.6.1.0/derby-10.6.1.0.pom (3 KB at 17.2 KB/sec)
[INFO] Downloading: http://repository.mygrid.org.uk/artifactory/repo/org/apache/derby/derby/10.6.1.0/derby-10.6.1.0.pom
[INFO] Downloaded: http://repository.mygrid.org.uk/artifactory/repo/org/apache/derby/derby/10.6.1.0/derby-10.6.1.0.pom (3 KB at 47.2 KB/sec)
[INFO] Downloading: http://repository.mygrid.org.uk/artifactory/repo/org/apache/derby/derby/10.6.1.0/derby-10.6.1.0.pom
[INFO] Downloaded: http://repository.mygrid.org.uk/artifactory/repo/org/apache/derby/derby/10.6.1.0/derby-10.6.1.0.pom (3 KB at 41.1 KB/sec)
[INFO] Downloading: http://repository.mygrid.org.uk/artifactory/repo/org/apache/derby/derby/10.6.1.0/derby-10.6.1.0.pom
[INFO] Downloaded: http://repository.mygrid.org.uk/artifactory/repo/org/apache/derby/derby/10.6.1.0/derby-10.6.1.0.pom (3 KB at 37.5 KB/sec)
[INFO] Downloading: http://repository.mygrid.org.uk/artifactory/repo/org/apache/derby/derby/10.6.1.0/derby-10.6.1.0.pom
[INFO] Downloaded: http://repository.mygrid.org.uk/artifactory/repo/org/apache/derby/derby/10.6.1.0/derby-10.6.1.0.pom (3 KB at 41.8 KB/sec)
[INFO] Downloading: http://repository.mygrid.org.uk/artifactory/repo/org/apache/derby/derby/10.6.1.0/derby-10.6.1.0.pom
[INFO] Downloaded: http://repository.mygrid.org.uk/artifactory/repo/org/apache/derby/derby/10.6.1.0/derby-10.6.1.0.pom (3 KB at 46.4 KB/sec)
[INFO] Downloading: http://repository.mygrid.org.uk/artifactory/repo/org/apache/derby/derby-project/10.6.1.0/derby-project-10.6.1.0.pom
[INFO] Downloaded: http://repository.mygrid.org.uk/artifactory/repo/org/apache/derby/derby-project/10.6.1.0/derby-project-10.6.1.0.pom (7 KB at 78.7 KB/sec)
[INFO] Downloading: http://repository.mygrid.org.uk/artifactory/repo/org/hibernate/hibernate/3.2.5.ga.raven/hibernate-3.2.5.ga.raven.pom
[INFO] Downloaded: http://repository.mygrid.org.uk/artifactory/repo/org/hibernate/hibernate/3.2.5.ga.raven/hibernate-3.2.5.ga.raven.pom (4 KB at 26.2 KB/sec)
[INFO] Downloading: http://repository.mygrid.org.uk/artifactory/repo/commons-logging/commons-logging/1.0.4/commons-logging-1.0.4.pom
[INFO] Downloaded: http://repository.mygrid.org.uk/artifactory/repo/commons-logging/commons-logging/1.0.4/commons-logging-1.0.4.pom (6 KB at 100.8 KB/sec)
[INFO] Downloading: http://repository.mygrid.org.uk/artifactory/repo/dom4j/dom4j/1.6.1/dom4j-1.6.1.pom
[INFO] Downloaded: http://repository.mygrid.org.uk/artifactory/repo/dom4j/dom4j/1.6.1/dom4j-1.6.1.pom (7 KB at 72.6 KB/sec)
[INFO] Downloading: http://repository.mygrid.org.uk/artifactory/repo/cglib/cglib/2.1_3/cglib-2.1_3.pom
[INFO] Downloaded: http://repository.mygrid.org.uk/artifactory/repo/cglib/cglib/2.1_3/cglib-2.1_3.pom (373 B at 5.3 KB/sec)
[INFO] Downloading: http://repository.mygrid.org.uk/artifactory/repo/asm/asm/1.5.3/asm-1.5.3.pom
[INFO] Downloaded: http://repository.mygrid.org.uk/artifactory/repo/asm/asm/1.5.3/asm-1.5.3.pom (809 B at 11.8 KB/sec)
[INFO] Downloading: http://repository.mygrid.org.uk/artifactory/repo/commons-collections/commons-collections/2.1.1/commons-collections-2.1.1.pom
[INFO] Downloaded: http://repository.mygrid.org.uk/artifactory/repo/commons-collections/commons-collections/2.1.1/commons-collections-2.1.1.pom (172 B at 2.6 KB/sec)
[INFO] Downloading: http://repository.mygrid.org.uk/artifactory/repo/geronimo-spec/geronimo-spec-jta/1.0-M1/geronimo-spec-jta-1.0-M1.pom
[INFO] Downloaded: http://repository.mygrid.org.uk/artifactory/repo/geronimo-spec/geronimo-spec-jta/1.0-M1/geronimo-spec-jta-1.0-M1.pom (165 B at 1.7 KB/sec)
[INFO] Downloading: http://repository.mygrid.org.uk/artifactory/repo/org/springframework/spring-orm/2.5.4/spring-orm-2.5.4.pom
[INFO] Downloaded: http://repository.mygrid.org.uk/artifactory/repo/org/springframework/spring-orm/2.5.4/spring-orm-2.5.4.pom (5 KB at 104.5 KB/sec)
[INFO] Downloading: http://repository.mygrid.org.uk/artifactory/repo/org/springframework/spring-aop/2.5.4/spring-aop-2.5.4.pom
[INFO] Downloaded: http://repository.mygrid.org.uk/artifactory/repo/org/springframework/spring-aop/2.5.4/spring-aop-2.5.4.pom (4 KB at 72.4 KB/sec)
[INFO] Downloading: http://repository.mygrid.org.uk/artifactory/repo/org/springframework/spring-jdbc/2.5.4/spring-jdbc-2.5.4.pom
[INFO] Downloaded: http://repository.mygrid.org.uk/artifactory/repo/org/springframework/spring-jdbc/2.5.4/spring-jdbc-2.5.4.pom (3 KB at 52.5 KB/sec)
[INFO] Downloading: http://repository.mygrid.org.uk/artifactory/repo/org/aspectj/aspectjrt/1.6.9/aspectjrt-1.6.9.pom
[INFO] Downloaded: http://repository.mygrid.org.uk/artifactory/repo/org/aspectj/aspectjrt/1.6.9/aspectjrt-1.6.9.pom (905 B at 8.9 KB/sec)
[INFO] Downloading: http://repository.mygrid.org.uk/artifactory/repo/org/aspectj/aspectjweaver/1.6.9/aspectjweaver-1.6.9.pom
[INFO] Downloaded: http://repository.mygrid.org.uk/artifactory/repo/org/aspectj/aspectjweaver/1.6.9/aspectjweaver-1.6.9.pom (908 B at 21.1 KB/sec)
[INFO] Downloading: http://repository.mygrid.org.uk/artifactory/repo/antlr/antlr/2.7.7/antlr-2.7.7.pom
[INFO] Downloaded: http://repository.mygrid.org.uk/artifactory/repo/antlr/antlr/2.7.7/antlr-2.7.7.pom (632 B at 11.6 KB/sec)
[INFO] Downloading: http://repository.mygrid.org.uk/artifactory/repo/junit/junit/4.8.1/junit-4.8.1.pom
[INFO] Downloaded: http://repository.mygrid.org.uk/artifactory/repo/junit/junit/4.8.1/junit-4.8.1.pom (949 B at 12.9 KB/sec)
[INFO] Downloading: http://repository.mygrid.org.uk/artifactory/repo/net/sf/taverna/t2/infrastructure/raven/2.6-SNAPSHOT/maven-metadata.xml
[INFO] Downloading: http://repository.mygrid.org.uk/artifactory/repo/net/sf/taverna/t2/infrastructure/raven/2.6-SNAPSHOT/maven-metadata.xml
[INFO] Downloading: http://repository.mygrid.org.uk/artifactory/repo/net/sf/taverna/t2/infrastructure/raven/2.6-SNAPSHOT/maven-metadata.xml
[INFO] Downloading: http://repository.mygrid.org.uk/artifactory/repo/net/sf/taverna/t2/infrastructure/raven/2.6-SNAPSHOT/maven-metadata.xml
[INFO] Downloaded: http://repository.mygrid.org.uk/artifactory/repo/net/sf/taverna/t2/infrastructure/raven/2.6-SNAPSHOT/maven-metadata.xml (2 KB at 8.0 KB/sec)
[INFO] Downloaded: http://repository.mygrid.org.uk/artifactory/repo/net/sf/taverna/t2/infrastructure/raven/2.6-SNAPSHOT/maven-metadata.xml (2 KB at 7.4 KB/sec)
[INFO] Downloading: http://repository.mygrid.org.uk/artifactory/repo/net/sf/taverna/t2/infrastructure/raven/2.6-SNAPSHOT/maven-metadata.xml
[INFO] Downloaded: http://repository.mygrid.org.uk/artifactory/repo/net/sf/taverna/t2/infrastructure/raven/2.6-SNAPSHOT/maven-metadata.xml (2 KB at 7.1 KB/sec)
[INFO] Downloaded: http://repository.mygrid.org.uk/artifactory/repo/net/sf/taverna/t2/infrastructure/raven/2.6-SNAPSHOT/maven-metadata.xml (2 KB at 7.1 KB/sec)
[INFO] Downloading: http://repository.mygrid.org.uk/artifactory/repo/net/sf/taverna/t2/infrastructure/raven/2.6-SNAPSHOT/maven-metadata.xml
[INFO] Downloading: http://repository.mygrid.org.uk/artifactory/repo/net/sf/taverna/t2/infrastructure/raven/2.6-SNAPSHOT/maven-metadata.xml
[INFO] Downloaded: http://repository.mygrid.org.uk/artifactory/repo/net/sf/taverna/t2/infrastructure/raven/2.6-SNAPSHOT/maven-metadata.xml (2 KB at 7.3 KB/sec)
[INFO] Downloaded: http://repository.mygrid.org.uk/artifactory/repo/net/sf/taverna/t2/infrastructure/raven/2.6-SNAPSHOT/maven-metadata.xml (2 KB at 7.6 KB/sec)
[INFO] Downloaded: http://repository.mygrid.org.uk/artifactory/repo/net/sf/taverna/t2/infrastructure/raven/2.6-SNAPSHOT/maven-metadata.xml (2 KB at 7.1 KB/sec)
[INFO] Downloading: http://repository.mygrid.org.uk/artifactory/repo/net/sf/taverna/t2/infrastructure/appconfig/2.6-SNAPSHOT/maven-metadata.xml
[INFO] Downloading: http://repository.mygrid.org.uk/artifactory/repo/net/sf/taverna/t2/infrastructure/appconfig/2.6-SNAPSHOT/maven-metadata.xml
[INFO] Downloading: http://repository.mygrid.org.uk/artifactory/repo/net/sf/taverna/t2/infrastructure/appconfig/2.6-SNAPSHOT/maven-metadata.xml
[INFO] Downloading: http://repository.mygrid.org.uk/artifactory/repo/net/sf/taverna/t2/infrastructure/appconfig/2.6-SNAPSHOT/maven-metadata.xml
[INFO] Downloaded: http://repository.mygrid.org.uk/artifactory/repo/net/sf/taverna/t2/infrastructure/appconfig/2.6-SNAPSHOT/maven-metadata.xml (2 KB at 9.1 KB/sec)
[INFO] Downloaded: http://repository.mygrid.org.uk/artifactory/repo/net/sf/taverna/t2/infrastructure/appconfig/2.6-SNAPSHOT/maven-metadata.xml (2 KB at 9.6 KB/sec)
[INFO] Downloaded: http://repository.mygrid.org.uk/artifactory/repo/net/sf/taverna/t2/infrastructure/appconfig/2.6-SNAPSHOT/maven-metadata.xml (2 KB at 8.8 KB/sec)
[INFO] Downloading: http://repository.mygrid.org.uk/artifactory/repo/net/sf/taverna/t2/infrastructure/appconfig/2.6-SNAPSHOT/maven-metadata.xml
[INFO] Downloaded: http://repository.mygrid.org.uk/artifactory/repo/net/sf/taverna/t2/infrastructure/appconfig/2.6-SNAPSHOT/maven-metadata.xml (2 KB at 9.8 KB/sec)
[INFO] Downloading: http://repository.mygrid.org.uk/artifactory/repo/net/sf/taverna/t2/infrastructure/appconfig/2.6-SNAPSHOT/maven-metadata.xml
[INFO] Downloading: http://repository.mygrid.org.uk/artifactory/repo/net/sf/taverna/t2/infrastructure/appconfig/2.6-SNAPSHOT/maven-metadata.xml
[INFO] Downloaded: http://repository.mygrid.org.uk/artifactory/repo/net/sf/taverna/t2/infrastructure/appconfig/2.6-SNAPSHOT/maven-metadata.xml (2 KB at 11.2 KB/sec)
[INFO] Downloaded: http://repository.mygrid.org.uk/artifactory/repo/net/sf/taverna/t2/infrastructure/appconfig/2.6-SNAPSHOT/maven-metadata.xml (2 KB at 11.4 KB/sec)
[INFO] Downloaded: http://repository.mygrid.org.uk/artifactory/repo/net/sf/taverna/t2/infrastructure/appconfig/2.6-SNAPSHOT/maven-metadata.xml (2 KB at 11.4 KB/sec)
[INFO] Downloading: http://repository.mygrid.org.uk/artifactory/repo/net/sf/taverna/t2/infrastructure/launcher-api/2.6-SNAPSHOT/maven-metadata.xml
[INFO] Downloading: http://repository.mygrid.org.uk/artifactory/repo/net/sf/taverna/t2/infrastructure/launcher-api/2.6-SNAPSHOT/maven-metadata.xml
[INFO] Downloading: http://repository.mygrid.org.uk/artifactory/repo/net/sf/taverna/t2/infrastructure/launcher-api/2.6-SNAPSHOT/maven-metadata.xml
[INFO] Downloading: http://repository.mygrid.org.uk/artifactory/repo/net/sf/taverna/t2/infrastructure/launcher-api/2.6-SNAPSHOT/maven-metadata.xml
[INFO] Downloaded: http://repository.mygrid.org.uk/artifactory/repo/net/sf/taverna/t2/infrastructure/launcher-api/2.6-SNAPSHOT/maven-metadata.xml (2 KB at 6.2 KB/sec)
[INFO] Downloaded: http://repository.mygrid.org.uk/artifactory/repo/net/sf/taverna/t2/infrastructure/launcher-api/2.6-SNAPSHOT/maven-metadata.xml (2 KB at 6.4 KB/sec)
[INFO] Downloaded: http://repository.mygrid.org.uk/artifactory/repo/net/sf/taverna/t2/infrastructure/launcher-api/2.6-SNAPSHOT/maven-metadata.xml (2 KB at 6.3 KB/sec)
[INFO] Downloading: http://repository.mygrid.org.uk/artifactory/repo/net/sf/taverna/t2/infrastructure/launcher-api/2.6-SNAPSHOT/maven-metadata.xml
[INFO] Downloading: http://repository.mygrid.org.uk/artifactory/repo/net/sf/taverna/t2/infrastructure/launcher-api/2.6-SNAPSHOT/maven-metadata.xml
[INFO] Downloaded: http://repository.mygrid.org.uk/artifactory/repo/net/sf/taverna/t2/infrastructure/launcher-api/2.6-SNAPSHOT/maven-metadata.xml (2 KB at 6.1 KB/sec)
[INFO] Downloading: http://repository.mygrid.org.uk/artifactory/repo/net/sf/taverna/t2/infrastructure/launcher-api/2.6-SNAPSHOT/maven-metadata.xml
[INFO] Downloaded: http://repository.mygrid.org.uk/artifactory/repo/net/sf/taverna/t2/infrastructure/launcher-api/2.6-SNAPSHOT/maven-metadata.xml (2 KB at 12.7 KB/sec)
[INFO] Downloaded: http://repository.mygrid.org.uk/artifactory/repo/net/sf/taverna/t2/infrastructure/launcher-api/2.6-SNAPSHOT/maven-metadata.xml (2 KB at 12.6 KB/sec)
[INFO] Downloaded: http://repository.mygrid.org.uk/artifactory/repo/net/sf/taverna/t2/infrastructure/launcher-api/2.6-SNAPSHOT/maven-metadata.xml (2 KB at 12.3 KB/sec)
[INFO] Downloading: http://repository.mygrid.org.uk/artifactory/repo/net/sf/taverna/t2/infrastructure/prelauncher/2.6-SNAPSHOT/maven-metadata.xml
[INFO] Downloading: http://repository.mygrid.org.uk/artifactory/repo/net/sf/taverna/t2/infrastructure/prelauncher/2.6-SNAPSHOT/maven-metadata.xml
[INFO] Downloading: http://repository.mygrid.org.uk/artifactory/repo/net/sf/taverna/t2/infrastructure/prelauncher/2.6-SNAPSHOT/maven-metadata.xml
[INFO] Downloading: http://repository.mygrid.org.uk/artifactory/repo/net/sf/taverna/t2/infrastructure/prelauncher/2.6-SNAPSHOT/maven-metadata.xml
[INFO] Downloaded: http://repository.mygrid.org.uk/artifactory/repo/net/sf/taverna/t2/infrastructure/prelauncher/2.6-SNAPSHOT/maven-metadata.xml (2 KB at 11.9 KB/sec)
[INFO] Downloading: http://repository.mygrid.org.uk/artifactory/repo/net/sf/taverna/t2/infrastructure/prelauncher/2.6-SNAPSHOT/maven-metadata.xml
[INFO] Downloaded: http://repository.mygrid.org.uk/artifactory/repo/net/sf/taverna/t2/infrastructure/prelauncher/2.6-SNAPSHOT/maven-metadata.xml (2 KB at 10.5 KB/sec)
[INFO] Downloaded: http://repository.mygrid.org.uk/artifactory/repo/net/sf/taverna/t2/infrastructure/prelauncher/2.6-SNAPSHOT/maven-metadata.xml (2 KB at 10.5 KB/sec)
[INFO] Downloaded: http://repository.mygrid.org.uk/artifactory/repo/net/sf/taverna/t2/infrastructure/prelauncher/2.6-SNAPSHOT/maven-metadata.xml (2 KB at 10.2 KB/sec)
[INFO] Downloading: http://repository.mygrid.org.uk/artifactory/repo/net/sf/taverna/t2/infrastructure/prelauncher/2.6-SNAPSHOT/maven-metadata.xml
[INFO] Downloading: http://repository.mygrid.org.uk/artifactory/repo/net/sf/taverna/t2/infrastructure/prelauncher/2.6-SNAPSHOT/maven-metadata.xml
[INFO] Downloaded: http://repository.mygrid.org.uk/artifactory/repo/net/sf/taverna/t2/infrastructure/prelauncher/2.6-SNAPSHOT/maven-metadata.xml (2 KB at 12.3 KB/sec)
[INFO] Downloaded: http://repository.mygrid.org.uk/artifactory/repo/net/sf/taverna/t2/infrastructure/prelauncher/2.6-SNAPSHOT/maven-metadata.xml (2 KB at 12.9 KB/sec)
[INFO] Downloaded: http://repository.mygrid.org.uk/artifactory/repo/net/sf/taverna/t2/infrastructure/prelauncher/2.6-SNAPSHOT/maven-metadata.xml (2 KB at 12.9 KB/sec)
[INFO] Downloading: http://repository.mygrid.org.uk/artifactory/repo/net/sf/taverna/t2/infrastructure/raven-log4j/2.6-SNAPSHOT/maven-metadata.xml
[INFO] Downloading: http://repository.mygrid.org.uk/artifactory/repo/net/sf/taverna/t2/infrastructure/raven-log4j/2.6-SNAPSHOT/maven-metadata.xml
[INFO] Downloading: http://repository.mygrid.org.uk/artifactory/repo/net/sf/taverna/t2/infrastructure/raven-log4j/2.6-SNAPSHOT/maven-metadata.xml
[INFO] Downloading: http://repository.mygrid.org.uk/artifactory/repo/net/sf/taverna/t2/infrastructure/raven-log4j/2.6-SNAPSHOT/maven-metadata.xml
[INFO] Downloaded: http://repository.mygrid.org.uk/artifactory/repo/net/sf/taverna/t2/infrastructure/raven-log4j/2.6-SNAPSHOT/maven-metadata.xml (2 KB at 6.7 KB/sec)
[INFO] Downloaded: http://repository.mygrid.org.uk/artifactory/repo/net/sf/taverna/t2/infrastructure/raven-log4j/2.6-SNAPSHOT/maven-metadata.xml (2 KB at 6.6 KB/sec)
[INFO] Downloaded: http://repository.mygrid.org.uk/artifactory/repo/net/sf/taverna/t2/infrastructure/raven-log4j/2.6-SNAPSHOT/maven-metadata.xml (2 KB at 6.4 KB/sec)
[INFO] Downloaded: http://repository.mygrid.org.uk/artifactory/repo/net/sf/taverna/t2/infrastructure/raven-log4j/2.6-SNAPSHOT/maven-metadata.xml (2 KB at 6.1 KB/sec)
[INFO] Downloading: http://repository.mygrid.org.uk/artifactory/repo/net/sf/taverna/t2/infrastructure/raven-log4j/2.6-SNAPSHOT/maven-metadata.xml
[INFO] Downloading: http://repository.mygrid.org.uk/artifactory/repo/net/sf/taverna/t2/infrastructure/raven-log4j/2.6-SNAPSHOT/maven-metadata.xml
[INFO] Downloading: http://repository.mygrid.org.uk/artifactory/repo/net/sf/taverna/t2/infrastructure/raven-log4j/2.6-SNAPSHOT/maven-metadata.xml
[INFO] Downloaded: http://repository.mygrid.org.uk/artifactory/repo/net/sf/taverna/t2/infrastructure/raven-log4j/2.6-SNAPSHOT/maven-metadata.xml (2 KB at 10.9 KB/sec)
[INFO] Downloaded: http://repository.mygrid.org.uk/artifactory/repo/net/sf/taverna/t2/infrastructure/raven-log4j/2.6-SNAPSHOT/maven-metadata.xml (2 KB at 11.5 KB/sec)
[INFO] Downloaded: http://repository.mygrid.org.uk/artifactory/repo/net/sf/taverna/t2/infrastructure/raven-log4j/2.6-SNAPSHOT/maven-metadata.xml (2 KB at 11.3 KB/sec)
[INFO] Downloading: http://repository.mygrid.org.uk/artifactory/repo/net/sf/taverna/t2/infrastructure/raven/2.6-SNAPSHOT/raven-2.6-20140528.132154-6.jar
[INFO] Downloading: http://repository.mygrid.org.uk/artifactory/repo/net/sf/taverna/t2/infrastructure/appconfig/2.6-SNAPSHOT/appconfig-2.6-20140528.132154-6.jar
[INFO] Downloading: http://repository.mygrid.org.uk/artifactory/repo/net/sf/taverna/t2/infrastructure/launcher-api/2.6-SNAPSHOT/launcher-api-2.6-20140528.132154-6.jar
[INFO] Downloading: http://repository.mygrid.org.uk/artifactory/repo/net/sf/taverna/t2/infrastructure/prelauncher/2.6-SNAPSHOT/prelauncher-2.6-20140528.132154-6.jar
[INFO] Downloading: http://repository.mygrid.org.uk/artifactory/repo/net/sf/taverna/t2/infrastructure/raven-log4j/2.6-SNAPSHOT/raven-log4j-2.6-20140528.132154-6.jar
[INFO] Downloaded: http://repository.mygrid.org.uk/artifactory/repo/net/sf/taverna/t2/infrastructure/prelauncher/2.6-SNAPSHOT/prelauncher-2.6-20140528.132154-6.jar (9 KB at 32.6 KB/sec)
[INFO] Downloading: http://repository.mygrid.org.uk/artifactory/repo/org/apache/derby/derby/10.6.1.0/derby-10.6.1.0.jar
[INFO] Downloaded: http://repository.mygrid.org.uk/artifactory/repo/net/sf/taverna/t2/infrastructure/launcher-api/2.6-SNAPSHOT/launcher-api-2.6-20140528.132154-6.jar (3 KB at 9.0 KB/sec)
[INFO] Downloading: http://repository.mygrid.org.uk/artifactory/repo/org/hibernate/hibernate/3.2.5.ga.raven/hibernate-3.2.5.ga.raven.jar
[INFO] Downloaded: http://repository.mygrid.org.uk/artifactory/repo/net/sf/taverna/t2/infrastructure/raven/2.6-SNAPSHOT/raven-2.6-20140528.132154-6.jar (85 KB at 216.1 KB/sec)
[INFO] Downloading: http://repository.mygrid.org.uk/artifactory/repo/dom4j/dom4j/1.6.1/dom4j-1.6.1.jar
[INFO] Downloaded: http://repository.mygrid.org.uk/artifactory/repo/net/sf/taverna/t2/infrastructure/raven-log4j/2.6-SNAPSHOT/raven-log4j-2.6-20140528.132154-6.jar (4 KB at 9.1 KB/sec)
[INFO] Downloading: http://repository.mygrid.org.uk/artifactory/repo/cglib/cglib/2.1_3/cglib-2.1_3.jar
[INFO] Downloaded: http://repository.mygrid.org.uk/artifactory/repo/net/sf/taverna/t2/infrastructure/appconfig/2.6-SNAPSHOT/appconfig-2.6-20140528.132154-6.jar (29 KB at 44.0 KB/sec)
[INFO] Downloading: http://repository.mygrid.org.uk/artifactory/repo/asm/asm/1.5.3/asm-1.5.3.jar
[INFO] Downloaded: http://repository.mygrid.org.uk/artifactory/repo/dom4j/dom4j/1.6.1/dom4j-1.6.1.jar (307 KB at 742.2 KB/sec)
[INFO] Downloading: http://repository.mygrid.org.uk/artifactory/repo/commons-collections/commons-collections/2.1.1/commons-collections-2.1.1.jar
[INFO] Downloaded: http://repository.mygrid.org.uk/artifactory/repo/org/apache/derby/derby/10.6.1.0/derby-10.6.1.0.jar (2563 KB at 4417.3 KB/sec)
[INFO] Downloading: http://repository.mygrid.org.uk/artifactory/repo/geronimo-spec/geronimo-spec-jta/1.0-M1/geronimo-spec-jta-1.0-M1.jar
[INFO] Downloaded: http://repository.mygrid.org.uk/artifactory/repo/cglib/cglib/2.1_3/cglib-2.1_3.jar (276 KB at 533.3 KB/sec)
[INFO] Downloading: http://repository.mygrid.org.uk/artifactory/repo/org/springframework/spring-orm/2.5.4/spring-orm-2.5.4.jar
[INFO] Downloaded: http://repository.mygrid.org.uk/artifactory/repo/geronimo-spec/geronimo-spec-jta/1.0-M1/geronimo-spec-jta-1.0-M1.jar (14 KB at 193.5 KB/sec)
[INFO] Downloading: http://repository.mygrid.org.uk/artifactory/repo/org/springframework/spring-aop/2.5.4/spring-aop-2.5.4.jar
[INFO] Downloaded: http://repository.mygrid.org.uk/artifactory/repo/commons-collections/commons-collections/2.1.1/commons-collections-2.1.1.jar (172 KB at 1278.5 KB/sec)
[INFO] Downloading: http://repository.mygrid.org.uk/artifactory/repo/org/springframework/spring-jdbc/2.5.4/spring-jdbc-2.5.4.jar
[INFO] Downloaded: http://repository.mygrid.org.uk/artifactory/repo/asm/asm/1.5.3/asm-1.5.3.jar (26 KB at 65.3 KB/sec)
[INFO] Downloading: http://repository.mygrid.org.uk/artifactory/repo/org/aspectj/aspectjrt/1.6.9/aspectjrt-1.6.9.jar
[INFO] Downloaded: http://repository.mygrid.org.uk/artifactory/repo/org/aspectj/aspectjrt/1.6.9/aspectjrt-1.6.9.jar (114 KB at 1953.8 KB/sec)
[INFO] Downloading: http://repository.mygrid.org.uk/artifactory/repo/org/aspectj/aspectjweaver/1.6.9/aspectjweaver-1.6.9.jar
[INFO] Downloaded: http://repository.mygrid.org.uk/artifactory/repo/org/springframework/spring-jdbc/2.5.4/spring-jdbc-2.5.4.jar (310 KB at 1710.0 KB/sec)
[INFO] Downloading: http://repository.mygrid.org.uk/artifactory/repo/antlr/antlr/2.7.7/antlr-2.7.7.jar
[INFO] Downloaded: http://repository.mygrid.org.uk/artifactory/repo/org/springframework/spring-aop/2.5.4/spring-aop-2.5.4.jar (319 KB at 889.6 KB/sec)
[INFO] Downloading: http://repository.mygrid.org.uk/artifactory/repo/junit/junit/4.8.1/junit-4.8.1.jar
[INFO] Downloaded: http://repository.mygrid.org.uk/artifactory/repo/junit/junit/4.8.1/junit-4.8.1.jar (232 KB at 1913.2 KB/sec)
[INFO] Downloaded: http://repository.mygrid.org.uk/artifactory/repo/org/aspectj/aspectjweaver/1.6.9/aspectjweaver-1.6.9.jar (1625 KB at 5680.5 KB/sec)
[INFO] Downloaded: http://repository.mygrid.org.uk/artifactory/repo/antlr/antlr/2.7.7/antlr-2.7.7.jar (435 KB at 1231.9 KB/sec)
[INFO] Downloaded: http://repository.mygrid.org.uk/artifactory/repo/org/springframework/spring-orm/2.5.4/spring-orm-2.5.4.jar (364 KB at 622.0 KB/sec)
[INFO] Downloaded: http://repository.mygrid.org.uk/artifactory/repo/org/hibernate/hibernate/3.2.5.ga.raven/hibernate-3.2.5.ga.raven.jar (2224 KB at 1454.2 KB/sec)
[INFO] 
[INFO] --- maven-clean-plugin:2.5:clean (default-clean) @ reference-impl ---
[INFO] 
[INFO] --- maven-resources-plugin:2.6:resources (default-resources) @ reference-impl ---
[INFO] Using 'UTF-8' encoding to copy filtered resources.
[INFO] Copying 8 resources
[INFO] 
[INFO] --- maven-compiler-plugin:3.1:compile (default-compile) @ reference-impl ---
[INFO] Changes detected - recompiling the module!
[INFO] Compiling 53 source files to /var/lib/jenkins/workspace/taverna-engine-core-maintenance/reference-impl/target/classes
[WARNING] /var/lib/jenkins/workspace/taverna-engine-core-maintenance/reference-impl/src/main/java/net/sf/taverna/platform/spring/RepositoryFactoryBean.java: /var/lib/jenkins/workspace/taverna-engine-core-maintenance/reference-impl/src/main/java/net/sf/taverna/platform/spring/RepositoryFactoryBean.java uses or overrides a deprecated API.
[WARNING] /var/lib/jenkins/workspace/taverna-engine-core-maintenance/reference-impl/src/main/java/net/sf/taverna/platform/spring/RepositoryFactoryBean.java: Recompile with -Xlint:deprecation for details.
[WARNING] /var/lib/jenkins/workspace/taverna-engine-core-maintenance/reference-impl/src/main/java/net/sf/taverna/t2/reference/impl/ReferenceServiceImpl.java: Some input files use unchecked or unsafe operations.
[WARNING] /var/lib/jenkins/workspace/taverna-engine-core-maintenance/reference-impl/src/main/java/net/sf/taverna/t2/reference/impl/ReferenceServiceImpl.java: Recompile with -Xlint:unchecked for details.
[INFO] 
[INFO] --- maven-resources-plugin:2.6:testResources (default-testResources) @ reference-impl ---
[INFO] Using 'UTF-8' encoding to copy filtered resources.
[INFO] Copying 5 resources
[INFO] 
[INFO] --- maven-compiler-plugin:3.1:testCompile (default-testCompile) @ reference-impl ---
[INFO] Changes detected - recompiling the module!
[INFO] Compiling 12 source files to /var/lib/jenkins/workspace/taverna-engine-core-maintenance/reference-impl/target/test-classes
[WARNING] /var/lib/jenkins/workspace/taverna-engine-core-maintenance/reference-impl/src/test/java/net/sf/taverna/t2/reference/impl/ReferenceSetServiceTest.java: /var/lib/jenkins/workspace/taverna-engine-core-maintenance/reference-impl/src/test/java/net/sf/taverna/t2/reference/impl/ReferenceSetServiceTest.java uses unchecked or unsafe operations.
[WARNING] /var/lib/jenkins/workspace/taverna-engine-core-maintenance/reference-impl/src/test/java/net/sf/taverna/t2/reference/impl/ReferenceSetServiceTest.java: Recompile with -Xlint:unchecked for details.
[INFO] 
[INFO] --- maven-surefire-plugin:2.17:test (default-test) @ reference-impl ---
[INFO] Surefire report directory: /var/lib/jenkins/workspace/taverna-engine-core-maintenance/reference-impl/target/surefire-reports
[INFO] Downloading: http://repository.mygrid.org.uk/artifactory/repo/org/apache/maven/surefire/surefire-junit4/2.17/surefire-junit4-2.17.pom
[INFO] Downloaded: http://repository.mygrid.org.uk/artifactory/repo/org/apache/maven/surefire/surefire-junit4/2.17/surefire-junit4-2.17.pom (3 KB at 20.1 KB/sec)
[INFO] Downloading: http://repository.mygrid.org.uk/artifactory/repo/org/apache/maven/surefire/surefire-junit4/2.17/surefire-junit4-2.17.pom
[INFO] Downloaded: http://repository.mygrid.org.uk/artifactory/repo/org/apache/maven/surefire/surefire-junit4/2.17/surefire-junit4-2.17.pom (3 KB at 64.0 KB/sec)
[INFO] Downloading: http://repository.mygrid.org.uk/artifactory/repo/org/apache/maven/surefire/surefire-providers/2.17/surefire-providers-2.17.pom
[INFO] Downloaded: http://repository.mygrid.org.uk/artifactory/repo/org/apache/maven/surefire/surefire-providers/2.17/surefire-providers-2.17.pom (3 KB at 58.1 KB/sec)
[INFO] Downloading: http://repository.mygrid.org.uk/artifactory/repo/org/apache/maven/surefire/surefire-junit4/2.17/surefire-junit4-2.17.jar
[INFO] Downloaded: http://repository.mygrid.org.uk/artifactory/repo/org/apache/maven/surefire/surefire-junit4/2.17/surefire-junit4-2.17.jar (63 KB at 1082.9 KB/sec)
[INFO] Downloading: http://repository.mygrid.org.uk/artifactory/repo/org/apache/maven/surefire/surefire-junit4/2.17/surefire-junit4-2.17.jar
[INFO] Downloaded: http://repository.mygrid.org.uk/artifactory/repo/org/apache/maven/surefire/surefire-junit4/2.17/surefire-junit4-2.17.jar (63 KB at 1336.4 KB/sec)

-------------------------------------------------------
 T E S T S
-------------------------------------------------------
Running net.sf.taverna.t2.reference.impl.DatabaseSetupTest
INFO - InterpolatingDriverManagerDataSource.getConnectionFromDriverManager(140) | Loaded non raven JDBC driver: org.apache.derby.jdbc.EmbeddedDriver
INFO - InterpolatingDriverManagerDataSource.getConnectionFromDriverManager(140) | Loaded non raven JDBC driver: org.apache.derby.jdbc.EmbeddedDriver
t2:list//testNamespace?list1/false/1
  1) t2:ref//testNamespace?item1
  2) t2:ref//testNamespace?item2

t2:list//testNamespace?list1/false/1
  1) t2:ref//testNamespace?item1
  2) t2:ref//testNamespace?item2

Tests run: 2, Failures: 0, Errors: 0, Skipped: 0, Time elapsed: 9.179 sec - in net.sf.taverna.t2.reference.impl.DatabaseSetupTest
Running net.sf.taverna.t2.reference.impl.ReferenceSetDaoTest
Tests run: 4, Failures: 0, Errors: 0, Skipped: 0, Time elapsed: 0.668 sec - in net.sf.taverna.t2.reference.impl.ReferenceSetDaoTest
Running net.sf.taverna.t2.reference.impl.ErrorDocumentDaoTest
Tests run: 4, Failures: 0, Errors: 0, Skipped: 0, Time elapsed: 0.486 sec - in net.sf.taverna.t2.reference.impl.ErrorDocumentDaoTest
Running net.sf.taverna.t2.reference.impl.TranslationPathTest
Tests run: 2, Failures: 0, Errors: 0, Skipped: 0, Time elapsed: 2.026 sec - in net.sf.taverna.t2.reference.impl.TranslationPathTest
Running net.sf.taverna.t2.reference.impl.ReferenceSetServiceTest
Tests run: 2, Failures: 0, Errors: 0, Skipped: 0, Time elapsed: 0.294 sec - in net.sf.taverna.t2.reference.impl.ReferenceSetServiceTest
Running net.sf.taverna.t2.reference.impl.ErrorDocumentServiceTest
Tests run: 2, Failures: 0, Errors: 0, Skipped: 0, Time elapsed: 0.231 sec - in net.sf.taverna.t2.reference.impl.ErrorDocumentServiceTest
Running net.sf.taverna.t2.reference.impl.ListDaoTest
Tests run: 4, Failures: 0, Errors: 0, Skipped: 0, Time elapsed: 0.31 sec - in net.sf.taverna.t2.reference.impl.ListDaoTest
Running net.sf.taverna.t2.reference.impl.ListServiceTest
Tests run: 2, Failures: 0, Errors: 0, Skipped: 0, Time elapsed: 0.165 sec - in net.sf.taverna.t2.reference.impl.ListServiceTest
Running net.sf.taverna.platform.spring.PropertyInterpolatorTest
Tests run: 1, Failures: 0, Errors: 0, Skipped: 0, Time elapsed: 0.002 sec - in net.sf.taverna.platform.spring.PropertyInterpolatorTest
Running net.sf.taverna.platform.spring.jdbc.TemporaryJDBCTest
Tests run: 1, Failures: 0, Errors: 0, Skipped: 0, Time elapsed: 0.009 sec - in net.sf.taverna.platform.spring.jdbc.TemporaryJDBCTest

Results :

Tests run: 24, Failures: 0, Errors: 0, Skipped: 0

[JENKINS] Recording test results
[INFO] 
[INFO] --- maven-jar-plugin:2.4:jar (default-jar) @ reference-impl ---
[INFO] Building jar: /var/lib/jenkins/workspace/taverna-engine-core-maintenance/reference-impl/target/reference-impl-1.6-SNAPSHOT.jar
[INFO] 
[INFO] >>> maven-source-plugin:2.2.1:jar (default) @ reference-impl >>>
[WARNING] Failed to getClass for org.apache.maven.plugin.source.SourceJarMojo
[INFO] 
[INFO] <<< maven-source-plugin:2.2.1:jar (default) @ reference-impl <<<
[INFO] 
[INFO] --- maven-source-plugin:2.2.1:jar (default) @ reference-impl ---
[INFO] Building jar: /var/lib/jenkins/workspace/taverna-engine-core-maintenance/reference-impl/target/reference-impl-1.6-SNAPSHOT-sources.jar
[INFO] 
[INFO] >>> maven-source-plugin:2.2.1:test-jar (default) @ reference-impl >>>
[WARNING] Failed to getClass for org.apache.maven.plugin.source.TestSourceJarMojo
[INFO] 
[INFO] <<< maven-source-plugin:2.2.1:test-jar (default) @ reference-impl <<<
[INFO] 
[INFO] --- maven-source-plugin:2.2.1:test-jar (default) @ reference-impl ---
[INFO] Building jar: /var/lib/jenkins/workspace/taverna-engine-core-maintenance/reference-impl/target/reference-impl-1.6-SNAPSHOT-test-sources.jar
[INFO] 
[INFO] --- maven-jar-plugin:2.4:test-jar (default) @ reference-impl ---
[INFO] Building jar: /var/lib/jenkins/workspace/taverna-engine-core-maintenance/reference-impl/target/reference-impl-1.6-SNAPSHOT-tests.jar
[INFO] 
[INFO] --- maven-install-plugin:2.4:install (default-install) @ reference-impl ---
[INFO] Installing /var/lib/jenkins/workspace/taverna-engine-core-maintenance/reference-impl/target/reference-impl-1.6-SNAPSHOT.jar to /var/lib/jenkins/workspace/taverna-engine-core-maintenance/.repository/net/sf/taverna/t2/core/reference-impl/1.6-SNAPSHOT/reference-impl-1.6-SNAPSHOT.jar
[INFO] Installing /var/lib/jenkins/workspace/taverna-engine-core-maintenance/reference-impl/pom.xml to /var/lib/jenkins/workspace/taverna-engine-core-maintenance/.repository/net/sf/taverna/t2/core/reference-impl/1.6-SNAPSHOT/reference-impl-1.6-SNAPSHOT.pom
[INFO] Installing /var/lib/jenkins/workspace/taverna-engine-core-maintenance/reference-impl/target/reference-impl-1.6-SNAPSHOT-sources.jar to /var/lib/jenkins/workspace/taverna-engine-core-maintenance/.repository/net/sf/taverna/t2/core/reference-impl/1.6-SNAPSHOT/reference-impl-1.6-SNAPSHOT-sources.jar
[INFO] Installing /var/lib/jenkins/workspace/taverna-engine-core-maintenance/reference-impl/target/reference-impl-1.6-SNAPSHOT-test-sources.jar to /var/lib/jenkins/workspace/taverna-engine-core-maintenance/.repository/net/sf/taverna/t2/core/reference-impl/1.6-SNAPSHOT/reference-impl-1.6-SNAPSHOT-test-sources.jar
[INFO] Installing /var/lib/jenkins/workspace/taverna-engine-core-maintenance/reference-impl/target/reference-impl-1.6-SNAPSHOT-tests.jar to /var/lib/jenkins/workspace/taverna-engine-core-maintenance/.repository/net/sf/taverna/t2/core/reference-impl/1.6-SNAPSHOT/reference-impl-1.6-SNAPSHOT-tests.jar
[INFO]                                                                         
[INFO] ------------------------------------------------------------------------
[INFO] Building Workflow Model API 1.6-SNAPSHOT
[INFO] ------------------------------------------------------------------------
[INFO] Downloading: http://repository.mygrid.org.uk/artifactory/repo/net/sf/taverna/t2/infrastructure/spi-discovery-api/2.6-SNAPSHOT/maven-metadata.xml
[INFO] Downloaded: http://repository.mygrid.org.uk/artifactory/repo/net/sf/taverna/t2/infrastructure/spi-discovery-api/2.6-SNAPSHOT/maven-metadata.xml (2 KB at 2.1 KB/sec)
[INFO] Downloading: http://repository.mygrid.org.uk/artifactory/repo/net/sf/taverna/t2/infrastructure/spi-discovery-api/2.6-SNAPSHOT/spi-discovery-api-2.6-20140528.132154-6.pom
[INFO] Downloaded: http://repository.mygrid.org.uk/artifactory/repo/net/sf/taverna/t2/infrastructure/spi-discovery-api/2.6-SNAPSHOT/spi-discovery-api-2.6-20140528.132154-6.pom (2 KB at 14.8 KB/sec)
[INFO] Downloading: http://repository.mygrid.org.uk/artifactory/repo/net/sf/taverna/t2/lang/observer/1.6-SNAPSHOT/maven-metadata.xml
[INFO] Downloaded: http://repository.mygrid.org.uk/artifactory/repo/net/sf/taverna/t2/lang/observer/1.6-SNAPSHOT/maven-metadata.xml (2 KB at 3.3 KB/sec)
[INFO] Downloading: http://repository.mygrid.org.uk/artifactory/repo/net/sf/taverna/t2/lang/observer/1.6-SNAPSHOT/observer-1.6-20140528.132018-5.pom
[INFO] Downloaded: http://repository.mygrid.org.uk/artifactory/repo/net/sf/taverna/t2/lang/observer/1.6-SNAPSHOT/observer-1.6-20140528.132018-5.pom (833 B at 8.8 KB/sec)
[INFO] Downloading: http://repository.mygrid.org.uk/artifactory/repo/net/sf/taverna/t2/lang/1.6-SNAPSHOT/maven-metadata.xml
[INFO] Downloaded: http://repository.mygrid.org.uk/artifactory/repo/net/sf/taverna/t2/lang/1.6-SNAPSHOT/maven-metadata.xml (792 B at 1.9 KB/sec)
[INFO] Downloading: http://repository.mygrid.org.uk/artifactory/repo/net/sf/taverna/t2/lang/1.6-SNAPSHOT/lang-1.6-20140528.132018-5.pom
[INFO] Downloaded: http://repository.mygrid.org.uk/artifactory/repo/net/sf/taverna/t2/lang/1.6-SNAPSHOT/lang-1.6-20140528.132018-5.pom (3 KB at 21.3 KB/sec)
[INFO] Downloading: http://repository.mygrid.org.uk/artifactory/repo/org/jdom/jdom/1.1/jdom-1.1.pom
[INFO] Downloaded: http://repository.mygrid.org.uk/artifactory/repo/org/jdom/jdom/1.1/jdom-1.1.pom (3 KB at 26.1 KB/sec)
[INFO] Downloading: http://repository.mygrid.org.uk/artifactory/repo/org/jdom/jdom/1.1/jdom-1.1.pom
[INFO] Downloaded: http://repository.mygrid.org.uk/artifactory/repo/org/jdom/jdom/1.1/jdom-1.1.pom (3 KB at 49.7 KB/sec)
[INFO] Downloading: http://repository.mygrid.org.uk/artifactory/repo/org/jdom/jdom/1.1/jdom-1.1.pom
[INFO] Downloaded: http://repository.mygrid.org.uk/artifactory/repo/org/jdom/jdom/1.1/jdom-1.1.pom (3 KB at 64.7 KB/sec)
[INFO] Downloading: http://repository.mygrid.org.uk/artifactory/repo/org/jdom/jdom/1.1/jdom-1.1.pom
[INFO] Downloaded: http://repository.mygrid.org.uk/artifactory/repo/org/jdom/jdom/1.1/jdom-1.1.pom (3 KB at 71.2 KB/sec)
[INFO] Downloading: http://repository.mygrid.org.uk/artifactory/repo/org/jdom/jdom/1.1/jdom-1.1.pom
[INFO] Downloaded: http://repository.mygrid.org.uk/artifactory/repo/org/jdom/jdom/1.1/jdom-1.1.pom (3 KB at 41.9 KB/sec)
[INFO] Downloading: http://repository.mygrid.org.uk/artifactory/repo/org/jdom/jdom/1.1/jdom-1.1.pom
[INFO] Downloaded: http://repository.mygrid.org.uk/artifactory/repo/org/jdom/jdom/1.1/jdom-1.1.pom (3 KB at 52.1 KB/sec)
[INFO] Downloading: http://repository.mygrid.org.uk/artifactory/repo/org/jdom/jdom/1.1/jdom-1.1.pom
[INFO] Downloaded: http://repository.mygrid.org.uk/artifactory/repo/org/jdom/jdom/1.1/jdom-1.1.pom (3 KB at 57.7 KB/sec)
[INFO] Downloading: http://repository.mygrid.org.uk/artifactory/repo/net/sf/taverna/t2/infrastructure/spi-discovery-api/2.6-SNAPSHOT/maven-metadata.xml
[INFO] Downloading: http://repository.mygrid.org.uk/artifactory/repo/net/sf/taverna/t2/infrastructure/spi-discovery-api/2.6-SNAPSHOT/maven-metadata.xml
[INFO] Downloading: http://repository.mygrid.org.uk/artifactory/repo/net/sf/taverna/t2/infrastructure/spi-discovery-api/2.6-SNAPSHOT/maven-metadata.xml
[INFO] Downloading: http://repository.mygrid.org.uk/artifactory/repo/net/sf/taverna/t2/infrastructure/spi-discovery-api/2.6-SNAPSHOT/maven-metadata.xml
[INFO] Downloaded: http://repository.mygrid.org.uk/artifactory/repo/net/sf/taverna/t2/infrastructure/spi-discovery-api/2.6-SNAPSHOT/maven-metadata.xml (2 KB at 11.8 KB/sec)
[INFO] Downloaded: http://repository.mygrid.org.uk/artifactory/repo/net/sf/taverna/t2/infrastructure/spi-discovery-api/2.6-SNAPSHOT/maven-metadata.xml (2 KB at 13.1 KB/sec)
[INFO] Downloaded: http://repository.mygrid.org.uk/artifactory/repo/net/sf/taverna/t2/infrastructure/spi-discovery-api/2.6-SNAPSHOT/maven-metadata.xml (2 KB at 12.5 KB/sec)
[INFO] Downloaded: http://repository.mygrid.org.uk/artifactory/repo/net/sf/taverna/t2/infrastructure/spi-discovery-api/2.6-SNAPSHOT/maven-metadata.xml (2 KB at 12.1 KB/sec)
[INFO] Downloading: http://repository.mygrid.org.uk/artifactory/repo/net/sf/taverna/t2/infrastructure/spi-discovery-api/2.6-SNAPSHOT/maven-metadata.xml
[INFO] Downloading: http://repository.mygrid.org.uk/artifactory/repo/net/sf/taverna/t2/infrastructure/spi-discovery-api/2.6-SNAPSHOT/maven-metadata.xml
[INFO] Downloading: http://repository.mygrid.org.uk/artifactory/repo/net/sf/taverna/t2/infrastructure/spi-discovery-api/2.6-SNAPSHOT/maven-metadata.xml
[INFO] Downloaded: http://repository.mygrid.org.uk/artifactory/repo/net/sf/taverna/t2/infrastructure/spi-discovery-api/2.6-SNAPSHOT/maven-metadata.xml (2 KB at 14.0 KB/sec)
[INFO] Downloaded: http://repository.mygrid.org.uk/artifactory/repo/net/sf/taverna/t2/infrastructure/spi-discovery-api/2.6-SNAPSHOT/maven-metadata.xml (2 KB at 15.1 KB/sec)
[INFO] Downloaded: http://repository.mygrid.org.uk/artifactory/repo/net/sf/taverna/t2/infrastructure/spi-discovery-api/2.6-SNAPSHOT/maven-metadata.xml (2 KB at 14.4 KB/sec)
[INFO] Downloading: http://repository.mygrid.org.uk/artifactory/repo/net/sf/taverna/t2/lang/observer/1.6-SNAPSHOT/maven-metadata.xml
[INFO] Downloading: http://repository.mygrid.org.uk/artifactory/repo/net/sf/taverna/t2/lang/observer/1.6-SNAPSHOT/maven-metadata.xml
[INFO] Downloading: http://repository.mygrid.org.uk/artifactory/repo/net/sf/taverna/t2/lang/observer/1.6-SNAPSHOT/maven-metadata.xml
[INFO] Downloading: http://repository.mygrid.org.uk/artifactory/repo/net/sf/taverna/t2/lang/observer/1.6-SNAPSHOT/maven-metadata.xml
[INFO] Downloaded: http://repository.mygrid.org.uk/artifactory/repo/net/sf/taverna/t2/lang/observer/1.6-SNAPSHOT/maven-metadata.xml (2 KB at 12.6 KB/sec)
[INFO] Downloaded: http://repository.mygrid.org.uk/artifactory/repo/net/sf/taverna/t2/lang/observer/1.6-SNAPSHOT/maven-metadata.xml (2 KB at 11.9 KB/sec)
[INFO] Downloaded: http://repository.mygrid.org.uk/artifactory/repo/net/sf/taverna/t2/lang/observer/1.6-SNAPSHOT/maven-metadata.xml (2 KB at 11.3 KB/sec)
[INFO] Downloaded: http://repository.mygrid.org.uk/artifactory/repo/net/sf/taverna/t2/lang/observer/1.6-SNAPSHOT/maven-metadata.xml (2 KB at 11.8 KB/sec)
[INFO] Downloading: http://repository.mygrid.org.uk/artifactory/repo/net/sf/taverna/t2/lang/observer/1.6-SNAPSHOT/maven-metadata.xml
[INFO] Downloading: http://repository.mygrid.org.uk/artifactory/repo/net/sf/taverna/t2/lang/observer/1.6-SNAPSHOT/maven-metadata.xml
[INFO] Downloading: http://repository.mygrid.org.uk/artifactory/repo/net/sf/taverna/t2/lang/observer/1.6-SNAPSHOT/maven-metadata.xml
[INFO] Downloaded: http://repository.mygrid.org.uk/artifactory/repo/net/sf/taverna/t2/lang/observer/1.6-SNAPSHOT/maven-metadata.xml (2 KB at 12.3 KB/sec)
[INFO] Downloaded: http://repository.mygrid.org.uk/artifactory/repo/net/sf/taverna/t2/lang/observer/1.6-SNAPSHOT/maven-metadata.xml (2 KB at 12.4 KB/sec)
[INFO] Downloaded: http://repository.mygrid.org.uk/artifactory/repo/net/sf/taverna/t2/lang/observer/1.6-SNAPSHOT/maven-metadata.xml (2 KB at 9.4 KB/sec)
[INFO] Downloading: http://repository.mygrid.org.uk/artifactory/repo/net/sf/taverna/t2/infrastructure/spi-discovery-api/2.6-SNAPSHOT/spi-discovery-api-2.6-20140528.132154-6.jar
[INFO] Downloading: http://repository.mygrid.org.uk/artifactory/repo/net/sf/taverna/t2/lang/observer/1.6-SNAPSHOT/observer-1.6-20140528.132018-5.jar
[INFO] Downloading: http://repository.mygrid.org.uk/artifactory/repo/org/jdom/jdom/1.1/jdom-1.1.jar
[INFO] Downloaded: http://repository.mygrid.org.uk/artifactory/repo/org/jdom/jdom/1.1/jdom-1.1.jar (150 KB at 849.6 KB/sec)
[INFO] Downloaded: http://repository.mygrid.org.uk/artifactory/repo/net/sf/taverna/t2/infrastructure/spi-discovery-api/2.6-SNAPSHOT/spi-discovery-api-2.6-20140528.132154-6.jar (6 KB at 28.5 KB/sec)
[INFO] Downloaded: http://repository.mygrid.org.uk/artifactory/repo/net/sf/taverna/t2/lang/observer/1.6-SNAPSHOT/observer-1.6-20140528.132018-5.jar (5 KB at 23.3 KB/sec)
[INFO] 
[INFO] --- maven-clean-plugin:2.5:clean (default-clean) @ workflowmodel-api ---
[INFO] 
[INFO] --- maven-resources-plugin:2.6:resources (default-resources) @ workflowmodel-api ---
[INFO] Using 'UTF-8' encoding to copy filtered resources.
[INFO] Copying 2 resources
[INFO] 
[INFO] --- maven-compiler-plugin:3.1:compile (default-compile) @ workflowmodel-api ---
[INFO] Changes detected - recompiling the module!
[INFO] Compiling 184 source files to /var/lib/jenkins/workspace/taverna-engine-core-maintenance/workflowmodel-api/target/classes
[WARNING] /var/lib/jenkins/workspace/taverna-engine-core-maintenance/workflowmodel-api/src/main/java/net/sf/taverna/t2/visit/HierarchyTraverser.java: Some input files use unchecked or unsafe operations.
[WARNING] /var/lib/jenkins/workspace/taverna-engine-core-maintenance/workflowmodel-api/src/main/java/net/sf/taverna/t2/visit/HierarchyTraverser.java: Recompile with -Xlint:unchecked for details.
[INFO] 
[INFO] --- maven-resources-plugin:2.6:testResources (default-testResources) @ workflowmodel-api ---
[INFO] Using 'UTF-8' encoding to copy filtered resources.
[INFO] Copying 1 resource
[INFO] 
[INFO] --- maven-compiler-plugin:3.1:testCompile (default-testCompile) @ workflowmodel-api ---
[INFO] Changes detected - recompiling the module!
[INFO] Compiling 7 source files to /var/lib/jenkins/workspace/taverna-engine-core-maintenance/workflowmodel-api/target/test-classes
[INFO] 
[INFO] --- maven-surefire-plugin:2.17:test (default-test) @ workflowmodel-api ---
[INFO] Surefire report directory: /var/lib/jenkins/workspace/taverna-engine-core-maintenance/workflowmodel-api/target/surefire-reports

-------------------------------------------------------
 T E S T S
-------------------------------------------------------
Running net.sf.taverna.t2.monitor.TestMonitorManager
Tests run: 3, Failures: 0, Errors: 0, Skipped: 0, Time elapsed: 0.215 sec - in net.sf.taverna.t2.monitor.TestMonitorManager
Running net.sf.taverna.t2.workflowmodel.health.HealthReportTest
Tests run: 6, Failures: 0, Errors: 0, Skipped: 0, Time elapsed: 0.036 sec - in net.sf.taverna.t2.workflowmodel.health.HealthReportTest
Running net.sf.taverna.t2.workflowmodel.processor.iteration.TestIterationStrategyNodes
Tests run: 8, Failures: 0, Errors: 0, Skipped: 0, Time elapsed: 0.037 sec - in net.sf.taverna.t2.workflowmodel.processor.iteration.TestIterationStrategyNodes

Results :

Tests run: 17, Failures: 0, Errors: 0, Skipped: 0

[JENKINS] Recording test results
[INFO] 
[INFO] --- maven-jar-plugin:2.4:jar (default-jar) @ workflowmodel-api ---
[INFO] Building jar: /var/lib/jenkins/workspace/taverna-engine-core-maintenance/workflowmodel-api/target/workflowmodel-api-1.6-SNAPSHOT.jar
[INFO] 
[INFO] >>> maven-source-plugin:2.2.1:jar (default) @ workflowmodel-api >>>
[WARNING] Failed to getClass for org.apache.maven.plugin.source.SourceJarMojo
[INFO] 
[INFO] <<< maven-source-plugin:2.2.1:jar (default) @ workflowmodel-api <<<
[INFO] 
[INFO] --- maven-source-plugin:2.2.1:jar (default) @ workflowmodel-api ---
[INFO] Building jar: /var/lib/jenkins/workspace/taverna-engine-core-maintenance/workflowmodel-api/target/workflowmodel-api-1.6-SNAPSHOT-sources.jar
[INFO] 
[INFO] >>> maven-source-plugin:2.2.1:test-jar (default) @ workflowmodel-api >>>
[WARNING] Failed to getClass for org.apache.maven.plugin.source.TestSourceJarMojo
[INFO] 
[INFO] <<< maven-source-plugin:2.2.1:test-jar (default) @ workflowmodel-api <<<
[INFO] 
[INFO] --- maven-source-plugin:2.2.1:test-jar (default) @ workflowmodel-api ---
[INFO] Building jar: /var/lib/jenkins/workspace/taverna-engine-core-maintenance/workflowmodel-api/target/workflowmodel-api-1.6-SNAPSHOT-test-sources.jar
[INFO] 
[INFO] --- maven-jar-plugin:2.4:test-jar (default) @ workflowmodel-api ---
[INFO] Building jar: /var/lib/jenkins/workspace/taverna-engine-core-maintenance/workflowmodel-api/target/workflowmodel-api-1.6-SNAPSHOT-tests.jar
[INFO] 
[INFO] --- maven-install-plugin:2.4:install (default-install) @ workflowmodel-api ---
[INFO] Installing /var/lib/jenkins/workspace/taverna-engine-core-maintenance/workflowmodel-api/target/workflowmodel-api-1.6-SNAPSHOT.jar to /var/lib/jenkins/workspace/taverna-engine-core-maintenance/.repository/net/sf/taverna/t2/core/workflowmodel-api/1.6-SNAPSHOT/workflowmodel-api-1.6-SNAPSHOT.jar
[INFO] Installing /var/lib/jenkins/workspace/taverna-engine-core-maintenance/workflowmodel-api/pom.xml to /var/lib/jenkins/workspace/taverna-engine-core-maintenance/.repository/net/sf/taverna/t2/core/workflowmodel-api/1.6-SNAPSHOT/workflowmodel-api-1.6-SNAPSHOT.pom
[INFO] Installing /var/lib/jenkins/workspace/taverna-engine-core-maintenance/workflowmodel-api/target/workflowmodel-api-1.6-SNAPSHOT-sources.jar to /var/lib/jenkins/workspace/taverna-engine-core-maintenance/.repository/net/sf/taverna/t2/core/workflowmodel-api/1.6-SNAPSHOT/workflowmodel-api-1.6-SNAPSHOT-sources.jar
[INFO] Installing /var/lib/jenkins/workspace/taverna-engine-core-maintenance/workflowmodel-api/target/workflowmodel-api-1.6-SNAPSHOT-test-sources.jar to /var/lib/jenkins/workspace/taverna-engine-core-maintenance/.repository/net/sf/taverna/t2/core/workflowmodel-api/1.6-SNAPSHOT/workflowmodel-api-1.6-SNAPSHOT-test-sources.jar
[INFO] Installing /var/lib/jenkins/workspace/taverna-engine-core-maintenance/workflowmodel-api/target/workflowmodel-api-1.6-SNAPSHOT-tests.jar to /var/lib/jenkins/workspace/taverna-engine-core-maintenance/.repository/net/sf/taverna/t2/core/workflowmodel-api/1.6-SNAPSHOT/workflowmodel-api-1.6-SNAPSHOT-tests.jar
[INFO]                                                                         
[INFO] ------------------------------------------------------------------------
[INFO] Building Workflow Model implementation 1.6-SNAPSHOT
[INFO] ------------------------------------------------------------------------
[INFO] Downloading: http://repository.mygrid.org.uk/artifactory/repo/com/thoughtworks/xstream/xstream/1.4.1/xstream-1.4.1.pom
[INFO] Downloaded: http://repository.mygrid.org.uk/artifactory/repo/com/thoughtworks/xstream/xstream/1.4.1/xstream-1.4.1.pom (14 KB at 127.2 KB/sec)
[INFO] Downloading: http://repository.mygrid.org.uk/artifactory/repo/com/thoughtworks/xstream/xstream/1.4.1/xstream-1.4.1.pom
[INFO] Downloaded: http://repository.mygrid.org.uk/artifactory/repo/com/thoughtworks/xstream/xstream/1.4.1/xstream-1.4.1.pom (14 KB at 319.6 KB/sec)
[INFO] Downloading: http://repository.mygrid.org.uk/artifactory/repo/com/thoughtworks/xstream/xstream/1.4.1/xstream-1.4.1.pom
[INFO] Downloaded: http://repository.mygrid.org.uk/artifactory/repo/com/thoughtworks/xstream/xstream/1.4.1/xstream-1.4.1.pom (14 KB at 336.0 KB/sec)
[INFO] Downloading: http://repository.mygrid.org.uk/artifactory/repo/com/thoughtworks/xstream/xstream/1.4.1/xstream-1.4.1.pom
[INFO] Downloaded: http://repository.mygrid.org.uk/artifactory/repo/com/thoughtworks/xstream/xstream/1.4.1/xstream-1.4.1.pom (14 KB at 327.6 KB/sec)
[INFO] Downloading: http://repository.mygrid.org.uk/artifactory/repo/com/thoughtworks/xstream/xstream/1.4.1/xstream-1.4.1.pom
[INFO] Downloaded: http://repository.mygrid.org.uk/artifactory/repo/com/thoughtworks/xstream/xstream/1.4.1/xstream-1.4.1.pom (14 KB at 327.6 KB/sec)
[INFO] Downloading: http://repository.mygrid.org.uk/artifactory/repo/com/thoughtworks/xstream/xstream/1.4.1/xstream-1.4.1.pom
[INFO] Downloaded: http://repository.mygrid.org.uk/artifactory/repo/com/thoughtworks/xstream/xstream/1.4.1/xstream-1.4.1.pom (14 KB at 238.2 KB/sec)
[INFO] Downloading: http://repository.mygrid.org.uk/artifactory/repo/com/thoughtworks/xstream/xstream/1.4.1/xstream-1.4.1.pom
[INFO] Downloaded: http://repository.mygrid.org.uk/artifactory/repo/com/thoughtworks/xstream/xstream/1.4.1/xstream-1.4.1.pom (14 KB at 385.4 KB/sec)
[INFO] Downloading: http://repository.mygrid.org.uk/artifactory/repo/com/thoughtworks/xstream/xstream-parent/1.4.1/xstream-parent-1.4.1.pom
[INFO] Downloaded: http://repository.mygrid.org.uk/artifactory/repo/com/thoughtworks/xstream/xstream-parent/1.4.1/xstream-parent-1.4.1.pom (15 KB at 320.0 KB/sec)
[INFO] Downloading: http://repository.mygrid.org.uk/artifactory/repo/org/codehaus/codehaus-parent/3/codehaus-parent-3.pom
[INFO] Downloaded: http://repository.mygrid.org.uk/artifactory/repo/org/codehaus/codehaus-parent/3/codehaus-parent-3.pom (5 KB at 62.7 KB/sec)
[INFO] Downloading: http://repository.mygrid.org.uk/artifactory/repo/xmlpull/xmlpull/1.1.3.1/xmlpull-1.1.3.1.pom
[INFO] Downloaded: http://repository.mygrid.org.uk/artifactory/repo/xmlpull/xmlpull/1.1.3.1/xmlpull-1.1.3.1.pom (386 B at 5.2 KB/sec)
[INFO] Downloading: http://repository.mygrid.org.uk/artifactory/repo/xpp3/xpp3_min/1.1.4c/xpp3_min-1.1.4c.pom
[INFO] Downloaded: http://repository.mygrid.org.uk/artifactory/repo/xpp3/xpp3_min/1.1.4c/xpp3_min-1.1.4c.pom (2 KB at 28.1 KB/sec)
[INFO] Downloading: http://repository.mygrid.org.uk/artifactory/repo/net/sf/taverna/t2/infrastructure/spi-discovery-api/2.6-SNAPSHOT/maven-metadata.xml
[INFO] Downloaded: http://repository.mygrid.org.uk/artifactory/repo/net/sf/taverna/t2/infrastructure/spi-discovery-api/2.6-SNAPSHOT/maven-metadata.xml (2 KB at 40.8 KB/sec)
[INFO] Downloading: http://repository.mygrid.org.uk/artifactory/repo/com/thoughtworks/xstream/xstream/1.4.1/xstream-1.4.1.jar
[INFO] Downloading: http://repository.mygrid.org.uk/artifactory/repo/xmlpull/xmlpull/1.1.3.1/xmlpull-1.1.3.1.jar
[INFO] Downloading: http://repository.mygrid.org.uk/artifactory/repo/xpp3/xpp3_min/1.1.4c/xpp3_min-1.1.4c.jar
[INFO] Downloaded: http://repository.mygrid.org.uk/artifactory/repo/xpp3/xpp3_min/1.1.4c/xpp3_min-1.1.4c.jar (25 KB at 316.5 KB/sec)
[INFO] Downloaded: http://repository.mygrid.org.uk/artifactory/repo/xmlpull/xmlpull/1.1.3.1/xmlpull-1.1.3.1.jar (8 KB at 86.7 KB/sec)
[INFO] Downloaded: http://repository.mygrid.org.uk/artifactory/repo/com/thoughtworks/xstream/xstream/1.4.1/xstream-1.4.1.jar (485 KB at 2616.7 KB/sec)
[INFO] 
[INFO] --- maven-clean-plugin:2.5:clean (default-clean) @ workflowmodel-impl ---
[INFO] 
[INFO] --- maven-resources-plugin:2.6:resources (default-resources) @ workflowmodel-impl ---
[INFO] Using 'UTF-8' encoding to copy filtered resources.
[INFO] Copying 8 resources
[INFO] 
[INFO] --- maven-compiler-plugin:3.1:compile (default-compile) @ workflowmodel-impl ---
[INFO] Changes detected - recompiling the module!
[INFO] Compiling 137 source files to /var/lib/jenkins/workspace/taverna-engine-core-maintenance/workflowmodel-impl/target/classes
[WARNING] /var/lib/jenkins/workspace/taverna-engine-core-maintenance/workflowmodel-impl/src/main/java/net/sf/taverna/t2/workflowmodel/utils/Tools.java: Some input files use unchecked or unsafe operations.
[WARNING] /var/lib/jenkins/workspace/taverna-engine-core-maintenance/workflowmodel-impl/src/main/java/net/sf/taverna/t2/workflowmodel/utils/Tools.java: Recompile with -Xlint:unchecked for details.
[INFO] 
[INFO] --- maven-resources-plugin:2.6:testResources (default-testResources) @ workflowmodel-impl ---
[INFO] Using 'UTF-8' encoding to copy filtered resources.
[INFO] Copying 11 resources
[INFO] 
[INFO] --- maven-compiler-plugin:3.1:testCompile (default-testCompile) @ workflowmodel-impl ---
[INFO] Changes detected - recompiling the module!
[INFO] Compiling 58 source files to /var/lib/jenkins/workspace/taverna-engine-core-maintenance/workflowmodel-impl/target/test-classes
[INFO] 
[INFO] --- maven-surefire-plugin:2.17:test (default-test) @ workflowmodel-impl ---
[INFO] Surefire report directory: /var/lib/jenkins/workspace/taverna-engine-core-maintenance/workflowmodel-impl/target/surefire-reports

-------------------------------------------------------
 T E S T S
-------------------------------------------------------
Running net.sf.taverna.t2.monitor.impl.MonitorTreeModelTest
Tests run: 2, Failures: 0, Errors: 0, Skipped: 0, Time elapsed: 0.312 sec - in net.sf.taverna.t2.monitor.impl.MonitorTreeModelTest
Running net.sf.taverna.t2.workflowmodel.impl.ProcessorHealthReportTest
Tests run: 8, Failures: 0, Errors: 0, Skipped: 1, Time elapsed: 0.037 sec - in net.sf.taverna.t2.workflowmodel.impl.ProcessorHealthReportTest
Running net.sf.taverna.t2.workflowmodel.impl.ConnectDatalinkEditTest
Tests run: 3, Failures: 0, Errors: 0, Skipped: 0, Time elapsed: 0.015 sec - in net.sf.taverna.t2.workflowmodel.impl.ConnectDatalinkEditTest
Running net.sf.taverna.t2.workflowmodel.impl.ChangeDataflowInputPortDepthEditTest
Tests run: 3, Failures: 0, Errors: 0, Skipped: 0, Time elapsed: 0.006 sec - in net.sf.taverna.t2.workflowmodel.impl.ChangeDataflowInputPortDepthEditTest
Running net.sf.taverna.t2.workflowmodel.impl.CreateDataflowOutputPortEditTest
Tests run: 3, Failures: 0, Errors: 0, Skipped: 0, Time elapsed: 0.084 sec - in net.sf.taverna.t2.workflowmodel.impl.CreateDataflowOutputPortEditTest
Running net.sf.taverna.t2.workflowmodel.impl.ConfigureActivityEditTest
Tests run: 4, Failures: 0, Errors: 0, Skipped: 0, Time elapsed: 0.735 sec - in net.sf.taverna.t2.workflowmodel.impl.ConfigureActivityEditTest
Running net.sf.taverna.t2.workflowmodel.impl.CreateDataflowInputPortEditTest
Tests run: 3, Failures: 0, Errors: 0, Skipped: 0, Time elapsed: 0.017 sec - in net.sf.taverna.t2.workflowmodel.impl.CreateDataflowInputPortEditTest
Running net.sf.taverna.t2.workflowmodel.impl.RemoveProcessorOutputPortEditTest
Tests run: 3, Failures: 0, Errors: 0, Skipped: 0, Time elapsed: 0.093 sec - in net.sf.taverna.t2.workflowmodel.impl.RemoveProcessorOutputPortEditTest
Running net.sf.taverna.t2.workflowmodel.impl.DefaultDispatchStackEditTest
Tests run: 4, Failures: 0, Errors: 0, Skipped: 0, Time elapsed: 0.036 sec - in net.sf.taverna.t2.workflowmodel.impl.DefaultDispatchStackEditTest
Running net.sf.taverna.t2.workflowmodel.impl.AddProcessorEditTest
Tests run: 7, Failures: 0, Errors: 0, Skipped: 0, Time elapsed: 0.013 sec - in net.sf.taverna.t2.workflowmodel.impl.AddProcessorEditTest
Running net.sf.taverna.t2.workflowmodel.impl.ConnectMergedDatalinkEditTest
ApplicationConfig could not determine application name, using unknownApplication-82a1c142-529b-4f8a-9aaf-9693d438a12f
Tests run: 8, Failures: 0, Errors: 0, Skipped: 0, Time elapsed: 0.102 sec - in net.sf.taverna.t2.workflowmodel.impl.ConnectMergedDatalinkEditTest
Running net.sf.taverna.t2.workflowmodel.impl.AbstractDatalinkEditTest
Tests run: 9, Failures: 0, Errors: 0, Skipped: 0, Time elapsed: 0.017 sec - in net.sf.taverna.t2.workflowmodel.impl.AbstractDatalinkEditTest
Running net.sf.taverna.t2.workflowmodel.impl.ChangeDataflowInputPortGranularDepthEditTest
Tests run: 3, Failures: 0, Errors: 0, Skipped: 0, Time elapsed: 0.015 sec - in net.sf.taverna.t2.workflowmodel.impl.ChangeDataflowInputPortGranularDepthEditTest
Running net.sf.taverna.t2.workflowmodel.impl.UpdateDataflowInternalIdentifierEditTest
Tests run: 2, Failures: 0, Errors: 0, Skipped: 0, Time elapsed: 0.01 sec - in net.sf.taverna.t2.workflowmodel.impl.UpdateDataflowInternalIdentifierEditTest
Running net.sf.taverna.t2.workflowmodel.impl.MapProcessorPortsToActivityEditTest
Tests run: 5, Failures: 0, Errors: 0, Skipped: 0, Time elapsed: 0.033 sec - in net.sf.taverna.t2.workflowmodel.impl.MapProcessorPortsToActivityEditTest
Running net.sf.taverna.t2.workflowmodel.impl.EditRegistryTest
Tests run: 2, Failures: 0, Errors: 0, Skipped: 0, Time elapsed: 0.003 sec - in net.sf.taverna.t2.workflowmodel.impl.EditRegistryTest
Running net.sf.taverna.t2.workflowmodel.impl.DataflowImplTest
Tests run: 2, Failures: 0, Errors: 0, Skipped: 0, Time elapsed: 0.003 sec - in net.sf.taverna.t2.workflowmodel.impl.DataflowImplTest
Running net.sf.taverna.t2.workflowmodel.impl.RemoveProcessorInputPortEditTest
Tests run: 3, Failures: 0, Errors: 0, Skipped: 0, Time elapsed: 0.006 sec - in net.sf.taverna.t2.workflowmodel.impl.RemoveProcessorInputPortEditTest
Running net.sf.taverna.t2.workflowmodel.serialization.xml.ProcessorXMLDeserializerTest
Tests run: 1, Failures: 0, Errors: 0, Skipped: 0, Time elapsed: 0.014 sec - in net.sf.taverna.t2.workflowmodel.serialization.xml.ProcessorXMLDeserializerTest
Running net.sf.taverna.t2.workflowmodel.serialization.xml.ActivityXMLDeserializerTest
Tests run: 1, Failures: 0, Errors: 0, Skipped: 0, Time elapsed: 0.031 sec - in net.sf.taverna.t2.workflowmodel.serialization.xml.ActivityXMLDeserializerTest
Running net.sf.taverna.t2.workflowmodel.serialization.xml.DispatchLayerXMLSerializerTest
Tests run: 1, Failures: 0, Errors: 0, Skipped: 0, Time elapsed: 0.065 sec - in net.sf.taverna.t2.workflowmodel.serialization.xml.DispatchLayerXMLSerializerTest
Running net.sf.taverna.t2.workflowmodel.serialization.xml.DispatchStackXMLSerializerTest
Tests run: 1, Failures: 0, Errors: 0, Skipped: 0, Time elapsed: 0.036 sec - in net.sf.taverna.t2.workflowmodel.serialization.xml.DispatchStackXMLSerializerTest
Running net.sf.taverna.t2.workflowmodel.serialization.xml.IterationStrategyStackXMLSerializerTest
Tests run: 1, Failures: 0, Errors: 0, Skipped: 0, Time elapsed: 0.012 sec - in net.sf.taverna.t2.workflowmodel.serialization.xml.IterationStrategyStackXMLSerializerTest
Running net.sf.taverna.t2.workflowmodel.serialization.xml.DeserializerImplTest
Tests run: 1, Failures: 0, Errors: 0, Skipped: 0, Time elapsed: 0.058 sec - in net.sf.taverna.t2.workflowmodel.serialization.xml.DeserializerImplTest
Running net.sf.taverna.t2.workflowmodel.serialization.xml.IterationStragegyStackXMLDeserializerTest
Tests run: 1, Failures: 0, Errors: 0, Skipped: 0, Time elapsed: 0.005 sec - in net.sf.taverna.t2.workflowmodel.serialization.xml.IterationStragegyStackXMLDeserializerTest
Running net.sf.taverna.t2.workflowmodel.serialization.xml.SerializerRegistryTest
Tests run: 2, Failures: 0, Errors: 0, Skipped: 0, Time elapsed: 0.01 sec - in net.sf.taverna.t2.workflowmodel.serialization.xml.SerializerRegistryTest
Running net.sf.taverna.t2.workflowmodel.serialization.xml.ConditionXMLSerializerTest
Tests run: 1, Failures: 0, Errors: 0, Skipped: 0, Time elapsed: 0.008 sec - in net.sf.taverna.t2.workflowmodel.serialization.xml.ConditionXMLSerializerTest
Running net.sf.taverna.t2.workflowmodel.serialization.xml.DataflowXMLDeserializerTest
Tests run: 6, Failures: 0, Errors: 0, Skipped: 0, Time elapsed: 0.066 sec - in net.sf.taverna.t2.workflowmodel.serialization.xml.DataflowXMLDeserializerTest
Running net.sf.taverna.t2.workflowmodel.serialization.xml.AbstractXMLDeserializerTest
Tests run: 3, Failures: 0, Errors: 0, Skipped: 0, Time elapsed: 0.036 sec - in net.sf.taverna.t2.workflowmodel.serialization.xml.AbstractXMLDeserializerTest
Running net.sf.taverna.t2.workflowmodel.serialization.xml.ProcessorXMLSerializerTest
Tests run: 1, Failures: 0, Errors: 0, Skipped: 0, Time elapsed: 0.007 sec - in net.sf.taverna.t2.workflowmodel.serialization.xml.ProcessorXMLSerializerTest
Running net.sf.taverna.t2.workflowmodel.serialization.xml.AbstractXMLSerializerTest
Tests run: 3, Failures: 0, Errors: 0, Skipped: 0, Time elapsed: 0.021 sec - in net.sf.taverna.t2.workflowmodel.serialization.xml.AbstractXMLSerializerTest
Running net.sf.taverna.t2.workflowmodel.serialization.xml.DispatchLayerXMLDeserializerTest
Tests run: 1, Failures: 0, Errors: 0, Skipped: 0, Time elapsed: 0.018 sec - in net.sf.taverna.t2.workflowmodel.serialization.xml.DispatchLayerXMLDeserializerTest
Running net.sf.taverna.t2.workflowmodel.serialization.xml.DispatchStackXMLDeserializerTest
Tests run: 1, Failures: 0, Errors: 0, Skipped: 0, Time elapsed: 0.076 sec - in net.sf.taverna.t2.workflowmodel.serialization.xml.DispatchStackXMLDeserializerTest
Running net.sf.taverna.t2.workflowmodel.serialization.xml.DatalinksXMLSerializerTest
Tests run: 5, Failures: 0, Errors: 0, Skipped: 0, Time elapsed: 0.01 sec - in net.sf.taverna.t2.workflowmodel.serialization.xml.DatalinksXMLSerializerTest
Running net.sf.taverna.t2.workflowmodel.serialization.xml.SerializerImplTest
INFO  2014-08-11 10:30:40,279 (net.sf.taverna.t2.workflowmodel.serialization.xml.SerializerImplTest:47) - workflow serialization xml = <workflow xmlns="http://taverna.sf.net/2008/xml/t2flow" version="1" producedBy="unspecified"><dataflow id="73808476-13c2-47c4-a622-611f9b80db8d" role="top"><name>Workflow28</name><inputPorts /><outputPorts /><processors /><conditions /><datalinks /><annotations><annotation_chain_2_2 encoding="xstream"><net.sf.taverna.t2.annotation.AnnotationChainImpl xmlns="">
  <annotationAssertions>
    <net.sf.taverna.t2.annotation.AnnotationAssertionImpl>
      <annotationBean class="net.sf.taverna.t2.annotation.annotationbeans.IdentificationAssertion">
        <identification>73808476-13c2-47c4-a622-611f9b80db8d</identification>
      </annotationBean>
      <date>2014-08-11 09:30:40.253 UTC</date>
      <creators />
      <curationEventList />
    </net.sf.taverna.t2.annotation.AnnotationAssertionImpl>
  </annotationAssertions>
</net.sf.taverna.t2.annotation.AnnotationChainImpl></annotation_chain_2_2></annotations></dataflow></workflow>
Tests run: 3, Failures: 0, Errors: 0, Skipped: 0, Time elapsed: 0.105 sec - in net.sf.taverna.t2.workflowmodel.serialization.xml.SerializerImplTest
Running net.sf.taverna.t2.workflowmodel.serialization.xml.ActivityXMLSerializerTest
Tests run: 2, Failures: 0, Errors: 0, Skipped: 0, Time elapsed: 0.015 sec - in net.sf.taverna.t2.workflowmodel.serialization.xml.ActivityXMLSerializerTest
Running net.sf.taverna.t2.workflowmodel.serialization.xml.DataflowXMLSerializerTest
Tests run: 4, Failures: 0, Errors: 0, Skipped: 0, Time elapsed: 0.021 sec - in net.sf.taverna.t2.workflowmodel.serialization.xml.DataflowXMLSerializerTest
Running net.sf.taverna.t2.workflowmodel.processor.NaiveProcessorConstructionTest
Tests run: 1, Failures: 0, Errors: 0, Skipped: 0, Time elapsed: 0.017 sec - in net.sf.taverna.t2.workflowmodel.processor.NaiveProcessorConstructionTest
Running net.sf.taverna.t2.workflowmodel.processor.iteration.impl.IterationTypeCheckerTest
Tests run: 6, Failures: 0, Errors: 0, Skipped: 0, Time elapsed: 0.008 sec - in net.sf.taverna.t2.workflowmodel.processor.iteration.impl.IterationTypeCheckerTest
Running net.sf.taverna.t2.annotation.TestAnnotations
text/plain
It's an applies to
net.sf.taverna.t2.workflowmodel.Dataflow
net.sf.taverna.t2.workflowmodel.Processor
net.sf.taverna.t2.workflowmodel.processor.activity.Activity
net.sf.taverna.t2.workflowmodel.Port
net.sf.taverna.t2.workflowmodel.Datalink
net.sf.taverna.t2.workflowmodel.Condition
class net.sf.taverna.t2.annotation.annotationbeans.MimeType
class: net.sf.taverna.t2.annotation.AnnotationAssertionImpl
Creation date: Mon Aug 11 10:30:40 BST 2014
Role: null
Tests run: 1, Failures: 0, Errors: 0, Skipped: 0, Time elapsed: 0.016 sec - in net.sf.taverna.t2.annotation.TestAnnotations
Running net.sf.taverna.t2.annotation.TestAnnotationRegistries
net.sf.taverna.t2.annotation.DisputeEventDetails
net.sf.taverna.t2.annotation.annotationbeans.Author
net.sf.taverna.t2.annotation.annotationbeans.DescriptiveTitle
net.sf.taverna.t2.annotation.annotationbeans.FreeTextDescription
net.sf.taverna.t2.annotation.annotationbeans.HostInstitution
net.sf.taverna.t2.annotation.annotationbeans.DocumentationUrl
net.sf.taverna.t2.annotation.annotationbeans.Optional
net.sf.taverna.t2.annotation.annotationbeans.ExampleValue
net.sf.taverna.t2.annotation.annotationbeans.SemanticAnnotation
net.sf.taverna.t2.annotation.annotationbeans.IdentificationAssertion
net.sf.taverna.t2.annotation.URISource
Tests run: 3, Failures: 0, Errors: 0, Skipped: 0, Time elapsed: 0.047 sec - in net.sf.taverna.t2.annotation.TestAnnotationRegistries

Results :

Tests run: 124, Failures: 0, Errors: 0, Skipped: 1

[JENKINS] Recording test results
[INFO] 
[INFO] --- maven-jar-plugin:2.4:jar (default-jar) @ workflowmodel-impl ---
[INFO] Building jar: /var/lib/jenkins/workspace/taverna-engine-core-maintenance/workflowmodel-impl/target/workflowmodel-impl-1.6-SNAPSHOT.jar
[INFO] 
[INFO] >>> maven-source-plugin:2.2.1:jar (default) @ workflowmodel-impl >>>
[WARNING] Failed to getClass for org.apache.maven.plugin.source.SourceJarMojo
[INFO] 
[INFO] <<< maven-source-plugin:2.2.1:jar (default) @ workflowmodel-impl <<<
[INFO] 
[INFO] --- maven-source-plugin:2.2.1:jar (default) @ workflowmodel-impl ---
[INFO] Building jar: /var/lib/jenkins/workspace/taverna-engine-core-maintenance/workflowmodel-impl/target/workflowmodel-impl-1.6-SNAPSHOT-sources.jar
[INFO] 
[INFO] >>> maven-source-plugin:2.2.1:test-jar (default) @ workflowmodel-impl >>>
[WARNING] Failed to getClass for org.apache.maven.plugin.source.TestSourceJarMojo
[INFO] 
[INFO] <<< maven-source-plugin:2.2.1:test-jar (default) @ workflowmodel-impl <<<
[INFO] 
[INFO] --- maven-source-plugin:2.2.1:test-jar (default) @ workflowmodel-impl ---
[INFO] Building jar: /var/lib/jenkins/workspace/taverna-engine-core-maintenance/workflowmodel-impl/target/workflowmodel-impl-1.6-SNAPSHOT-test-sources.jar
[INFO] 
[INFO] --- maven-jar-plugin:2.4:test-jar (default) @ workflowmodel-impl ---
[INFO] Building jar: /var/lib/jenkins/workspace/taverna-engine-core-maintenance/workflowmodel-impl/target/workflowmodel-impl-1.6-SNAPSHOT-tests.jar
[INFO] 
[INFO] --- maven-install-plugin:2.4:install (default-install) @ workflowmodel-impl ---
[INFO] Installing /var/lib/jenkins/workspace/taverna-engine-core-maintenance/workflowmodel-impl/target/workflowmodel-impl-1.6-SNAPSHOT.jar to /var/lib/jenkins/workspace/taverna-engine-core-maintenance/.repository/net/sf/taverna/t2/core/workflowmodel-impl/1.6-SNAPSHOT/workflowmodel-impl-1.6-SNAPSHOT.jar
[INFO] Installing /var/lib/jenkins/workspace/taverna-engine-core-maintenance/workflowmodel-impl/pom.xml to /var/lib/jenkins/workspace/taverna-engine-core-maintenance/.repository/net/sf/taverna/t2/core/workflowmodel-impl/1.6-SNAPSHOT/workflowmodel-impl-1.6-SNAPSHOT.pom
[INFO] Installing /var/lib/jenkins/workspace/taverna-engine-core-maintenance/workflowmodel-impl/target/workflowmodel-impl-1.6-SNAPSHOT-sources.jar to /var/lib/jenkins/workspace/taverna-engine-core-maintenance/.repository/net/sf/taverna/t2/core/workflowmodel-impl/1.6-SNAPSHOT/workflowmodel-impl-1.6-SNAPSHOT-sources.jar
[INFO] Installing /var/lib/jenkins/workspace/taverna-engine-core-maintenance/workflowmodel-impl/target/workflowmodel-impl-1.6-SNAPSHOT-test-sources.jar to /var/lib/jenkins/workspace/taverna-engine-core-maintenance/.repository/net/sf/taverna/t2/core/workflowmodel-impl/1.6-SNAPSHOT/workflowmodel-impl-1.6-SNAPSHOT-test-sources.jar
[INFO] Installing /var/lib/jenkins/workspace/taverna-engine-core-maintenance/workflowmodel-impl/target/workflowmodel-impl-1.6-SNAPSHOT-tests.jar to /var/lib/jenkins/workspace/taverna-engine-core-maintenance/.repository/net/sf/taverna/t2/core/workflowmodel-impl/1.6-SNAPSHOT/workflowmodel-impl-1.6-SNAPSHOT-tests.jar
[INFO]                                                                         
[INFO] ------------------------------------------------------------------------
[INFO] Building Database storage and analysis of provenance info 1.6-SNAPSHOT
[INFO] ------------------------------------------------------------------------
[INFO] Downloading: http://repository.mygrid.org.uk/artifactory/repo/commons-io/commons-io/1.4/commons-io-1.4.pom
[INFO] Downloaded: http://repository.mygrid.org.uk/artifactory/repo/commons-io/commons-io/1.4/commons-io-1.4.pom (13 KB at 118.0 KB/sec)
[INFO] Downloading: http://repository.mygrid.org.uk/artifactory/repo/commons-io/commons-io/1.4/commons-io-1.4.pom
[INFO] Downloaded: http://repository.mygrid.org.uk/artifactory/repo/commons-io/commons-io/1.4/commons-io-1.4.pom (13 KB at 217.9 KB/sec)
[INFO] Downloading: http://repository.mygrid.org.uk/artifactory/repo/commons-io/commons-io/1.4/commons-io-1.4.pom
[INFO] Downloaded: http://repository.mygrid.org.uk/artifactory/repo/commons-io/commons-io/1.4/commons-io-1.4.pom (13 KB at 347.5 KB/sec)
[INFO] Downloading: http://repository.mygrid.org.uk/artifactory/repo/commons-io/commons-io/1.4/commons-io-1.4.pom
[INFO] Downloaded: http://repository.mygrid.org.uk/artifactory/repo/commons-io/commons-io/1.4/commons-io-1.4.pom (13 KB at 357.2 KB/sec)
[INFO] Downloading: http://repository.mygrid.org.uk/artifactory/repo/commons-io/commons-io/1.4/commons-io-1.4.pom
[INFO] Downloaded: http://repository.mygrid.org.uk/artifactory/repo/commons-io/commons-io/1.4/commons-io-1.4.pom (13 KB at 217.9 KB/sec)
[INFO] Downloading: http://repository.mygrid.org.uk/artifactory/repo/commons-io/commons-io/1.4/commons-io-1.4.pom
[INFO] Downloaded: http://repository.mygrid.org.uk/artifactory/repo/commons-io/commons-io/1.4/commons-io-1.4.pom (13 KB at 347.5 KB/sec)
[INFO] Downloading: http://repository.mygrid.org.uk/artifactory/repo/commons-io/commons-io/1.4/commons-io-1.4.pom
[INFO] Downloaded: http://repository.mygrid.org.uk/artifactory/repo/commons-io/commons-io/1.4/commons-io-1.4.pom (13 KB at 367.4 KB/sec)
[INFO] Downloading: http://repository.mygrid.org.uk/artifactory/repo/org/apache/commons/commons-parent/7/commons-parent-7.pom
[INFO] Downloaded: http://repository.mygrid.org.uk/artifactory/repo/org/apache/commons/commons-parent/7/commons-parent-7.pom (18 KB at 284.8 KB/sec)
[INFO] Downloading: http://repository.mygrid.org.uk/artifactory/repo/org/tupeloproject/tupelo-cet/2.6/tupelo-cet-2.6.pom
[INFO] Downloaded: http://repository.mygrid.org.uk/artifactory/repo/org/tupeloproject/tupelo-cet/2.6/tupelo-cet-2.6.pom (3 KB at 43.3 KB/sec)
[INFO] Downloading: http://repository.mygrid.org.uk/artifactory/repo/org/tupeloproject/tupelo-core/2.6/tupelo-core-2.6.pom
[INFO] Downloaded: http://repository.mygrid.org.uk/artifactory/repo/org/tupeloproject/tupelo-core/2.6/tupelo-core-2.6.pom (3 KB at 42.3 KB/sec)
[INFO] Downloading: http://repository.mygrid.org.uk/artifactory/repo/org/tupeloproject/tupelo-all/2.6/tupelo-all-2.6.pom
[INFO] Downloaded: http://repository.mygrid.org.uk/artifactory/repo/org/tupeloproject/tupelo-all/2.6/tupelo-all-2.6.pom (4 KB at 50.2 KB/sec)
[INFO] Downloading: http://repository.mygrid.org.uk/artifactory/repo/org/tupeloproject/tupelo-kernel/2.6/tupelo-kernel-2.6.pom
[INFO] Downloaded: http://repository.mygrid.org.uk/artifactory/repo/org/tupeloproject/tupelo-kernel/2.6/tupelo-kernel-2.6.pom (4 KB at 128.8 KB/sec)
[INFO] Downloading: http://repository.mygrid.org.uk/artifactory/repo/org/tupeloproject/tupelo-kernel/2.6/tupelo-kernel-2.6.pom
[INFO] Downloaded: http://repository.mygrid.org.uk/artifactory/repo/org/tupeloproject/tupelo-kernel/2.6/tupelo-kernel-2.6.pom (4 KB at 147.9 KB/sec)
[INFO] Downloading: http://repository.mygrid.org.uk/artifactory/repo/org/tupeloproject/tupelo-kernel/2.6/tupelo-kernel-2.6.pom
[INFO] Downloaded: http://repository.mygrid.org.uk/artifactory/repo/org/tupeloproject/tupelo-kernel/2.6/tupelo-kernel-2.6.pom (4 KB at 84.9 KB/sec)
[INFO] Downloading: http://repository.mygrid.org.uk/artifactory/repo/org/tupeloproject/tupelo-util/2.6/tupelo-util-2.6.pom
[INFO] Downloaded: http://repository.mygrid.org.uk/artifactory/repo/org/tupeloproject/tupelo-util/2.6/tupelo-util-2.6.pom (3 KB at 46.4 KB/sec)
[INFO] Downloading: http://repository.mygrid.org.uk/artifactory/repo/org/openprovenance/opm-core/1.1.8/opm-core-1.1.8.pom
[INFO] Downloaded: http://repository.mygrid.org.uk/artifactory/repo/org/openprovenance/opm-core/1.1.8/opm-core-1.1.8.pom (18 KB at 107.4 KB/sec)
[INFO] Downloading: http://repository.mygrid.org.uk/artifactory/repo/org/openprovenance/specs/1.1.8/specs-1.1.8.pom
[INFO] Downloaded: http://repository.mygrid.org.uk/artifactory/repo/org/openprovenance/specs/1.1.8/specs-1.1.8.pom (10 KB at 104.2 KB/sec)
[INFO] Downloading: http://repository.mygrid.org.uk/artifactory/repo/javax/xml/bind/jaxb-api/2.1/jaxb-api-2.1.pom
[INFO] Downloaded: http://repository.mygrid.org.uk/artifactory/repo/javax/xml/bind/jaxb-api/2.1/jaxb-api-2.1.pom (486 B at 7.7 KB/sec)
[INFO] Downloading: http://repository.mygrid.org.uk/artifactory/repo/javax/xml/bind/jaxb-api/2.1/jaxb-api-2.1.pom
[INFO] Downloaded: http://repository.mygrid.org.uk/artifactory/repo/javax/xml/bind/jaxb-api/2.1/jaxb-api-2.1.pom (486 B at 8.2 KB/sec)
[INFO] Downloading: http://repository.mygrid.org.uk/artifactory/repo/javax/xml/stream/stax-api/1.0-2/stax-api-1.0-2.pom
[INFO] Downloaded: http://repository.mygrid.org.uk/artifactory/repo/javax/xml/stream/stax-api/1.0-2/stax-api-1.0-2.pom (167 B at 2.1 KB/sec)
[INFO] Downloading: http://repository.mygrid.org.uk/artifactory/repo/javax/activation/activation/1.1/activation-1.1.pom
[INFO] Downloaded: http://repository.mygrid.org.uk/artifactory/repo/javax/activation/activation/1.1/activation-1.1.pom (2 KB at 15.4 KB/sec)
[INFO] Downloading: http://repository.mygrid.org.uk/artifactory/repo/com/sun/xml/bind/jaxb-impl/2.1.12/jaxb-impl-2.1.12.pom
[INFO] Downloaded: http://repository.mygrid.org.uk/artifactory/repo/com/sun/xml/bind/jaxb-impl/2.1.12/jaxb-impl-2.1.12.pom (340 B at 3.8 KB/sec)
[INFO] Downloading: http://repository.mygrid.org.uk/artifactory/repo/org/jvnet/jaxb2_commons/runtime/0.4.1.5/runtime-0.4.1.5.pom
[INFO] Downloaded: http://repository.mygrid.org.uk/artifactory/repo/org/jvnet/jaxb2_commons/runtime/0.4.1.5/runtime-0.4.1.5.pom (2 KB at 16.1 KB/sec)
[INFO] Downloading: http://repository.mygrid.org.uk/artifactory/repo/org/jvnet/jaxb2_commons/project/0.4.1.5/project-0.4.1.5.pom
[INFO] Downloaded: http://repository.mygrid.org.uk/artifactory/repo/org/jvnet/jaxb2_commons/project/0.4.1.5/project-0.4.1.5.pom (9 KB at 151.8 KB/sec)
[INFO] Downloading: http://repository.mygrid.org.uk/artifactory/repo/com/sun/xml/bind/jaxb-impl/2.1.10/jaxb-impl-2.1.10.pom
[INFO] Downloaded: http://repository.mygrid.org.uk/artifactory/repo/com/sun/xml/bind/jaxb-impl/2.1.10/jaxb-impl-2.1.10.pom (340 B at 6.6 KB/sec)
[INFO] Downloading: http://repository.mygrid.org.uk/artifactory/repo/commons-lang/commons-lang/2.5/commons-lang-2.5.pom
[INFO] Downloaded: http://repository.mygrid.org.uk/artifactory/repo/commons-lang/commons-lang/2.5/commons-lang-2.5.pom (17 KB at 398.3 KB/sec)
[INFO] Downloading: http://repository.mygrid.org.uk/artifactory/repo/org/apache/commons/commons-parent/12/commons-parent-12.pom
[INFO] Downloaded: http://repository.mygrid.org.uk/artifactory/repo/org/apache/commons/commons-parent/12/commons-parent-12.pom (27 KB at 355.2 KB/sec)
[INFO] Downloading: http://repository.mygrid.org.uk/artifactory/repo/commons-jxpath/commons-jxpath/1.2/commons-jxpath-1.2.pom
[INFO] Downloaded: http://repository.mygrid.org.uk/artifactory/repo/commons-jxpath/commons-jxpath/1.2/commons-jxpath-1.2.pom (5 KB at 50.3 KB/sec)
[INFO] Downloading: http://repository.mygrid.org.uk/artifactory/repo/servletapi/servletapi/2.2/servletapi-2.2.pom
[INFO] Downloaded: http://repository.mygrid.org.uk/artifactory/repo/servletapi/servletapi/2.2/servletapi-2.2.pom (740 B at 7.9 KB/sec)
[INFO] Downloading: http://repository.mygrid.org.uk/artifactory/repo/javax/servlet/servlet-api/2.2/servlet-api-2.2.pom
[INFO] Downloaded: http://repository.mygrid.org.uk/artifactory/repo/javax/servlet/servlet-api/2.2/servlet-api-2.2.pom (156 B at 3.8 KB/sec)
[INFO] Downloading: http://repository.mygrid.org.uk/artifactory/repo/xml-apis/xml-apis/2.0.2/xml-apis-2.0.2.pom
[INFO] Downloaded: http://repository.mygrid.org.uk/artifactory/repo/xml-apis/xml-apis/2.0.2/xml-apis-2.0.2.pom (346 B at 6.9 KB/sec)
[INFO] Downloading: http://repository.mygrid.org.uk/artifactory/repo/xml-apis/xml-apis/1.0.b2/xml-apis-1.0.b2.pom
[INFO] Downloaded: http://repository.mygrid.org.uk/artifactory/repo/xml-apis/xml-apis/1.0.b2/xml-apis-1.0.b2.pom (3 KB at 29.3 KB/sec)
[INFO] Downloading: http://repository.mygrid.org.uk/artifactory/repo/jdom/jdom/b9/jdom-b9.pom
[INFO] Downloaded: http://repository.mygrid.org.uk/artifactory/repo/jdom/jdom/b9/jdom-b9.pom (139 B at 1.2 KB/sec)
[INFO] Downloading: http://repository.mygrid.org.uk/artifactory/repo/commons-beanutils/commons-beanutils/1.4/commons-beanutils-1.4.pom
[INFO] Downloaded: http://repository.mygrid.org.uk/artifactory/repo/commons-beanutils/commons-beanutils/1.4/commons-beanutils-1.4.pom (2 KB at 8.3 KB/sec)
[INFO] Downloading: http://repository.mygrid.org.uk/artifactory/repo/commons-logging/commons-logging/1.0/commons-logging-1.0.pom
[INFO] Downloaded: http://repository.mygrid.org.uk/artifactory/repo/commons-logging/commons-logging/1.0/commons-logging-1.0.pom (163 B at 1.4 KB/sec)
[INFO] Downloading: http://repository.mygrid.org.uk/artifactory/repo/commons-collections/commons-collections/2.0/commons-collections-2.0.pom
[INFO] Downloaded: http://repository.mygrid.org.uk/artifactory/repo/commons-collections/commons-collections/2.0/commons-collections-2.0.pom (171 B at 1.5 KB/sec)
[INFO] Downloading: http://repository.mygrid.org.uk/artifactory/repo/commons-dbcp/commons-dbcp/1.4/commons-dbcp-1.4.pom
[INFO] Downloaded: http://repository.mygrid.org.uk/artifactory/repo/commons-dbcp/commons-dbcp/1.4/commons-dbcp-1.4.pom (11 KB at 66.3 KB/sec)
[INFO] Downloading: http://repository.mygrid.org.uk/artifactory/repo/commons-pool/commons-pool/1.5.4/commons-pool-1.5.4.pom
[INFO] Downloaded: http://repository.mygrid.org.uk/artifactory/repo/commons-pool/commons-pool/1.5.4/commons-pool-1.5.4.pom (12 KB at 215.8 KB/sec)
[INFO] Downloading: http://repository.mygrid.org.uk/artifactory/repo/net/sf/taverna/t2/infrastructure/spi-discovery-api/2.6-SNAPSHOT/maven-metadata.xml
[INFO] Downloaded: http://repository.mygrid.org.uk/artifactory/repo/net/sf/taverna/t2/infrastructure/spi-discovery-api/2.6-SNAPSHOT/maven-metadata.xml (2 KB at 28.9 KB/sec)
[INFO] Downloading: http://repository.mygrid.org.uk/artifactory/repo/commons-io/commons-io/1.4/commons-io-1.4.jar
[INFO] Downloading: http://repository.mygrid.org.uk/artifactory/repo/org/tupeloproject/tupelo-cet/2.6/tupelo-cet-2.6.jar
[INFO] Downloading: http://repository.mygrid.org.uk/artifactory/repo/org/tupeloproject/tupelo-kernel/2.6/tupelo-kernel-2.6.jar
[INFO] Downloading: http://repository.mygrid.org.uk/artifactory/repo/org/tupeloproject/tupelo-util/2.6/tupelo-util-2.6.jar
[INFO] Downloading: http://repository.mygrid.org.uk/artifactory/repo/org/openprovenance/opm-core/1.1.8/opm-core-1.1.8.jar
[INFO] Downloaded: http://repository.mygrid.org.uk/artifactory/repo/commons-io/commons-io/1.4/commons-io-1.4.jar (107 KB at 551.7 KB/sec)
[INFO] Downloading: http://repository.mygrid.org.uk/artifactory/repo/javax/xml/bind/jaxb-api/2.1/jaxb-api-2.1.jar
[INFO] Downloaded: http://repository.mygrid.org.uk/artifactory/repo/org/tupeloproject/tupelo-cet/2.6/tupelo-cet-2.6.jar (101 KB at 446.6 KB/sec)
[INFO] Downloading: http://repository.mygrid.org.uk/artifactory/repo/javax/xml/stream/stax-api/1.0-2/stax-api-1.0-2.jar
[INFO] Downloaded: http://repository.mygrid.org.uk/artifactory/repo/org/tupeloproject/tupelo-util/2.6/tupelo-util-2.6.jar (113 KB at 497.1 KB/sec)
[INFO] Downloading: http://repository.mygrid.org.uk/artifactory/repo/javax/activation/activation/1.1/activation-1.1.jar
[INFO] Downloaded: http://repository.mygrid.org.uk/artifactory/repo/javax/xml/bind/jaxb-api/2.1/jaxb-api-2.1.jar (78 KB at 706.3 KB/sec)
[INFO] Downloading: http://repository.mygrid.org.uk/artifactory/repo/com/sun/xml/bind/jaxb-impl/2.1.12/jaxb-impl-2.1.12.jar
[INFO] Downloaded: http://repository.mygrid.org.uk/artifactory/repo/org/tupeloproject/tupelo-kernel/2.6/tupelo-kernel-2.6.jar (472 KB at 1510.9 KB/sec)
[INFO] Downloading: http://repository.mygrid.org.uk/artifactory/repo/org/jvnet/jaxb2_commons/runtime/0.4.1.5/runtime-0.4.1.5.jar
[INFO] Downloaded: http://repository.mygrid.org.uk/artifactory/repo/org/openprovenance/opm-core/1.1.8/opm-core-1.1.8.jar (180 KB at 529.5 KB/sec)
[INFO] Downloading: http://repository.mygrid.org.uk/artifactory/repo/commons-lang/commons-lang/2.5/commons-lang-2.5.jar
[INFO] Downloaded: http://repository.mygrid.org.uk/artifactory/repo/javax/xml/stream/stax-api/1.0-2/stax-api-1.0-2.jar (23 KB at 151.0 KB/sec)
[INFO] Downloading: http://repository.mygrid.org.uk/artifactory/repo/commons-jxpath/commons-jxpath/1.2/commons-jxpath-1.2.jar
[INFO] Downloaded: http://repository.mygrid.org.uk/artifactory/repo/javax/activation/activation/1.1/activation-1.1.jar (62 KB at 433.1 KB/sec)
[INFO] Downloading: http://repository.mygrid.org.uk/artifactory/repo/xml-apis/xml-apis/1.0.b2/xml-apis-1.0.b2.jar
[INFO] Downloaded: http://repository.mygrid.org.uk/artifactory/repo/org/jvnet/jaxb2_commons/runtime/0.4.1.5/runtime-0.4.1.5.jar (17 KB at 101.4 KB/sec)
[INFO] Downloading: http://repository.mygrid.org.uk/artifactory/repo/jdom/jdom/b9/jdom-b9.jar
[INFO] Downloaded: http://repository.mygrid.org.uk/artifactory/repo/xml-apis/xml-apis/1.0.b2/xml-apis-1.0.b2.jar (107 KB at 617.1 KB/sec)
[INFO] Downloading: http://repository.mygrid.org.uk/artifactory/repo/commons-beanutils/commons-beanutils/1.4/commons-beanutils-1.4.jar
[INFO] Downloaded: http://repository.mygrid.org.uk/artifactory/repo/jdom/jdom/b9/jdom-b9.jar (133 KB at 1224.0 KB/sec)
[INFO] Downloading: http://repository.mygrid.org.uk/artifactory/repo/commons-dbcp/commons-dbcp/1.4/commons-dbcp-1.4.jar
[INFO] Downloaded: http://repository.mygrid.org.uk/artifactory/repo/commons-beanutils/commons-beanutils/1.4/commons-beanutils-1.4.jar (80 KB at 1219.2 KB/sec)
[INFO] Downloading: http://repository.mygrid.org.uk/artifactory/repo/commons-pool/commons-pool/1.5.4/commons-pool-1.5.4.jar
[INFO] Downloaded: http://repository.mygrid.org.uk/artifactory/repo/commons-dbcp/commons-dbcp/1.4/commons-dbcp-1.4.jar (157 KB at 1685.6 KB/sec)
[INFO] Downloaded: http://repository.mygrid.org.uk/artifactory/repo/commons-pool/commons-pool/1.5.4/commons-pool-1.5.4.jar (94 KB at 1491.5 KB/sec)
[INFO] Downloaded: http://repository.mygrid.org.uk/artifactory/repo/commons-lang/commons-lang/2.5/commons-lang-2.5.jar (273 KB at 723.2 KB/sec)
[INFO] Downloaded: http://repository.mygrid.org.uk/artifactory/repo/commons-jxpath/commons-jxpath/1.2/commons-jxpath-1.2.jar (279 KB at 742.5 KB/sec)
[INFO] Downloaded: http://repository.mygrid.org.uk/artifactory/repo/com/sun/xml/bind/jaxb-impl/2.1.12/jaxb-impl-2.1.12.jar (848 KB at 1481.6 KB/sec)
[INFO] Downloading: http://repository.mygrid.org.uk/artifactory/repo/org/tupeloproject/tupelo-util/2.6/tupelo-util-2.6.jar
[INFO] Downloaded: http://repository.mygrid.org.uk/artifactory/repo/org/tupeloproject/tupelo-util/2.6/tupelo-util-2.6.jar (113 KB at 2160.6 KB/sec)
[INFO] Downloading: http://repository.mygrid.org.uk/artifactory/repo/org/tupeloproject/tupelo-util/2.6/tupelo-util-2.6.jar
[INFO] Downloaded: http://repository.mygrid.org.uk/artifactory/repo/org/tupeloproject/tupelo-util/2.6/tupelo-util-2.6.jar (113 KB at 1841.8 KB/sec)
[INFO] 
[INFO] --- maven-clean-plugin:2.5:clean (default-clean) @ provenanceconnector ---
[INFO] 
[INFO] --- maven-resources-plugin:2.6:resources (default-resources) @ provenanceconnector ---
[INFO] Using 'UTF-8' encoding to copy filtered resources.
[INFO] Copying 0 resource
[INFO] 
[INFO] --- maven-compiler-plugin:3.1:compile (default-compile) @ provenanceconnector ---
[INFO] Changes detected - recompiling the module!
[INFO] Compiling 52 source files to /var/lib/jenkins/workspace/taverna-engine-core-maintenance/provenanceconnector/target/classes
[WARNING] /var/lib/jenkins/workspace/taverna-engine-core-maintenance/provenanceconnector/src/main/java/net/sf/taverna/t2/provenance/lineageservice/ProvenanceAnalysis.java: Some input files use or override a deprecated API.
[WARNING] /var/lib/jenkins/workspace/taverna-engine-core-maintenance/provenanceconnector/src/main/java/net/sf/taverna/t2/provenance/lineageservice/ProvenanceAnalysis.java: Recompile with -Xlint:deprecation for details.
[WARNING] /var/lib/jenkins/workspace/taverna-engine-core-maintenance/provenanceconnector/src/main/java/net/sf/taverna/t2/provenance/lineageservice/ProvenanceQuery.java: /var/lib/jenkins/workspace/taverna-engine-core-maintenance/provenanceconnector/src/main/java/net/sf/taverna/t2/provenance/lineageservice/ProvenanceQuery.java uses unchecked or unsafe operations.
[WARNING] /var/lib/jenkins/workspace/taverna-engine-core-maintenance/provenanceconnector/src/main/java/net/sf/taverna/t2/provenance/lineageservice/ProvenanceQuery.java: Recompile with -Xlint:unchecked for details.
[INFO] 
[INFO] --- maven-resources-plugin:2.6:testResources (default-testResources) @ provenanceconnector ---
[INFO] Using 'UTF-8' encoding to copy filtered resources.
[INFO] skip non existing resourceDirectory /var/lib/jenkins/workspace/taverna-engine-core-maintenance/provenanceconnector/src/test/resources
[INFO] 
[INFO] --- maven-compiler-plugin:3.1:testCompile (default-testCompile) @ provenanceconnector ---
[INFO] No sources to compile
[INFO] 
[INFO] --- maven-surefire-plugin:2.17:test (default-test) @ provenanceconnector ---
[INFO] No tests to run.
[JENKINS] Recording test results
[INFO] 
[INFO] --- maven-jar-plugin:2.4:jar (default-jar) @ provenanceconnector ---
[INFO] Building jar: /var/lib/jenkins/workspace/taverna-engine-core-maintenance/provenanceconnector/target/provenanceconnector-1.6-SNAPSHOT.jar
[INFO] 
[INFO] >>> maven-source-plugin:2.2.1:jar (default) @ provenanceconnector >>>
[WARNING] Failed to getClass for org.apache.maven.plugin.source.SourceJarMojo
[INFO] 
[INFO] <<< maven-source-plugin:2.2.1:jar (default) @ provenanceconnector <<<
[INFO] 
[INFO] --- maven-source-plugin:2.2.1:jar (default) @ provenanceconnector ---
[INFO] Building jar: /var/lib/jenkins/workspace/taverna-engine-core-maintenance/provenanceconnector/target/provenanceconnector-1.6-SNAPSHOT-sources.jar
[INFO] 
[INFO] >>> maven-source-plugin:2.2.1:test-jar (default) @ provenanceconnector >>>
[WARNING] Failed to getClass for org.apache.maven.plugin.source.TestSourceJarMojo
[INFO] 
[INFO] <<< maven-source-plugin:2.2.1:test-jar (default) @ provenanceconnector <<<
[INFO] 
[INFO] --- maven-source-plugin:2.2.1:test-jar (default) @ provenanceconnector ---
[INFO] No sources in project. Archive not created.
[INFO] 
[INFO] --- maven-jar-plugin:2.4:test-jar (default) @ provenanceconnector ---
[WARNING] JAR will be empty - no content was marked for inclusion!
[INFO] Building jar: /var/lib/jenkins/workspace/taverna-engine-core-maintenance/provenanceconnector/target/provenanceconnector-1.6-SNAPSHOT-tests.jar
[INFO] 
[INFO] --- maven-install-plugin:2.4:install (default-install) @ provenanceconnector ---
[INFO] Installing /var/lib/jenkins/workspace/taverna-engine-core-maintenance/provenanceconnector/target/provenanceconnector-1.6-SNAPSHOT.jar to /var/lib/jenkins/workspace/taverna-engine-core-maintenance/.repository/net/sf/taverna/t2/core/provenanceconnector/1.6-SNAPSHOT/provenanceconnector-1.6-SNAPSHOT.jar
[INFO] Installing /var/lib/jenkins/workspace/taverna-engine-core-maintenance/provenanceconnector/pom.xml to /var/lib/jenkins/workspace/taverna-engine-core-maintenance/.repository/net/sf/taverna/t2/core/provenanceconnector/1.6-SNAPSHOT/provenanceconnector-1.6-SNAPSHOT.pom
[INFO] Installing /var/lib/jenkins/workspace/taverna-engine-core-maintenance/provenanceconnector/target/provenanceconnector-1.6-SNAPSHOT-sources.jar to /var/lib/jenkins/workspace/taverna-engine-core-maintenance/.repository/net/sf/taverna/t2/core/provenanceconnector/1.6-SNAPSHOT/provenanceconnector-1.6-SNAPSHOT-sources.jar
[INFO] Installing /var/lib/jenkins/workspace/taverna-engine-core-maintenance/provenanceconnector/target/provenanceconnector-1.6-SNAPSHOT-tests.jar to /var/lib/jenkins/workspace/taverna-engine-core-maintenance/.repository/net/sf/taverna/t2/core/provenanceconnector/1.6-SNAPSHOT/provenanceconnector-1.6-SNAPSHOT-tests.jar
[INFO] Artifactory Build Info Recorder: Saving Build Info to '/var/lib/jenkins/workspace/taverna-engine-core-maintenance/target/build-info.json'
[INFO] Deploying artifact: http://repository.mygrid.org.uk/artifactory/libs-snapshot-local/net/sf/taverna/t2/core/1.6-SNAPSHOT/core-1.6-SNAPSHOT-tests.jar
[ERROR] org.jfrog.build.extractor.maven.BuildInfoRecorder.sessionEnded() listener has failed: 
java.lang.RuntimeException: Error occurred while publishing artifact to Artifactory: /var/lib/jenkins/workspace/taverna-engine-core-maintenance/target/core-1.6-SNAPSHOT-tests.jar.
 Skipping deployment of remaining artifacts (if any) and build info.
	at org.jfrog.build.extractor.maven.BuildDeploymentHelper.deployArtifacts(BuildDeploymentHelper.java:272)
	at org.jfrog.build.extractor.maven.BuildDeploymentHelper.deploy(BuildDeploymentHelper.java:108)
	at org.jfrog.build.extractor.maven.BuildInfoRecorder.sessionEnded(BuildInfoRecorder.java:139)
	at org.apache.maven.lifecycle.internal.DefaultExecutionEventCatapult.fire(DefaultExecutionEventCatapult.java:64)
	at org.apache.maven.lifecycle.internal.DefaultExecutionEventCatapult.fire(DefaultExecutionEventCatapult.java:42)
	at org.apache.maven.lifecycle.internal.LifecycleStarter.execute(LifecycleStarter.java:125)
	at org.apache.maven.DefaultMaven.doExecute(DefaultMaven.java:361)
	at org.apache.maven.DefaultMaven.execute(DefaultMaven.java:155)
	at org.jvnet.hudson.maven3.launcher.Maven31Launcher.main(Maven31Launcher.java:132)
	at sun.reflect.NativeMethodAccessorImpl.invoke0(Native Method)
	at sun.reflect.NativeMethodAccessorImpl.invoke(NativeMethodAccessorImpl.java:57)
	at sun.reflect.DelegatingMethodAccessorImpl.invoke(DelegatingMethodAccessorImpl.java:43)
	at java.lang.reflect.Method.invoke(Method.java:606)
	at org.codehaus.plexus.classworlds.launcher.Launcher.launchStandard(Launcher.java:330)
	at org.codehaus.plexus.classworlds.launcher.Launcher.launch(Launcher.java:238)
	at jenkins.maven3.agent.Maven31Main.launch(Maven31Main.java:181)
	at sun.reflect.NativeMethodAccessorImpl.invoke0(Native Method)
	at sun.reflect.NativeMethodAccessorImpl.invoke(NativeMethodAccessorImpl.java:57)
	at sun.reflect.DelegatingMethodAccessorImpl.invoke(DelegatingMethodAccessorImpl.java:43)
	at java.lang.reflect.Method.invoke(Method.java:606)
	at hudson.maven.Maven3Builder.call(Maven3Builder.java:134)
	at hudson.maven.Maven3Builder.call(Maven3Builder.java:69)
	at hudson.remoting.UserRequest.perform(UserRequest.java:118)
	at hudson.remoting.UserRequest.perform(UserRequest.java:48)
	at hudson.remoting.Request$2.run(Request.java:328)
	at hudson.remoting.InterceptingExecutorService$1.call(InterceptingExecutorService.java:72)
	at java.util.concurrent.FutureTask.run(FutureTask.java:262)
	at java.util.concurrent.ThreadPoolExecutor.runWorker(ThreadPoolExecutor.java:1145)
	at java.util.concurrent.ThreadPoolExecutor$Worker.run(ThreadPoolExecutor.java:615)
	at java.lang.Thread.run(Thread.java:745)
Caused by: java.io.IOException: Failed to deploy file: HTTP response code: 401. HTTP response message: Unauthorized
	at org.jfrog.build.client.ArtifactoryBuildInfoClient.throwHttpIOException(ArtifactoryBuildInfoClient.java:652)
	at org.jfrog.build.client.ArtifactoryBuildInfoClient.uploadFile(ArtifactoryBuildInfoClient.java:527)
	at org.jfrog.build.client.ArtifactoryBuildInfoClient.deployArtifact(ArtifactoryBuildInfoClient.java:302)
	at org.jfrog.build.extractor.maven.BuildDeploymentHelper.deployArtifacts(BuildDeploymentHelper.java:270)
	... 29 more
[ERROR] Internal error: java.lang.RuntimeException: org.jfrog.build.extractor.maven.BuildInfoRecorder.sessionEnded() listener has failed: Error occurred while publishing artifact to Artifactory: /var/lib/jenkins/workspace/taverna-engine-core-maintenance/target/core-1.6-SNAPSHOT-tests.jar.
[ERROR] Skipping deployment of remaining artifacts (if any) and build info. Failed to deploy file: HTTP response code: 401. HTTP response message: Unauthorized
[ERROR] -> [Help 1]
org.apache.maven.InternalErrorException: Internal error: java.lang.RuntimeException: org.jfrog.build.extractor.maven.BuildInfoRecorder.sessionEnded() listener has failed: 
	at org.apache.maven.DefaultMaven.execute(DefaultMaven.java:167)
	at org.jvnet.hudson.maven3.launcher.Maven31Launcher.main(Maven31Launcher.java:132)
	at sun.reflect.NativeMethodAccessorImpl.invoke0(Native Method)
	at sun.reflect.NativeMethodAccessorImpl.invoke(NativeMethodAccessorImpl.java:57)
	at sun.reflect.DelegatingMethodAccessorImpl.invoke(DelegatingMethodAccessorImpl.java:43)
	at java.lang.reflect.Method.invoke(Method.java:606)
	at org.codehaus.plexus.classworlds.launcher.Launcher.launchStandard(Launcher.java:330)
	at org.codehaus.plexus.classworlds.launcher.Launcher.launch(Launcher.java:238)
	at jenkins.maven3.agent.Maven31Main.launch(Maven31Main.java:181)
	at sun.reflect.NativeMethodAccessorImpl.invoke0(Native Method)
	at sun.reflect.NativeMethodAccessorImpl.invoke(NativeMethodAccessorImpl.java:57)
	at sun.reflect.DelegatingMethodAccessorImpl.invoke(DelegatingMethodAccessorImpl.java:43)
	at java.lang.reflect.Method.invoke(Method.java:606)
	at hudson.maven.Maven3Builder.call(Maven3Builder.java:134)
	at hudson.maven.Maven3Builder.call(Maven3Builder.java:69)
	at hudson.remoting.UserRequest.perform(UserRequest.java:118)
	at hudson.remoting.UserRequest.perform(UserRequest.java:48)
	at hudson.remoting.Request$2.run(Request.java:328)
	at hudson.remoting.InterceptingExecutorService$1.call(InterceptingExecutorService.java:72)
	at java.util.concurrent.FutureTask.run(FutureTask.java:262)
	at java.util.concurrent.ThreadPoolExecutor.runWorker(ThreadPoolExecutor.java:1145)
	at java.util.concurrent.ThreadPoolExecutor$Worker.run(ThreadPoolExecutor.java:615)
	at java.lang.Thread.run(Thread.java:745)
Caused by: java.lang.RuntimeException: org.jfrog.build.extractor.maven.BuildInfoRecorder.sessionEnded() listener has failed: 
	at org.jfrog.build.extractor.maven.BuildInfoRecorder.sessionEnded(BuildInfoRecorder.java:150)
	at org.apache.maven.lifecycle.internal.DefaultExecutionEventCatapult.fire(DefaultExecutionEventCatapult.java:64)
	at org.apache.maven.lifecycle.internal.DefaultExecutionEventCatapult.fire(DefaultExecutionEventCatapult.java:42)
	at org.apache.maven.lifecycle.internal.LifecycleStarter.execute(LifecycleStarter.java:125)
	at org.apache.maven.DefaultMaven.doExecute(DefaultMaven.java:361)
	at org.apache.maven.DefaultMaven.execute(DefaultMaven.java:155)
	... 22 more
Caused by: java.lang.RuntimeException: Error occurred while publishing artifact to Artifactory: /var/lib/jenkins/workspace/taverna-engine-core-maintenance/target/core-1.6-SNAPSHOT-tests.jar.
 Skipping deployment of remaining artifacts (if any) and build info.
	at org.jfrog.build.extractor.maven.BuildDeploymentHelper.deployArtifacts(BuildDeploymentHelper.java:272)
	at org.jfrog.build.extractor.maven.BuildDeploymentHelper.deploy(BuildDeploymentHelper.java:108)
	at org.jfrog.build.extractor.maven.BuildInfoRecorder.sessionEnded(BuildInfoRecorder.java:139)
	... 27 more
Caused by: java.io.IOException: Failed to deploy file: HTTP response code: 401. HTTP response message: Unauthorized
	at org.jfrog.build.client.ArtifactoryBuildInfoClient.throwHttpIOException(ArtifactoryBuildInfoClient.java:652)
[JENKINS] Archiving /var/lib/jenkins/workspace/taverna-engine-core-maintenance/provenanceconnector/pom.xml to net.sf.taverna.t2.core/provenanceconnector/1.6-SNAPSHOT/provenanceconnector-1.6-SNAPSHOT.pom
[JENKINS] Archiving /var/lib/jenkins/workspace/taverna-engine-core-maintenance/provenanceconnector/target/provenanceconnector-1.6-SNAPSHOT.jar to net.sf.taverna.t2.core/provenanceconnector/1.6-SNAPSHOT/provenanceconnector-1.6-SNAPSHOT.jar
[JENKINS] Archiving /var/lib/jenkins/workspace/taverna-engine-core-maintenance/provenanceconnector/target/provenanceconnector-1.6-SNAPSHOT-sources.jar to net.sf.taverna.t2.core/provenanceconnector/1.6-SNAPSHOT/provenanceconnector-1.6-SNAPSHOT-sources.jar
[JENKINS] Archiving /var/lib/jenkins/workspace/taverna-engine-core-maintenance/provenanceconnector/target/provenanceconnector-1.6-SNAPSHOT-tests.jar to net.sf.taverna.t2.core/provenanceconnector/1.6-SNAPSHOT/provenanceconnector-1.6-SNAPSHOT-tests.jar
	at org.jfrog.build.client.ArtifactoryBuildInfoClient.uploadFile(ArtifactoryBuildInfoClient.java:527)
	at org.jfrog.build.client.ArtifactoryBuildInfoClient.deployArtifact(ArtifactoryBuildInfoClient.java:302)
	at org.jfrog.build.extractor.maven.BuildDeploymentHelper.deployArtifacts(BuildDeploymentHelper.java:270)
	... 29 more
[ERROR] 
[ERROR] To see the full stack trace of the errors, re-run Maven with the -e switch.
[ERROR] Re-run Maven using the -X switch to enable full debug logging.
[ERROR] 
[ERROR] For more information about the errors and possible solutions, please read the following articles:
[ERROR] [Help 1] http://cwiki.apache.org/confluence/display/MAVEN/InternalErrorException
[JENKINS] Archiving /var/lib/jenkins/workspace/taverna-engine-core-maintenance/reference-api/pom.xml to net.sf.taverna.t2.core/reference-api/1.6-SNAPSHOT/reference-api-1.6-SNAPSHOT.pom
[JENKINS] Archiving /var/lib/jenkins/workspace/taverna-engine-core-maintenance/reference-api/target/reference-api-1.6-SNAPSHOT.jar to net.sf.taverna.t2.core/reference-api/1.6-SNAPSHOT/reference-api-1.6-SNAPSHOT.jar
[JENKINS] Archiving /var/lib/jenkins/workspace/taverna-engine-core-maintenance/reference-api/target/reference-api-1.6-SNAPSHOT-sources.jar to net.sf.taverna.t2.core/reference-api/1.6-SNAPSHOT/reference-api-1.6-SNAPSHOT-sources.jar
[JENKINS] Archiving /var/lib/jenkins/workspace/taverna-engine-core-maintenance/reference-api/target/reference-api-1.6-SNAPSHOT-tests.jar to net.sf.taverna.t2.core/reference-api/1.6-SNAPSHOT/reference-api-1.6-SNAPSHOT-tests.jar
[JENKINS] Archiving /var/lib/jenkins/workspace/taverna-engine-core-maintenance/reference-testhelpers/pom.xml to net.sf.taverna.t2.core/reference-testhelpers/1.6-SNAPSHOT/reference-testhelpers-1.6-SNAPSHOT.pom
[JENKINS] Archiving /var/lib/jenkins/workspace/taverna-engine-core-maintenance/reference-testhelpers/target/reference-testhelpers-1.6-SNAPSHOT.jar to net.sf.taverna.t2.core/reference-testhelpers/1.6-SNAPSHOT/reference-testhelpers-1.6-SNAPSHOT.jar
[JENKINS] Archiving /var/lib/jenkins/workspace/taverna-engine-core-maintenance/reference-testhelpers/target/reference-testhelpers-1.6-SNAPSHOT-sources.jar to net.sf.taverna.t2.core/reference-testhelpers/1.6-SNAPSHOT/reference-testhelpers-1.6-SNAPSHOT-sources.jar
[JENKINS] Archiving /var/lib/jenkins/workspace/taverna-engine-core-maintenance/reference-testhelpers/target/reference-testhelpers-1.6-SNAPSHOT-tests.jar to net.sf.taverna.t2.core/reference-testhelpers/1.6-SNAPSHOT/reference-testhelpers-1.6-SNAPSHOT-tests.jar
[JENKINS] Archiving /var/lib/jenkins/workspace/taverna-engine-core-maintenance/pom.xml to net.sf.taverna.t2/core/1.6-SNAPSHOT/core-1.6-SNAPSHOT.pom
[JENKINS] Archiving /var/lib/jenkins/workspace/taverna-engine-core-maintenance/target/core-1.6-SNAPSHOT-tests.jar to net.sf.taverna.t2/core/1.6-SNAPSHOT/core-1.6-SNAPSHOT-tests.jar
[JENKINS] Archiving /var/lib/jenkins/workspace/taverna-engine-core-maintenance/workflowmodel-impl/pom.xml to net.sf.taverna.t2.core/workflowmodel-impl/1.6-SNAPSHOT/workflowmodel-impl-1.6-SNAPSHOT.pom
[JENKINS] Archiving /var/lib/jenkins/workspace/taverna-engine-core-maintenance/workflowmodel-impl/target/workflowmodel-impl-1.6-SNAPSHOT.jar to net.sf.taverna.t2.core/workflowmodel-impl/1.6-SNAPSHOT/workflowmodel-impl-1.6-SNAPSHOT.jar
[JENKINS] Archiving /var/lib/jenkins/workspace/taverna-engine-core-maintenance/workflowmodel-impl/target/workflowmodel-impl-1.6-SNAPSHOT-sources.jar to net.sf.taverna.t2.core/workflowmodel-impl/1.6-SNAPSHOT/workflowmodel-impl-1.6-SNAPSHOT-sources.jar
[JENKINS] Archiving /var/lib/jenkins/workspace/taverna-engine-core-maintenance/workflowmodel-impl/target/workflowmodel-impl-1.6-SNAPSHOT-test-sources.jar to net.sf.taverna.t2.core/workflowmodel-impl/1.6-SNAPSHOT/workflowmodel-impl-1.6-SNAPSHOT-test-sources.jar
[JENKINS] Archiving /var/lib/jenkins/workspace/taverna-engine-core-maintenance/workflowmodel-impl/target/workflowmodel-impl-1.6-SNAPSHOT-tests.jar to net.sf.taverna.t2.core/workflowmodel-impl/1.6-SNAPSHOT/workflowmodel-impl-1.6-SNAPSHOT-tests.jar
[JENKINS] Archiving /var/lib/jenkins/workspace/taverna-engine-core-maintenance/workflowmodel-api/pom.xml to net.sf.taverna.t2.core/workflowmodel-api/1.6-SNAPSHOT/workflowmodel-api-1.6-SNAPSHOT.pom
[JENKINS] Archiving /var/lib/jenkins/workspace/taverna-engine-core-maintenance/workflowmodel-api/target/workflowmodel-api-1.6-SNAPSHOT.jar to net.sf.taverna.t2.core/workflowmodel-api/1.6-SNAPSHOT/workflowmodel-api-1.6-SNAPSHOT.jar
[JENKINS] Archiving /var/lib/jenkins/workspace/taverna-engine-core-maintenance/workflowmodel-api/target/workflowmodel-api-1.6-SNAPSHOT-sources.jar to net.sf.taverna.t2.core/workflowmodel-api/1.6-SNAPSHOT/workflowmodel-api-1.6-SNAPSHOT-sources.jar
[JENKINS] Archiving /var/lib/jenkins/workspace/taverna-engine-core-maintenance/workflowmodel-api/target/workflowmodel-api-1.6-SNAPSHOT-test-sources.jar to net.sf.taverna.t2.core/workflowmodel-api/1.6-SNAPSHOT/workflowmodel-api-1.6-SNAPSHOT-test-sources.jar
[JENKINS] Archiving /var/lib/jenkins/workspace/taverna-engine-core-maintenance/workflowmodel-api/target/workflowmodel-api-1.6-SNAPSHOT-tests.jar to net.sf.taverna.t2.core/workflowmodel-api/1.6-SNAPSHOT/workflowmodel-api-1.6-SNAPSHOT-tests.jar
[JENKINS] Archiving /var/lib/jenkins/workspace/taverna-engine-core-maintenance/reference-impl/pom.xml to net.sf.taverna.t2.core/reference-impl/1.6-SNAPSHOT/reference-impl-1.6-SNAPSHOT.pom
[JENKINS] Archiving /var/lib/jenkins/workspace/taverna-engine-core-maintenance/reference-impl/target/reference-impl-1.6-SNAPSHOT.jar to net.sf.taverna.t2.core/reference-impl/1.6-SNAPSHOT/reference-impl-1.6-SNAPSHOT.jar
[JENKINS] Archiving /var/lib/jenkins/workspace/taverna-engine-core-maintenance/reference-impl/target/reference-impl-1.6-SNAPSHOT-sources.jar to net.sf.taverna.t2.core/reference-impl/1.6-SNAPSHOT/reference-impl-1.6-SNAPSHOT-sources.jar
[JENKINS] Archiving /var/lib/jenkins/workspace/taverna-engine-core-maintenance/reference-impl/target/reference-impl-1.6-SNAPSHOT-test-sources.jar to net.sf.taverna.t2.core/reference-impl/1.6-SNAPSHOT/reference-impl-1.6-SNAPSHOT-test-sources.jar
[JENKINS] Archiving /var/lib/jenkins/workspace/taverna-engine-core-maintenance/reference-impl/target/reference-impl-1.6-SNAPSHOT-tests.jar to net.sf.taverna.t2.core/reference-impl/1.6-SNAPSHOT/reference-impl-1.6-SNAPSHOT-tests.jar
channel stopped
Warning: you have no plugins providing access control for builds, so falling back to legacy behavior of permitting any downstream builds to be triggered
Finished: FAILURE