FailedConsole Output

Started by upstream project "taverna-activity-test-utils-maintenance" build number 14
originally caused by:
 Started by upstream project "taverna-engine-referencetypes-maintenance" build number 12
 originally caused by:
  Started by upstream project "taverna-engine-core-maintenance" build number 15
  originally caused by:
   Started by user Christian Brenninkmeijer (christian)
Building remotely on jenkins-slave in workspace /var/lib/jenkins/workspace/taverna-biomoby-activity-maintenance
Cloning the remote Git repository
Cloning repository git@github.com:taverna/taverna-biomoby-activity.git
 > /usr/bin/git init /var/lib/jenkins/workspace/taverna-biomoby-activity-maintenance
Fetching upstream changes from git@github.com:taverna/taverna-biomoby-activity.git
 > /usr/bin/git --version
 > /usr/bin/git fetch --tags --progress git@github.com:taverna/taverna-biomoby-activity.git +refs/heads/*:refs/remotes/origin/*
 > /usr/bin/git config remote.origin.url git@github.com:taverna/taverna-biomoby-activity.git
 > /usr/bin/git config remote.origin.fetch +refs/heads/*:refs/remotes/origin/*
 > /usr/bin/git config remote.origin.url git@github.com:taverna/taverna-biomoby-activity.git
Fetching upstream changes from git@github.com:taverna/taverna-biomoby-activity.git
 > /usr/bin/git fetch --tags --progress git@github.com:taverna/taverna-biomoby-activity.git +refs/heads/*:refs/remotes/origin/*
 > /usr/bin/git rev-parse origin/maintenance^{commit}
Checking out Revision 186cf5766d63099fda3521ce12d182eb3fa602c9 (origin/maintenance)
 > /usr/bin/git config core.sparsecheckout
 > /usr/bin/git checkout -f 186cf5766d63099fda3521ce12d182eb3fa602c9
 > /usr/bin/git rev-list 186cf5766d63099fda3521ce12d182eb3fa602c9
Parsing POMs
Downloaded artifact http://repository.mygrid.org.uk/artifactory/repo/net/sf/taverna/taverna-parent/2.6-SNAPSHOT/maven-metadata.xml
Downloaded artifact http://repository.mygrid.org.uk/artifactory/repo/net/sf/taverna/taverna-parent/2.6-SNAPSHOT/taverna-parent-2.6-20140528.131943-5.pom
Downloaded artifact http://repository.mygrid.org.uk/artifactory/repo/net/sf/taverna/parent/0.2.2014-03-19/parent-0.2.2014-03-19.pom
Downloaded artifact http://repository.mygrid.org.uk/artifactory/repo/net/sf/taverna/taverna-parent/2.6-SNAPSHOT/maven-metadata.xml
maven31-agent.jar already up to date
maven31-interceptor.jar already up to date
maven3-interceptor-commons.jar already up to date
[taverna-biomoby-activity-maintenance] $ /var/lib/jenkins/tools/hudson.model.JDK/jdk7/bin/java -Xmx1024m -XX:MaxPermSize=1024m -cp /var/lib/jenkins/maven31-agent.jar:/var/lib/jenkins/tools/hudson.tasks.Maven_MavenInstallation/maven_3.2.1/boot/plexus-classworlds-2.5.1.jar:/var/lib/jenkins/tools/hudson.tasks.Maven_MavenInstallation/maven_3.2.1/conf/logging jenkins.maven3.agent.Maven31Main /var/lib/jenkins/tools/hudson.tasks.Maven_MavenInstallation/maven_3.2.1 /run/jenkins/slave.jar /var/lib/jenkins/maven31-interceptor.jar /var/lib/jenkins/maven3-interceptor-commons.jar 46718
<===[JENKINS REMOTING CAPACITY]===>channel started
Executing Maven:  -B -f /var/lib/jenkins/workspace/taverna-biomoby-activity-maintenance/pom.xml -Dmaven.repo.local=/var/lib/jenkins/workspace/taverna-biomoby-activity-maintenance/.repository clean install -U
[INFO] Scanning for projects...
[INFO] Downloading: http://repository.mygrid.org.uk/artifactory/repo/net/sf/taverna/taverna-parent/2.6-SNAPSHOT/maven-metadata.xml
[INFO] Downloaded: http://repository.mygrid.org.uk/artifactory/repo/net/sf/taverna/taverna-parent/2.6-SNAPSHOT/maven-metadata.xml (799 B at 1.2 KB/sec)
[INFO] Initializing Artifactory Build-Info Recording
[HUDSON] Collecting dependencies info
[INFO] 
[INFO] Using the builder org.apache.maven.lifecycle.internal.builder.singlethreaded.SingleThreadedBuilder with a thread count of 1
[INFO]                                                                         
[INFO] ------------------------------------------------------------------------
[INFO] Building Taverna 2 Biomoby Activity 1.6-SNAPSHOT
[INFO] ------------------------------------------------------------------------
[INFO] Downloading: http://repository.mygrid.org.uk/artifactory/repo/org/apache/maven/plugins/maven-source-plugin/2.2.1/maven-source-plugin-2.2.1.pom
[INFO] Downloaded: http://repository.mygrid.org.uk/artifactory/repo/org/apache/maven/plugins/maven-source-plugin/2.2.1/maven-source-plugin-2.2.1.pom (7 KB at 33.2 KB/sec)
[INFO] Downloading: http://repository.mygrid.org.uk/artifactory/repo/org/apache/maven/plugins/maven-source-plugin/2.2.1/maven-source-plugin-2.2.1.pom
[INFO] Downloaded: http://repository.mygrid.org.uk/artifactory/repo/org/apache/maven/plugins/maven-source-plugin/2.2.1/maven-source-plugin-2.2.1.pom (7 KB at 59.2 KB/sec)
[INFO] Downloading: http://repository.mygrid.org.uk/artifactory/repo/org/apache/maven/plugins/maven-plugins/23/maven-plugins-23.pom
[INFO] Downloaded: http://repository.mygrid.org.uk/artifactory/repo/org/apache/maven/plugins/maven-plugins/23/maven-plugins-23.pom (9 KB at 6.7 KB/sec)
[INFO] Downloading: http://repository.mygrid.org.uk/artifactory/repo/org/apache/maven/maven-parent/22/maven-parent-22.pom
[INFO] Downloaded: http://repository.mygrid.org.uk/artifactory/repo/org/apache/maven/maven-parent/22/maven-parent-22.pom (30 KB at 0.8 KB/sec)
[INFO] Downloading: http://repository.mygrid.org.uk/artifactory/repo/org/apache/apache/11/apache-11.pom
[INFO] Downloaded: http://repository.mygrid.org.uk/artifactory/repo/org/apache/apache/11/apache-11.pom (15 KB at 0.5 KB/sec)
[INFO] Downloading: http://repository.mygrid.org.uk/artifactory/repo/org/apache/maven/plugins/maven-source-plugin/2.2.1/maven-source-plugin-2.2.1.jar
[INFO] Downloaded: http://repository.mygrid.org.uk/artifactory/repo/org/apache/maven/plugins/maven-source-plugin/2.2.1/maven-source-plugin-2.2.1.jar (30 KB at 0.9 KB/sec)
[INFO] Downloading: http://repository.mygrid.org.uk/artifactory/repo/org/apache/maven/plugins/maven-jar-plugin/2.4/maven-jar-plugin-2.4.pom
[INFO] Downloaded: http://repository.mygrid.org.uk/artifactory/repo/org/apache/maven/plugins/maven-jar-plugin/2.4/maven-jar-plugin-2.4.pom (6 KB at 0.3 KB/sec)
[INFO] Downloading: http://repository.mygrid.org.uk/artifactory/repo/org/apache/maven/plugins/maven-plugins/22/maven-plugins-22.pom
[INFO] Downloaded: http://repository.mygrid.org.uk/artifactory/repo/org/apache/maven/plugins/maven-plugins/22/maven-plugins-22.pom (13 KB at 0.6 KB/sec)
[INFO] Downloading: http://repository.mygrid.org.uk/artifactory/repo/org/apache/maven/maven-parent/21/maven-parent-21.pom
[INFO] Downloaded: http://repository.mygrid.org.uk/artifactory/repo/org/apache/maven/maven-parent/21/maven-parent-21.pom (26 KB at 0.7 KB/sec)
[INFO] Downloading: http://repository.mygrid.org.uk/artifactory/repo/org/apache/apache/10/apache-10.pom
[INFO] Downloaded: http://repository.mygrid.org.uk/artifactory/repo/org/apache/apache/10/apache-10.pom (15 KB at 0.7 KB/sec)
[INFO] Downloading: http://repository.mygrid.org.uk/artifactory/repo/org/apache/maven/plugins/maven-jar-plugin/2.4/maven-jar-plugin-2.4.jar
[INFO] Downloaded: http://repository.mygrid.org.uk/artifactory/repo/org/apache/maven/plugins/maven-jar-plugin/2.4/maven-jar-plugin-2.4.jar (34 KB at 1.2 KB/sec)
[INFO] Downloading: http://repository.mygrid.org.uk/artifactory/repo/org/apache/maven/plugins/maven-clean-plugin/2.5/maven-clean-plugin-2.5.pom
[INFO] Downloaded: http://repository.mygrid.org.uk/artifactory/repo/org/apache/maven/plugins/maven-clean-plugin/2.5/maven-clean-plugin-2.5.pom (4 KB at 0.1 KB/sec)
[INFO] Downloading: http://repository.mygrid.org.uk/artifactory/repo/org/apache/maven/plugins/maven-clean-plugin/2.5/maven-clean-plugin-2.5.jar
[INFO] Downloaded: http://repository.mygrid.org.uk/artifactory/repo/org/apache/maven/plugins/maven-clean-plugin/2.5/maven-clean-plugin-2.5.jar (25 KB at 0.7 KB/sec)
[INFO] Downloading: http://repository.mygrid.org.uk/artifactory/repo/org/apache/maven/plugins/maven-resources-plugin/2.6/maven-resources-plugin-2.6.pom
[INFO] Downloaded: http://repository.mygrid.org.uk/artifactory/repo/org/apache/maven/plugins/maven-resources-plugin/2.6/maven-resources-plugin-2.6.pom (8 KB at 0.2 KB/sec)
[INFO] Downloading: http://repository.mygrid.org.uk/artifactory/repo/org/apache/maven/plugins/maven-resources-plugin/2.6/maven-resources-plugin-2.6.jar
[INFO] Downloaded: http://repository.mygrid.org.uk/artifactory/repo/org/apache/maven/plugins/maven-resources-plugin/2.6/maven-resources-plugin-2.6.jar (29 KB at 1.0 KB/sec)
[INFO] Downloading: http://repository.mygrid.org.uk/artifactory/repo/org/apache/maven/plugins/maven-compiler-plugin/3.1/maven-compiler-plugin-3.1.pom
[INFO] Downloaded: http://repository.mygrid.org.uk/artifactory/repo/org/apache/maven/plugins/maven-compiler-plugin/3.1/maven-compiler-plugin-3.1.pom (10 KB at 0.5 KB/sec)
[INFO] Downloading: http://repository.mygrid.org.uk/artifactory/repo/org/apache/maven/plugins/maven-plugins/24/maven-plugins-24.pom
[INFO] Downloaded: http://repository.mygrid.org.uk/artifactory/repo/org/apache/maven/plugins/maven-plugins/24/maven-plugins-24.pom (11 KB at 0.3 KB/sec)
[INFO] Downloading: http://repository.mygrid.org.uk/artifactory/repo/org/apache/maven/maven-parent/23/maven-parent-23.pom
[INFO] Downloaded: http://repository.mygrid.org.uk/artifactory/repo/org/apache/maven/maven-parent/23/maven-parent-23.pom (32 KB at 1.7 KB/sec)
[INFO] Downloading: http://repository.mygrid.org.uk/artifactory/repo/org/apache/apache/13/apache-13.pom
[INFO] Downloaded: http://repository.mygrid.org.uk/artifactory/repo/org/apache/apache/13/apache-13.pom (14 KB at 0.6 KB/sec)
[INFO] Downloading: http://repository.mygrid.org.uk/artifactory/repo/org/apache/maven/plugins/maven-compiler-plugin/3.1/maven-compiler-plugin-3.1.jar
[INFO] Downloaded: http://repository.mygrid.org.uk/artifactory/repo/org/apache/maven/plugins/maven-compiler-plugin/3.1/maven-compiler-plugin-3.1.jar (42 KB at 1.1 KB/sec)
[INFO] Downloading: http://repository.mygrid.org.uk/artifactory/repo/org/apache/maven/plugins/maven-surefire-plugin/2.17/maven-surefire-plugin-2.17.pom
[INFO] Downloaded: http://repository.mygrid.org.uk/artifactory/repo/org/apache/maven/plugins/maven-surefire-plugin/2.17/maven-surefire-plugin-2.17.pom (5 KB at 0.2 KB/sec)
[INFO] Downloading: http://repository.mygrid.org.uk/artifactory/repo/org/apache/maven/surefire/surefire/2.17/surefire-2.17.pom
[INFO] Downloaded: http://repository.mygrid.org.uk/artifactory/repo/org/apache/maven/surefire/surefire/2.17/surefire-2.17.pom (17 KB at 1.0 KB/sec)
[INFO] Downloading: http://repository.mygrid.org.uk/artifactory/repo/org/apache/maven/plugins/maven-surefire-plugin/2.17/maven-surefire-plugin-2.17.jar
[INFO] Downloaded: http://repository.mygrid.org.uk/artifactory/repo/org/apache/maven/plugins/maven-surefire-plugin/2.17/maven-surefire-plugin-2.17.jar (34 KB at 1.6 KB/sec)
[INFO] Downloading: http://repository.mygrid.org.uk/artifactory/repo/org/apache/maven/plugins/maven-install-plugin/2.4/maven-install-plugin-2.4.pom
[INFO] ------------------------------------------------------------------------
[INFO] BUILD FAILURE
[INFO] ------------------------------------------------------------------------
[INFO] Total time: 10:21 min
[INFO] Finished at: 2014-08-08T16:05:08+00:00
[INFO] Final Memory: 11M/69M
[INFO] ------------------------------------------------------------------------
[ERROR] Plugin org.apache.maven.plugins:maven-install-plugin:2.4 or one of its dependencies could not be resolved: Failed to read artifact descriptor for org.apache.maven.plugins:maven-install-plugin:jar:2.4: Could not transfer artifact org.apache.maven.plugins:maven-install-plugin:pom:2.4 from/to mygrid-repository (http://repository.mygrid.org.uk/artifactory/repo): Failed to transfer file: http://repository.mygrid.org.uk/artifactory/repo/org/apache/maven/plugins/maven-install-plugin/2.4/maven-install-plugin-2.4.pom. Return code is: 503 , ReasonPhrase:Service Temporarily Unavailable. -> [Help 1]
[ERROR] 
[ERROR] To see the full stack trace of the errors, re-run Maven with the -e switch.
[ERROR] Re-run Maven using the -X switch to enable full debug logging.
[ERROR] 
[ERROR] For more information about the errors and possible solutions, please read the following articles:
[ERROR] [Help 1] http://cwiki.apache.org/confluence/display/MAVEN/PluginResolutionException
[JENKINS] Archiving /var/lib/jenkins/workspace/taverna-biomoby-activity-maintenance/pom.xml to net.sf.taverna.t2.activities/biomoby-activity/1.6-SNAPSHOT/biomoby-activity-1.6-SNAPSHOT.pom
channel stopped
Warning: you have no plugins providing access control for builds, so falling back to legacy behavior of permitting any downstream builds to be triggered
Finished: FAILURE