UnstableConsole Output

<===[JENKINS REMOTING CAPACITY]===>channel started
log4j:WARN No appenders could be found for logger (org.apache.commons.beanutils.converters.BooleanConverter).
log4j:WARN Please initialize the log4j system properly.
Executing Maven:  -B -f /local/jenkins/jobs/t2-server-jar/workspace/pom.xml -Dmaven.repo.local=/local/jenkins/jobs/t2-server-jar/workspace/.repository clean install
[INFO] Scanning for projects...
[INFO] ------------------------------------------------------------------------
[INFO] Building Taverna Server Client Library
[INFO]    task-segment: [clean, install]
[INFO] ------------------------------------------------------------------------
[INFO] [clean:clean {execution: default-clean}]
[INFO] Deleting directory /local/jenkins/jobs/t2-server-jar/workspace/target
[INFO] [jaxb2:xjc {execution: rest-xjc}]
[INFO] Generating source...
[INFO] parsing a schema...
[INFO] compiling a schema...
[INFO] uk/org/taverna/server/client/xml/rest/Adapter1.java
[INFO] uk/org/taverna/server/client/xml/rest/Credential.java
[INFO] uk/org/taverna/server/client/xml/rest/CredentialCollection.java
[INFO] uk/org/taverna/server/client/xml/rest/CredentialDescriptor.java
[INFO] uk/org/taverna/server/client/xml/rest/CredentialList.java
[INFO] uk/org/taverna/server/client/xml/rest/DirectoryContents.java
[INFO] uk/org/taverna/server/client/xml/rest/DirectoryEntry.java
[INFO] uk/org/taverna/server/client/xml/rest/DirectoryReference.java
[INFO] uk/org/taverna/server/client/xml/rest/EnabledNotificationFabrics.java
[INFO] uk/org/taverna/server/client/xml/rest/FileReference.java
[INFO] uk/org/taverna/server/client/xml/rest/FilesystemCreationOperation.java
[INFO] uk/org/taverna/server/client/xml/rest/InputDescription.java
[INFO] uk/org/taverna/server/client/xml/rest/KeyPairCredential.java
[INFO] uk/org/taverna/server/client/xml/rest/LinkedPermissionDescription.java
[INFO] uk/org/taverna/server/client/xml/rest/ListenerDefinition.java
[INFO] uk/org/taverna/server/client/xml/rest/ListenerDescription.java
[INFO] uk/org/taverna/server/client/xml/rest/Listeners.java
[INFO] uk/org/taverna/server/client/xml/rest/Location.java
[INFO] uk/org/taverna/server/client/xml/rest/MakeDirectory.java
[INFO] uk/org/taverna/server/client/xml/rest/ObjectFactory.java
[INFO] uk/org/taverna/server/client/xml/rest/PasswordCredential.java
[INFO] uk/org/taverna/server/client/xml/rest/Permission.java
[INFO] uk/org/taverna/server/client/xml/rest/PermissionDescription.java
[INFO] uk/org/taverna/server/client/xml/rest/PermissionsDescription.java
[INFO] uk/org/taverna/server/client/xml/rest/PermittedListeners.java
[INFO] uk/org/taverna/server/client/xml/rest/PermittedWorkflows.java
[INFO] uk/org/taverna/server/client/xml/rest/PolicyDescription.java
[INFO] uk/org/taverna/server/client/xml/rest/Properties.java
[INFO] uk/org/taverna/server/client/xml/rest/PropertyDescription.java
[INFO] uk/org/taverna/server/client/xml/rest/RunDescription.java
[INFO] uk/org/taverna/server/client/xml/rest/RunList.java
[INFO] uk/org/taverna/server/client/xml/rest/SecurityDescriptor.java
[INFO] uk/org/taverna/server/client/xml/rest/ServerDescription.java
[INFO] uk/org/taverna/server/client/xml/rest/TavernaRun.java
[INFO] uk/org/taverna/server/client/xml/rest/TavernaRunInputs.java
[INFO] uk/org/taverna/server/client/xml/rest/TrustCollection.java
[INFO] uk/org/taverna/server/client/xml/rest/TrustDescriptor.java
[INFO] uk/org/taverna/server/client/xml/rest/TrustList.java
[INFO] uk/org/taverna/server/client/xml/rest/UploadFile.java
[INFO] uk/org/taverna/server/client/xml/rest/VersionedElement.java
[INFO] uk/org/taverna/server/client/xml/rest/Workflow.java
[INFO] uk/org/taverna/server/client/xml/rest/package-info.java
[INFO] [jaxb2:xjc {execution: port-xjc}]
[INFO] Generating source...
[INFO] parsing a schema...
[INFO] compiling a schema...
[INFO] uk/org/taverna/server/client/xml/port/AbsentValue.java
[INFO] uk/org/taverna/server/client/xml/port/Adapter1.java
[INFO] uk/org/taverna/server/client/xml/port/ErrorValue.java
[INFO] uk/org/taverna/server/client/xml/port/InputDescription.java
[INFO] uk/org/taverna/server/client/xml/port/InputPort.java
[INFO] uk/org/taverna/server/client/xml/port/LeafValue.java
[INFO] uk/org/taverna/server/client/xml/port/ListValue.java
[INFO] uk/org/taverna/server/client/xml/port/ObjectFactory.java
[INFO] uk/org/taverna/server/client/xml/port/OutputDescription.java
[INFO] uk/org/taverna/server/client/xml/port/OutputPort.java
[INFO] uk/org/taverna/server/client/xml/port/Port.java
[INFO] uk/org/taverna/server/client/xml/port/PortDescription.java
[INFO] uk/org/taverna/server/client/xml/port/Value.java
[INFO] uk/org/taverna/server/client/xml/port/package-info.java
[INFO] [resources:resources {execution: default-resources}]
[INFO] Using 'UTF-8' encoding to copy filtered resources.
[INFO] Copying 1 resource
[INFO] Copying 5 resources
[INFO] Copying 1 resource
[INFO] [compiler:compile {execution: default-compile}]
[INFO] Compiling 108 source files to /local/jenkins/jobs/t2-server-jar/workspace/target/classes
[INFO] [resources:testResources {execution: default-testResources}]
[INFO] Using 'UTF-8' encoding to copy filtered resources.
[INFO] Copying 18 resources
[INFO] [compiler:testCompile {execution: default-testCompile}]
[INFO] Compiling 9 source files to /local/jenkins/jobs/t2-server-jar/workspace/target/test-classes
[WARNING] DEPRECATED [systemProperties]: Use systemPropertyVariables instead.
[INFO] [surefire:test {execution: default-test}]
[INFO] Surefire report directory: /local/jenkins/jobs/t2-server-jar/workspace/target/surefire-reports

-------------------------------------------------------
 T E S T S
-------------------------------------------------------
Running uk.org.taverna.server.client.TestServer
Tests run: 2, Failures: 1, Errors: 1, Skipped: 0, Time elapsed: 0.085 sec <<< FAILURE!
Running uk.org.taverna.server.client.util.TestURIUtils
Tests run: 4, Failures: 0, Errors: 0, Skipped: 0, Time elapsed: 0.07 sec
Running uk.org.taverna.server.client.TestRun
Tests run: 2, Failures: 1, Errors: 1, Skipped: 0, Time elapsed: 0.024 sec <<< FAILURE!
Running uk.org.taverna.server.client.TestAll
Tests run: 14, Failures: 5, Errors: 5, Skipped: 0, Time elapsed: 0.087 sec <<< FAILURE!
Running uk.org.taverna.server.client.TestSecureWorkflows
Tests run: 2, Failures: 1, Errors: 1, Skipped: 0, Time elapsed: 0.005 sec <<< FAILURE!
Running uk.org.taverna.server.client.TestRunPermissions
Tests run: 2, Failures: 1, Errors: 1, Skipped: 0, Time elapsed: 0.005 sec <<< FAILURE!
Running uk.org.taverna.server.client.TestMisc
Tests run: 2, Failures: 1, Errors: 1, Skipped: 0, Time elapsed: 0.003 sec <<< FAILURE!

Results :

Failed tests: 
  uk.org.taverna.server.client.TestServer
  uk.org.taverna.server.client.TestRun
  uk.org.taverna.server.client.TestServer
  uk.org.taverna.server.client.TestRun
  uk.org.taverna.server.client.TestRunPermissions
  uk.org.taverna.server.client.TestSecureWorkflows
  uk.org.taverna.server.client.TestMisc
  uk.org.taverna.server.client.TestSecureWorkflows
  uk.org.taverna.server.client.TestRunPermissions
  uk.org.taverna.server.client.TestMisc

Tests in error: 
  uk.org.taverna.server.client.TestServer
  uk.org.taverna.server.client.TestRun
  uk.org.taverna.server.client.TestServer
  uk.org.taverna.server.client.TestRun
  uk.org.taverna.server.client.TestRunPermissions
  uk.org.taverna.server.client.TestSecureWorkflows
  uk.org.taverna.server.client.TestMisc
  uk.org.taverna.server.client.TestSecureWorkflows
  uk.org.taverna.server.client.TestRunPermissions
  uk.org.taverna.server.client.TestMisc

Tests run: 28, Failures: 10, Errors: 10, Skipped: 0

[ERROR] There are test failures.

Please refer to /local/jenkins/jobs/t2-server-jar/workspace/target/surefire-reports for the individual test results.
[JENKINS] Recording test results
[INFO] [jar:jar {execution: default-jar}]
[INFO] Building jar: /local/jenkins/jobs/t2-server-jar/workspace/target/taverna-server-client-0.9.0.jar
[INFO] Preparing source:jar
[WARNING] Removing: jar from forked lifecycle, to prevent recursive invocation.
[INFO] [jaxb2:xjc {execution: rest-xjc}]
[INFO] No changes detected in schema or binding files - skipping source generation.
[INFO] [jaxb2:xjc {execution: port-xjc}]
[INFO] No changes detected in schema or binding files - skipping source generation.
ERROR: Could not find local repository for 2.2.1
[INFO] [source:jar {execution: default}]
[INFO] uk already added, skipping
[INFO] uk/org already added, skipping
[INFO] uk/org/taverna already added, skipping
[INFO] uk/org/taverna/server already added, skipping
[INFO] uk/org/taverna/server/client already added, skipping
[INFO] uk/org/taverna/server/client/xml already added, skipping
[INFO] Building jar: /local/jenkins/jobs/t2-server-jar/workspace/target/taverna-server-client-0.9.0-sources.jar
[INFO] uk already added, skipping
[INFO] uk/org already added, skipping
[INFO] uk/org/taverna already added, skipping
[INFO] uk/org/taverna/server already added, skipping
[INFO] uk/org/taverna/server/client already added, skipping
[INFO] uk/org/taverna/server/client/xml already added, skipping
[INFO] Preparing source:test-jar
[WARNING] Removing: jar from forked lifecycle, to prevent recursive invocation.
[WARNING] Removing: test-jar from forked lifecycle, to prevent recursive invocation.
[INFO] [jaxb2:xjc {execution: rest-xjc}]
[INFO] No changes detected in schema or binding files - skipping source generation.
[INFO] [jaxb2:xjc {execution: port-xjc}]
[INFO] No changes detected in schema or binding files - skipping source generation.
ERROR: Could not find local repository for 2.2.1
[INFO] [source:test-jar {execution: default}]
[INFO] Building jar: /local/jenkins/jobs/t2-server-jar/workspace/target/taverna-server-client-0.9.0-test-sources.jar
[INFO] [jar:test-jar {execution: default}]
[INFO] Building jar: /local/jenkins/jobs/t2-server-jar/workspace/target/taverna-server-client-0.9.0-tests.jar
[INFO] [install:install {execution: default-install}]
[INFO] Installing /local/jenkins/jobs/t2-server-jar/workspace/target/taverna-server-client-0.9.0.jar to /local/jenkins/jobs/t2-server-jar/workspace/.repository/uk/org/taverna/taverna-server-client/0.9.0/taverna-server-client-0.9.0.jar
[INFO] Installing /local/jenkins/jobs/t2-server-jar/workspace/target/taverna-server-client-0.9.0-sources.jar to /local/jenkins/jobs/t2-server-jar/workspace/.repository/uk/org/taverna/taverna-server-client/0.9.0/taverna-server-client-0.9.0-sources.jar
[INFO] Installing /local/jenkins/jobs/t2-server-jar/workspace/target/taverna-server-client-0.9.0-test-sources.jar to /local/jenkins/jobs/t2-server-jar/workspace/.repository/uk/org/taverna/taverna-server-client/0.9.0/taverna-server-client-0.9.0-test-sources.jar
[INFO] Installing /local/jenkins/jobs/t2-server-jar/workspace/target/taverna-server-client-0.9.0-tests.jar to /local/jenkins/jobs/t2-server-jar/workspace/.repository/uk/org/taverna/taverna-server-client/0.9.0/taverna-server-client-0.9.0-tests.jar
[INFO] ------------------------------------------------------------------------
[INFO] BUILD SUCCESSFUL
[INFO] ------------------------------------------------------------------------
[INFO] Total time: 24 seconds
[INFO] Finished at: Fri Oct 04 10:43:05 BST 2013
[INFO] Final Memory: 41M/99M
[INFO] ------------------------------------------------------------------------