FailedConsole Output

Started by user Alan Williams (awilliams)
Building in workspace /local/jenkins/jobs/Components/workspace
Updating https://taverna.googlecode.com/svn/unsorted/component/trunk
U         component/component-activity-ui/pom.xml
U         component/component-registry/src/test/java/net/sf/taverna/t2/component/registry/ComponentFamilyTest.java
U         component/component-registry/src/main/java/net/sf/taverna/t2/component/profile/SemanticAnnotationProfile.java
U         component/component-registry/src/main/java/net/sf/taverna/t2/component/registry/ComponentUtil.java
U         component/component-registry/src/main/java/net/sf/taverna/t2/component/registry/myexperiment/MyExperimentComponentVersion.java
U         component/component-registry/src/main/java/net/sf/taverna/t2/component/registry/myexperiment/MyExperimentComponentRegistry.java
U         component/component-registry/src/main/java/net/sf/taverna/t2/component/registry/myexperiment/MyExperimentComponentFamily.java
A         component/component-registry/src/main/java/net/sf/taverna/t2/component/registry/myexperiment/client
A         component/component-registry/src/main/java/net/sf/taverna/t2/component/registry/myexperiment/client/File.java
A         component/component-registry/src/main/java/net/sf/taverna/t2/component/registry/myexperiment/client/Comment.java
A         component/component-registry/src/main/java/net/sf/taverna/t2/component/registry/myexperiment/client/License.java
A         component/component-registry/src/main/java/net/sf/taverna/t2/component/registry/myexperiment/client/TagCloud.java
A         component/component-registry/src/main/java/net/sf/taverna/t2/component/registry/myexperiment/client/Base64.java
A         component/component-registry/src/main/java/net/sf/taverna/t2/component/registry/myexperiment/client/ServerResponse.java
A         component/component-registry/src/main/java/net/sf/taverna/t2/component/registry/myexperiment/client/MyExperimentClient.java
A         component/component-registry/src/main/java/net/sf/taverna/t2/component/registry/myexperiment/client/Resource.java
A         component/component-registry/src/main/java/net/sf/taverna/t2/component/registry/myexperiment/client/Workflow.java
A         component/component-registry/src/main/java/net/sf/taverna/t2/component/registry/myexperiment/client/Tag.java
A         component/component-registry/src/main/java/net/sf/taverna/t2/component/registry/myexperiment/client/Group.java
A         component/component-registry/src/main/java/net/sf/taverna/t2/component/registry/myexperiment/client/PackItem.java
A         component/component-registry/src/main/java/net/sf/taverna/t2/component/registry/myexperiment/client/Util.java
A         component/component-registry/src/main/java/net/sf/taverna/t2/component/registry/myexperiment/client/User.java
A         component/component-registry/src/main/java/net/sf/taverna/t2/component/registry/myexperiment/client/Pack.java
U         component/component-registry/src/main/java/net/sf/taverna/t2/component/registry/ComponentDataflowCache.java
A         component/component-registry/src/main/resources/META-INF
A         component/component-registry/src/main/resources/META-INF/services
A         component/component-registry/src/main/resources/META-INF/services/net.sf.taverna.t2.workbench.file.FileManager
U         component/component-registry/pom.xml
U         component/component-annotation/src/main/java/net/sf/taverna/t2/component/annotation/SemanticAnnotationUtils.java
U         component/component-annotation/src/main/java/net/sf/taverna/t2/component/annotation/AbstractSemanticAnnotationContextualView.java
U         component/component-annotation/src/main/java/net/sf/taverna/t2/component/annotation/AnnotationPropertyPanelFactory.java
U         component/component-annotation/src/main/java/net/sf/taverna/t2/component/annotation/PropertyPanelFactorySPI.java
U         component/component-annotation/src/main/java/net/sf/taverna/t2/component/annotation/DatatypePropertyPanelFactory.java
U         component/component-annotation/src/main/java/net/sf/taverna/t2/component/annotation/ObjectPropertyWithIndividualsPanelFactory.java
U         component/component-annotation/src/main/java/net/sf/taverna/t2/component/annotation/FallbackPropertyPanelFactory.java
U         component/component-annotation/src/main/java/net/sf/taverna/t2/component/annotation/SemanticAnnotationPanel.java
U         component/component-annotation/pom.xml
U         component/pom.xml
U         component/component-activity/pom.xml
U         component/component-plugin/pom.xml
At revision 15727
Parsing POMs
Modules changed, recalculating dependency graph
[component] $ /usr/java/default//bin/java -Xmx1024m -XX:MaxPermSize=1024m -cp /local/jenkins/plugins/maven-plugin/WEB-INF/lib/maven-agent-1.2.jar:/usr/local/share/maven/boot/classworlds-1.1.jar hudson.maven.agent.Main /usr/local/share/maven/ /var/cache/jenkins/war/WEB-INF/lib/remoting-2.17.jar /local/jenkins/plugins/maven-plugin/WEB-INF/lib/maven-interceptor-1.2.jar 60021 /local/jenkins/plugins/maven-plugin/WEB-INF/lib/maven2.1-interceptor-1.2.jar
<===[JENKINS REMOTING CAPACITY]===>channel started
log4j:WARN No appenders could be found for logger (org.apache.commons.beanutils.converters.BooleanConverter).
log4j:WARN Please initialize the log4j system properly.
Executing Maven:  -B -f /local/jenkins/jobs/Components/workspace/component/pom.xml -Dmaven.repo.local=/local/jenkins/jobs/Components/workspace/.repository clean install
[INFO] Scanning for projects...
[INFO] Reactor build order: 
[INFO]   Component Taverna project
[INFO]   Component Registry
[INFO]   Component Taverna activity
[INFO]   Component Annotation
[INFO]   Component Taverna activity UI bindings
[INFO]   Component Taverna plugin
[INFO] ------------------------------------------------------------------------
[INFO] Building Component Taverna project
[INFO]    task-segment: [clean, install]
[INFO] ------------------------------------------------------------------------
[INFO] [clean:clean {execution: default-clean}]
[INFO] Deleting directory /local/jenkins/jobs/Components/workspace/component/target
[INFO] [site:attach-descriptor {execution: default-attach-descriptor}]
[INFO] Preparing source:jar
[WARNING] Removing: jar from forked lifecycle, to prevent recursive invocation.
[INFO] No goals needed for project - skipping
[INFO] [source:jar {execution: default}]
[INFO] Preparing source:test-jar
[WARNING] Removing: jar from forked lifecycle, to prevent recursive invocation.
[WARNING] Removing: test-jar from forked lifecycle, to prevent recursive invocation.
[INFO] No goals needed for project - skipping
[INFO] [source:test-jar {execution: default}]
[INFO] [jar:test-jar {execution: default}]
[WARNING] JAR will be empty - no content was marked for inclusion!
[INFO] Building jar: /local/jenkins/jobs/Components/workspace/component/target/component-1.0.2-tests.jar
[INFO] [install:install {execution: default-install}]
[INFO] Installing /local/jenkins/jobs/Components/workspace/component/pom.xml to /local/jenkins/jobs/Components/workspace/.repository/net/sf/taverna/t2/component/component/1.0.2/component-1.0.2.pom
[INFO] Installing /local/jenkins/jobs/Components/workspace/component/target/component-1.0.2-tests.jar to /local/jenkins/jobs/Components/workspace/.repository/net/sf/taverna/t2/component/component/1.0.2/component-1.0.2-tests.jar
[JENKINS] Archiving /local/jenkins/jobs/Components/workspace/component/pom.xml to /local/jenkins/jobs/Components/modules/net.sf.taverna.t2.component$component/builds/2013-04-30_11-48-04/archive/net.sf.taverna.t2.component/component/1.0.2/component-1.0.2.pom
[JENKINS] Archiving /local/jenkins/jobs/Components/workspace/component/target/component-1.0.2-tests.jar to /local/jenkins/jobs/Components/modules/net.sf.taverna.t2.component$component/builds/2013-04-30_11-48-04/archive/net.sf.taverna.t2.component/component/1.0.2/component-1.0.2-tests.jar
[INFO] ------------------------------------------------------------------------
[INFO] Building Component Registry
[INFO]    task-segment: [clean, install]
[INFO] ------------------------------------------------------------------------
[INFO] [clean:clean {execution: default-clean}]
[INFO] Deleting directory /local/jenkins/jobs/Components/workspace/component/component-registry/target
[INFO] [jaxb2:generate {execution: default}]
[INFO] [resources:resources {execution: default-resources}]
[WARNING] Using platform encoding (UTF-8 actually) to copy filtered resources, i.e. build is platform dependent!
[INFO] Copying 4 resources
[INFO] Copying 1 resource
[INFO] [compiler:compile {execution: default-compile}]
[WARNING] File encoding has not been set, using platform encoding UTF-8, i.e. build is platform dependent!
[INFO] Compiling 129 source files to /local/jenkins/jobs/Components/workspace/component/component-registry/target/classes
[INFO] [resources:testResources {execution: default-testResources}]
[WARNING] Using platform encoding (UTF-8 actually) to copy filtered resources, i.e. build is platform dependent!
[INFO] Copying 3 resources
[INFO] [compiler:testCompile {execution: default-testCompile}]
[WARNING] File encoding has not been set, using platform encoding UTF-8, i.e. build is platform dependent!
[INFO] Compiling 13 source files to /local/jenkins/jobs/Components/workspace/component/component-registry/target/test-classes
[WARNING] DEPRECATED [systemProperties]: Use systemPropertyVariables instead.
[INFO] [surefire:test {execution: default-test}]
[INFO] Surefire report directory: /local/jenkins/jobs/Components/workspace/component/component-registry/target/surefire-reports

-------------------------------------------------------
 T E S T S
-------------------------------------------------------
Running net.sf.taverna.t2.component.registry.local.LocalComponentFamilyTest
log4j:WARN No appenders could be found for logger (net.sf.taverna.raven.log.Log).
log4j:WARN Please initialize the log4j system properly.
log4j:WARN See http://logging.apache.org/log4j/1.2/faq.html#noconfig for more info.
ApplicationConfig could not determine application name, using unknownApplication-3ad00e3c-d5b8-411a-ba19-ad9c65896113
ApplicationConfig could not determine application name, using unknownApplication-3ad00e3c-d5b8-411a-ba19-ad9c65896113
ApplicationConfig could not determine application name, using unknownApplication-3ad00e3c-d5b8-411a-ba19-ad9c65896113
ApplicationConfig could not determine application name, using unknownApplication-3ad00e3c-d5b8-411a-ba19-ad9c65896113
Tests run: 6, Failures: 0, Errors: 0, Skipped: 0, Time elapsed: 70.104 sec
Running net.sf.taverna.t2.component.registry.local.LocalComponentTest
ApplicationConfig could not determine application name, using unknownApplication-3ad00e3c-d5b8-411a-ba19-ad9c65896113
ApplicationConfig could not determine application name, using unknownApplication-3ad00e3c-d5b8-411a-ba19-ad9c65896113
ApplicationConfig could not determine application name, using unknownApplication-3ad00e3c-d5b8-411a-ba19-ad9c65896113
ApplicationConfig could not determine application name, using unknownApplication-3ad00e3c-d5b8-411a-ba19-ad9c65896113
ApplicationConfig could not determine application name, using unknownApplication-3ad00e3c-d5b8-411a-ba19-ad9c65896113
ApplicationConfig could not determine application name, using unknownApplication-3ad00e3c-d5b8-411a-ba19-ad9c65896113
Tests run: 5, Failures: 0, Errors: 0, Skipped: 0, Time elapsed: 36.478 sec
Running net.sf.taverna.t2.component.registry.local.LocalComponentVersionTest
ApplicationConfig could not determine application name, using unknownApplication-3ad00e3c-d5b8-411a-ba19-ad9c65896113
ApplicationConfig could not determine application name, using unknownApplication-3ad00e3c-d5b8-411a-ba19-ad9c65896113
ApplicationConfig could not determine application name, using unknownApplication-3ad00e3c-d5b8-411a-ba19-ad9c65896113
ApplicationConfig could not determine application name, using unknownApplication-3ad00e3c-d5b8-411a-ba19-ad9c65896113
Tests run: 4, Failures: 0, Errors: 0, Skipped: 0, Time elapsed: 28.641 sec
Running net.sf.taverna.t2.component.registry.local.LocalComponentRegistryTest
Tests run: 12, Failures: 0, Errors: 0, Skipped: 0, Time elapsed: 17.995 sec
Running net.sf.taverna.t2.component.registry.ComponentFamilyTest
Tests run: 1, Failures: 0, Errors: 0, Skipped: 1, Time elapsed: 0.001 sec
Running net.sf.taverna.t2.component.registry.myexperiment.MyExperimentComponentVersionTest
Tests run: 1, Failures: 0, Errors: 0, Skipped: 1, Time elapsed: 0.063 sec
Running net.sf.taverna.t2.component.registry.myexperiment.MyExperimentComponentRegistryTest
Tests run: 1, Failures: 0, Errors: 0, Skipped: 1, Time elapsed: 0.001 sec
Running net.sf.taverna.t2.component.registry.myexperiment.MyExperimentComponentTest
Tests run: 1, Failures: 0, Errors: 0, Skipped: 1, Time elapsed: 0 sec
Running net.sf.taverna.t2.component.registry.myexperiment.MyExperimentComponentFamilyTest
Tests run: 1, Failures: 0, Errors: 0, Skipped: 1, Time elapsed: 0.012 sec
Running net.sf.taverna.t2.component.registry.ComponentTest
Tests run: 1, Failures: 0, Errors: 0, Skipped: 1, Time elapsed: 0.001 sec
Running net.sf.taverna.t2.component.registry.ComponentVersionTest
Tests run: 1, Failures: 0, Errors: 0, Skipped: 1, Time elapsed: 0 sec

Results :

Tests run: 34, Failures: 0, Errors: 0, Skipped: 7

[JENKINS] Recording test results
[INFO] [jar:jar {execution: default-jar}]
[INFO] Building jar: /local/jenkins/jobs/Components/workspace/component/component-registry/target/component-registry-1.0.2.jar
[INFO] Preparing source:jar
[WARNING] Removing: jar from forked lifecycle, to prevent recursive invocation.
[JENKINS] Archiving /local/jenkins/jobs/Components/workspace/component/component-registry/pom.xml to /local/jenkins/jobs/Components/modules/net.sf.taverna.t2.component$component-registry/builds/2013-04-30_11-48-05/archive/net.sf.taverna.t2.component/component-registry/1.0.2/component-registry-1.0.2.pom
[JENKINS] Archiving /local/jenkins/jobs/Components/workspace/component/component-registry/target/component-registry-1.0.2.jar to /local/jenkins/jobs/Components/modules/net.sf.taverna.t2.component$component-registry/builds/2013-04-30_11-48-05/archive/net.sf.taverna.t2.component/component-registry/1.0.2/component-registry-1.0.2.jar
[INFO] [jaxb2:generate {execution: default}]
[INFO] Skipped XJC execution. Generated sources were up-to-date.
[INFO] [source:jar {execution: default}]
[INFO] META-INF already added, skipping
[INFO] META-INF/sun-jaxb.episode already added, skipping
[INFO] META-INF/sun-jaxb.episode already added, skipping
[INFO] Building jar: /local/jenkins/jobs/Components/workspace/component/component-registry/target/component-registry-1.0.2-sources.jar
[INFO] META-INF already added, skipping
[INFO] META-INF/sun-jaxb.episode already added, skipping
[INFO] META-INF/sun-jaxb.episode already added, skipping
[INFO] Preparing source:test-jar
[WARNING] Removing: jar from forked lifecycle, to prevent recursive invocation.
[WARNING] Removing: test-jar from forked lifecycle, to prevent recursive invocation.
[JENKINS] Archiving /local/jenkins/jobs/Components/workspace/component/component-registry/target/component-registry-1.0.2-sources.jar to /local/jenkins/jobs/Components/modules/net.sf.taverna.t2.component$component-registry/builds/2013-04-30_11-48-05/archive/net.sf.taverna.t2.component/component-registry/1.0.2/component-registry-1.0.2-sources.jar
[INFO] [jaxb2:generate {execution: default}]
[INFO] Skipped XJC execution. Generated sources were up-to-date.
[INFO] [source:test-jar {execution: default}]
[INFO] Building jar: /local/jenkins/jobs/Components/workspace/component/component-registry/target/component-registry-1.0.2-test-sources.jar
[INFO] [jar:test-jar {execution: default}]
[INFO] Building jar: /local/jenkins/jobs/Components/workspace/component/component-registry/target/component-registry-1.0.2-tests.jar
[INFO] [install:install {execution: default-install}]
[INFO] Installing /local/jenkins/jobs/Components/workspace/component/component-registry/target/component-registry-1.0.2.jar to /local/jenkins/jobs/Components/workspace/.repository/net/sf/taverna/t2/component/component-registry/1.0.2/component-registry-1.0.2.jar
[INFO] Installing /local/jenkins/jobs/Components/workspace/component/component-registry/target/component-registry-1.0.2-sources.jar to /local/jenkins/jobs/Components/workspace/.repository/net/sf/taverna/t2/component/component-registry/1.0.2/component-registry-1.0.2-sources.jar
[INFO] Installing /local/jenkins/jobs/Components/workspace/component/component-registry/target/component-registry-1.0.2-test-sources.jar to /local/jenkins/jobs/Components/workspace/.repository/net/sf/taverna/t2/component/component-registry/1.0.2/component-registry-1.0.2-test-sources.jar
[INFO] Installing /local/jenkins/jobs/Components/workspace/component/component-registry/target/component-registry-1.0.2-tests.jar to /local/jenkins/jobs/Components/workspace/.repository/net/sf/taverna/t2/component/component-registry/1.0.2/component-registry-1.0.2-tests.jar
[JENKINS] Archiving /local/jenkins/jobs/Components/workspace/component/component-registry/target/component-registry-1.0.2-test-sources.jar to /local/jenkins/jobs/Components/modules/net.sf.taverna.t2.component$component-registry/builds/2013-04-30_11-48-05/archive/net.sf.taverna.t2.component/component-registry/1.0.2/component-registry-1.0.2-test-sources.jar
[JENKINS] Archiving /local/jenkins/jobs/Components/workspace/component/component-registry/target/component-registry-1.0.2-tests.jar to /local/jenkins/jobs/Components/modules/net.sf.taverna.t2.component$component-registry/builds/2013-04-30_11-48-05/archive/net.sf.taverna.t2.component/component-registry/1.0.2/component-registry-1.0.2-tests.jar
[INFO] ------------------------------------------------------------------------
[INFO] Building Component Taverna activity
[INFO]    task-segment: [clean, install]
[INFO] ------------------------------------------------------------------------
[INFO] [clean:clean {execution: default-clean}]
[INFO] Deleting directory /local/jenkins/jobs/Components/workspace/component/component-activity/target
[INFO] [resources:resources {execution: default-resources}]
[WARNING] Using platform encoding (UTF-8 actually) to copy filtered resources, i.e. build is platform dependent!
[INFO] Copying 1 resource
[INFO] [compiler:compile {execution: default-compile}]
[WARNING] File encoding has not been set, using platform encoding UTF-8, i.e. build is platform dependent!
[INFO] Compiling 11 source files to /local/jenkins/jobs/Components/workspace/component/component-activity/target/classes
[INFO] [resources:testResources {execution: default-testResources}]
[WARNING] Using platform encoding (UTF-8 actually) to copy filtered resources, i.e. build is platform dependent!
[INFO] skip non existing resourceDirectory /local/jenkins/jobs/Components/workspace/component/component-activity/src/test/resources
[INFO] [compiler:testCompile {execution: default-testCompile}]
[WARNING] File encoding has not been set, using platform encoding UTF-8, i.e. build is platform dependent!
[INFO] Compiling 1 source file to /local/jenkins/jobs/Components/workspace/component/component-activity/target/test-classes
[WARNING] DEPRECATED [systemProperties]: Use systemPropertyVariables instead.
[INFO] [surefire:test {execution: default-test}]
[INFO] Surefire report directory: /local/jenkins/jobs/Components/workspace/component/component-activity/target/surefire-reports

-------------------------------------------------------
 T E S T S
-------------------------------------------------------
There are no tests to run.

Results :

Tests run: 0, Failures: 0, Errors: 0, Skipped: 0

[JENKINS] Recording test results
[INFO] [jar:jar {execution: default-jar}]
[INFO] Building jar: /local/jenkins/jobs/Components/workspace/component/component-activity/target/component-activity-1.0.2.jar
[INFO] Preparing source:jar
[WARNING] Removing: jar from forked lifecycle, to prevent recursive invocation.
[INFO] No goals needed for project - skipping
[INFO] [source:jar {execution: default}]
[INFO] Building jar: /local/jenkins/jobs/Components/workspace/component/component-activity/target/component-activity-1.0.2-sources.jar
[INFO] Preparing source:test-jar
[WARNING] Removing: jar from forked lifecycle, to prevent recursive invocation.
[WARNING] Removing: test-jar from forked lifecycle, to prevent recursive invocation.
[INFO] No goals needed for project - skipping
[INFO] [source:test-jar {execution: default}]
[INFO] Building jar: /local/jenkins/jobs/Components/workspace/component/component-activity/target/component-activity-1.0.2-test-sources.jar
[INFO] [jar:test-jar {execution: default}]
[INFO] Building jar: /local/jenkins/jobs/Components/workspace/component/component-activity/target/component-activity-1.0.2-tests.jar
[INFO] [install:install {execution: default-install}]
[INFO] Installing /local/jenkins/jobs/Components/workspace/component/component-activity/target/component-activity-1.0.2.jar to /local/jenkins/jobs/Components/workspace/.repository/net/sf/taverna/t2/component/component-activity/1.0.2/component-activity-1.0.2.jar
[INFO] Installing /local/jenkins/jobs/Components/workspace/component/component-activity/target/component-activity-1.0.2-sources.jar to /local/jenkins/jobs/Components/workspace/.repository/net/sf/taverna/t2/component/component-activity/1.0.2/component-activity-1.0.2-sources.jar
[INFO] Installing /local/jenkins/jobs/Components/workspace/component/component-activity/target/component-activity-1.0.2-test-sources.jar to /local/jenkins/jobs/Components/workspace/.repository/net/sf/taverna/t2/component/component-activity/1.0.2/component-activity-1.0.2-test-sources.jar
[INFO] Installing /local/jenkins/jobs/Components/workspace/component/component-activity/target/component-activity-1.0.2-tests.jar to /local/jenkins/jobs/Components/workspace/.repository/net/sf/taverna/t2/component/component-activity/1.0.2/component-activity-1.0.2-tests.jar
[JENKINS] Archiving /local/jenkins/jobs/Components/workspace/component/component-activity/pom.xml to /local/jenkins/jobs/Components/modules/net.sf.taverna.t2.component$component-activity/builds/2013-04-30_11-48-05/archive/net.sf.taverna.t2.component/component-activity/1.0.2/component-activity-1.0.2.pom
[JENKINS] Archiving /local/jenkins/jobs/Components/workspace/component/component-activity/target/component-activity-1.0.2.jar to /local/jenkins/jobs/Components/modules/net.sf.taverna.t2.component$component-activity/builds/2013-04-30_11-48-05/archive/net.sf.taverna.t2.component/component-activity/1.0.2/component-activity-1.0.2.jar
[JENKINS] Archiving /local/jenkins/jobs/Components/workspace/component/component-activity/target/component-activity-1.0.2-sources.jar to /local/jenkins/jobs/Components/modules/net.sf.taverna.t2.component$component-activity/builds/2013-04-30_11-48-05/archive/net.sf.taverna.t2.component/component-activity/1.0.2/component-activity-1.0.2-sources.jar
[JENKINS] Archiving /local/jenkins/jobs/Components/workspace/component/component-activity/target/component-activity-1.0.2-test-sources.jar to /local/jenkins/jobs/Components/modules/net.sf.taverna.t2.component$component-activity/builds/2013-04-30_11-48-05/archive/net.sf.taverna.t2.component/component-activity/1.0.2/component-activity-1.0.2-test-sources.jar
[JENKINS] Archiving /local/jenkins/jobs/Components/workspace/component/component-activity/target/component-activity-1.0.2-tests.jar to /local/jenkins/jobs/Components/modules/net.sf.taverna.t2.component$component-activity/builds/2013-04-30_11-48-05/archive/net.sf.taverna.t2.component/component-activity/1.0.2/component-activity-1.0.2-tests.jar
[INFO] ------------------------------------------------------------------------
[INFO] Building Component Annotation
[INFO]    task-segment: [clean, install]
[INFO] ------------------------------------------------------------------------
[INFO] [clean:clean {execution: default-clean}]
[INFO] Deleting directory /local/jenkins/jobs/Components/workspace/component/component-annotation/target
[INFO] [resources:resources {execution: default-resources}]
[WARNING] Using platform encoding (UTF-8 actually) to copy filtered resources, i.e. build is platform dependent!
[INFO] Copying 3 resources
[INFO] [compiler:compile {execution: default-compile}]
[WARNING] File encoding has not been set, using platform encoding UTF-8, i.e. build is platform dependent!
[INFO] Compiling 14 source files to /local/jenkins/jobs/Components/workspace/component/component-annotation/target/classes
[INFO] -------------------------------------------------------------
[ERROR] COMPILATION ERROR : 
[INFO] -------------------------------------------------------------
[ERROR] /local/jenkins/jobs/Components/workspace/component/component-annotation/src/main/java/net/sf/taverna/t2/component/annotation/AbstractSemanticAnnotationContextualView.java:[150,17] cannot find symbol
symbol  : class UnrecognizedStatementPanel
location: class net.sf.taverna.t2.component.annotation.AbstractSemanticAnnotationContextualView
[INFO] 1 error
[INFO] -------------------------------------------------------------
[JENKINS] Archiving /local/jenkins/jobs/Components/workspace/component/component-annotation/pom.xml to /local/jenkins/jobs/Components/modules/net.sf.taverna.t2.component$component-annotation/builds/2013-04-30_11-48-05/archive/net.sf.taverna.t2.component/component-annotation/1.0.2/component-annotation-1.0.2.pom
[INFO] ------------------------------------------------------------------------
[ERROR] BUILD FAILURE
[INFO] ------------------------------------------------------------------------
[INFO] Compilation failure
/local/jenkins/jobs/Components/workspace/component/component-annotation/src/main/java/net/sf/taverna/t2/component/annotation/AbstractSemanticAnnotationContextualView.java:[150,17] cannot find symbol
symbol  : class UnrecognizedStatementPanel
location: class net.sf.taverna.t2.component.annotation.AbstractSemanticAnnotationContextualView

[INFO] ------------------------------------------------------------------------
[INFO] For more information, run Maven with the -e switch
[INFO] ------------------------------------------------------------------------
[INFO] Total time: 15 minutes 57 seconds
[INFO] Finished at: Tue Apr 30 12:04:55 BST 2013
[INFO] Final Memory: 85M/204M
[INFO] ------------------------------------------------------------------------
channel stopped
Finished: FAILURE