FailedConsole Output

Skipping 253 KB.. Full Log
k/maven/repository/junit/junit/4.8.2/junit-4.8.2.jar
[INFO] Unable to find resource 'junit:junit:jar:4.8.2' in repository mygrid-repository (http://www.mygrid.org.uk/maven/repository)
Downloading: http://54.228.194.171:8081/nexus/content/repositories/snapshots//junit/junit/4.8.2/junit-4.8.2.jar
[WARNING] Unable to get resource 'junit:junit:jar:4.8.2' from repository vph-repository (http://54.228.194.171:8081/nexus/content/repositories/snapshots/): Error transferring file: Connection refused
Downloading: http://uk.maven.org/maven2/junit/junit/4.8.2/junit-4.8.2.jar
231K downloaded  (junit-4.8.2.jar)
Downloading: http://www.mygrid.org.uk/maven/repository/org/apache/maven/maven-project/2.0.6/maven-project-2.0.6.pom
[INFO] Unable to find resource 'org.apache.maven:maven-project:pom:2.0.6' in repository mygrid-repository (http://www.mygrid.org.uk/maven/repository)
Downloading: http://uk.maven.org/maven2/org/apache/maven/maven-project/2.0.6/maven-project-2.0.6.pom
2K downloaded  (maven-project-2.0.6.pom)
Downloading: http://www.mygrid.org.uk/maven/repository/org/apache/maven/maven-settings/2.0.6/maven-settings-2.0.6.pom
[INFO] Unable to find resource 'org.apache.maven:maven-settings:pom:2.0.6' in repository mygrid-repository (http://www.mygrid.org.uk/maven/repository)
Downloading: http://www.mygrid.org.uk/maven/repository/org/apache/maven/maven-settings/2.0.6/maven-settings-2.0.6.pom
[INFO] Unable to find resource 'org.apache.maven:maven-settings:pom:2.0.6' in repository mygrid-repository (http://www.mygrid.org.uk/maven/repository)
Downloading: http://54.228.194.171:8081/nexus/content/repositories/snapshots//org/apache/maven/maven-settings/2.0.6/maven-settings-2.0.6.pom
[WARNING] Unable to get resource 'org.apache.maven:maven-settings:pom:2.0.6' from repository vph-repository (http://54.228.194.171:8081/nexus/content/repositories/snapshots/): Error transferring file: Connection refused
Downloading: http://uk.maven.org/maven2/org/apache/maven/maven-settings/2.0.6/maven-settings-2.0.6.pom
1K downloaded  (maven-settings-2.0.6.pom)
Downloading: http://www.mygrid.org.uk/maven/repository/org/apache/maven/maven-profile/2.0.6/maven-profile-2.0.6.pom
[INFO] Unable to find resource 'org.apache.maven:maven-profile:pom:2.0.6' in repository mygrid-repository (http://www.mygrid.org.uk/maven/repository)
Downloading: http://www.mygrid.org.uk/maven/repository/org/apache/maven/maven-profile/2.0.6/maven-profile-2.0.6.pom
[INFO] Unable to find resource 'org.apache.maven:maven-profile:pom:2.0.6' in repository mygrid-repository (http://www.mygrid.org.uk/maven/repository)
Downloading: http://54.228.194.171:8081/nexus/content/repositories/snapshots//org/apache/maven/maven-profile/2.0.6/maven-profile-2.0.6.pom
[WARNING] Unable to get resource 'org.apache.maven:maven-profile:pom:2.0.6' from repository vph-repository (http://54.228.194.171:8081/nexus/content/repositories/snapshots/): Error transferring file: Connection refused
Downloading: http://uk.maven.org/maven2/org/apache/maven/maven-profile/2.0.6/maven-profile-2.0.6.pom
1K downloaded  (maven-profile-2.0.6.pom)
Downloading: http://www.mygrid.org.uk/maven/repository/org/apache/maven/maven-artifact-manager/2.0.6/maven-artifact-manager-2.0.6.pom
[INFO] Unable to find resource 'org.apache.maven:maven-artifact-manager:pom:2.0.6' in repository mygrid-repository (http://www.mygrid.org.uk/maven/repository)
Downloading: http://www.mygrid.org.uk/maven/repository/org/apache/maven/maven-artifact-manager/2.0.6/maven-artifact-manager-2.0.6.pom
[INFO] Unable to find resource 'org.apache.maven:maven-artifact-manager:pom:2.0.6' in repository mygrid-repository (http://www.mygrid.org.uk/maven/repository)
Downloading: http://54.228.194.171:8081/nexus/content/repositories/snapshots//org/apache/maven/maven-artifact-manager/2.0.6/maven-artifact-manager-2.0.6.pom
[WARNING] Unable to get resource 'org.apache.maven:maven-artifact-manager:pom:2.0.6' from repository vph-repository (http://54.228.194.171:8081/nexus/content/repositories/snapshots/): Error transferring file: Connection refused
Downloading: http://uk.maven.org/maven2/org/apache/maven/maven-artifact-manager/2.0.6/maven-artifact-manager-2.0.6.pom
2K downloaded  (maven-artifact-manager-2.0.6.pom)
Downloading: http://www.mygrid.org.uk/maven/repository/org/apache/maven/maven-repository-metadata/2.0.6/maven-repository-metadata-2.0.6.pom
[INFO] Unable to find resource 'org.apache.maven:maven-repository-metadata:pom:2.0.6' in repository mygrid-repository (http://www.mygrid.org.uk/maven/repository)
Downloading: http://www.mygrid.org.uk/maven/repository/org/apache/maven/maven-repository-metadata/2.0.6/maven-repository-metadata-2.0.6.pom
[INFO] Unable to find resource 'org.apache.maven:maven-repository-metadata:pom:2.0.6' in repository mygrid-repository (http://www.mygrid.org.uk/maven/repository)
Downloading: http://54.228.194.171:8081/nexus/content/repositories/snapshots//org/apache/maven/maven-repository-metadata/2.0.6/maven-repository-metadata-2.0.6.pom
[WARNING] Unable to get resource 'org.apache.maven:maven-repository-metadata:pom:2.0.6' from repository vph-repository (http://54.228.194.171:8081/nexus/content/repositories/snapshots/): Error transferring file: Connection refused
Downloading: http://uk.maven.org/maven2/org/apache/maven/maven-repository-metadata/2.0.6/maven-repository-metadata-2.0.6.pom
1K downloaded  (maven-repository-metadata-2.0.6.pom)
Downloading: http://www.mygrid.org.uk/maven/repository/org/apache/maven/maven-plugin-registry/2.0.6/maven-plugin-registry-2.0.6.pom
[INFO] Unable to find resource 'org.apache.maven:maven-plugin-registry:pom:2.0.6' in repository mygrid-repository (http://www.mygrid.org.uk/maven/repository)
Downloading: http://www.mygrid.org.uk/maven/repository/org/apache/maven/maven-plugin-registry/2.0.6/maven-plugin-registry-2.0.6.pom
[INFO] Unable to find resource 'org.apache.maven:maven-plugin-registry:pom:2.0.6' in repository mygrid-repository (http://www.mygrid.org.uk/maven/repository)
Downloading: http://54.228.194.171:8081/nexus/content/repositories/snapshots//org/apache/maven/maven-plugin-registry/2.0.6/maven-plugin-registry-2.0.6.pom
[WARNING] Unable to get resource 'org.apache.maven:maven-plugin-registry:pom:2.0.6' from repository vph-repository (http://54.228.194.171:8081/nexus/content/repositories/snapshots/): Error transferring file: Connection refused
Downloading: http://uk.maven.org/maven2/org/apache/maven/maven-plugin-registry/2.0.6/maven-plugin-registry-2.0.6.pom
1K downloaded  (maven-plugin-registry-2.0.6.pom)
[INFO] [jar:test-jar {execution: default}]
[WARNING] JAR will be empty - no content was marked for inclusion!
[INFO] Building jar: /var/lib/jenkins/workspace/components-snapshots/component/target/component-1.1.0-SNAPSHOT-tests.jar
Downloading: http://www.mygrid.org.uk/maven/repository/org/codehaus/plexus/plexus-digest/1.0/plexus-digest-1.0.pom
[INFO] Unable to find resource 'org.codehaus.plexus:plexus-digest:pom:1.0' in repository mygrid-repository (http://www.mygrid.org.uk/maven/repository)
Downloading: http://uk.maven.org/maven2/org/codehaus/plexus/plexus-digest/1.0/plexus-digest-1.0.pom
1K downloaded  (plexus-digest-1.0.pom)
Downloading: http://www.mygrid.org.uk/maven/repository/org/codehaus/plexus/plexus-components/1.1.7/plexus-components-1.1.7.pom
[INFO] Unable to find resource 'org.codehaus.plexus:plexus-components:pom:1.1.7' in repository mygrid-repository (http://www.mygrid.org.uk/maven/repository)
Downloading: http://uk.maven.org/maven2/org/codehaus/plexus/plexus-components/1.1.7/plexus-components-1.1.7.pom
4K downloaded  (plexus-components-1.1.7.pom)
Downloading: http://www.mygrid.org.uk/maven/repository/org/codehaus/plexus/plexus-digest/1.0/plexus-digest-1.0.jar
[INFO] Unable to find resource 'org.codehaus.plexus:plexus-digest:jar:1.0' in repository mygrid-repository (http://www.mygrid.org.uk/maven/repository)
Downloading: http://uk.maven.org/maven2/org/codehaus/plexus/plexus-digest/1.0/plexus-digest-1.0.jar
11K downloaded  (plexus-digest-1.0.jar)
[INFO] [install:install {execution: default-install}]
[INFO] Installing /var/lib/jenkins/workspace/components-snapshots/component/pom.xml to /var/lib/jenkins/workspace/components-snapshots/.repository/net/sf/taverna/t2/component/component/1.1.0-SNAPSHOT/component-1.1.0-SNAPSHOT.pom
[INFO] Installing /var/lib/jenkins/workspace/components-snapshots/component/target/component-1.1.0-SNAPSHOT-tests.jar to /var/lib/jenkins/workspace/components-snapshots/.repository/net/sf/taverna/t2/component/component/1.1.0-SNAPSHOT/component-1.1.0-SNAPSHOT-tests.jar
[INFO] ------------------------------------------------------------------------
[INFO] Building Component Registry
[INFO]    task-segment: [clean, install]
[INFO] ------------------------------------------------------------------------
Downloading: http://www.mygrid.org.uk/maven/repository/org/jvnet/jaxb2/maven2/maven-jaxb2-plugin/0.8.3/maven-jaxb2-plugin-0.8.3.pom
[INFO] Unable to find resource 'org.jvnet.jaxb2.maven2:maven-jaxb2-plugin:pom:0.8.3' in repository mygrid-repository (http://www.mygrid.org.uk/maven/repository)
Downloading: http://uk.maven.org/maven2/org/jvnet/jaxb2/maven2/maven-jaxb2-plugin/0.8.3/maven-jaxb2-plugin-0.8.3.pom
2K downloaded  (maven-jaxb2-plugin-0.8.3.pom)
Downloading: http://www.mygrid.org.uk/maven/repository/org/jvnet/jaxb2/maven2/maven-jaxb2-plugin-project/0.8.3/maven-jaxb2-plugin-project-0.8.3.pom
[INFO] Unable to find resource 'org.jvnet.jaxb2.maven2:maven-jaxb2-plugin-project:pom:0.8.3' in repository mygrid-repository (http://www.mygrid.org.uk/maven/repository)
Downloading: http://uk.maven.org/maven2/org/jvnet/jaxb2/maven2/maven-jaxb2-plugin-project/0.8.3/maven-jaxb2-plugin-project-0.8.3.pom
6K downloaded  (maven-jaxb2-plugin-project-0.8.3.pom)
Downloading: http://www.mygrid.org.uk/maven/repository/org/sonatype/oss/oss-parent/7/oss-parent-7.pom
[INFO] Unable to find resource 'org.sonatype.oss:oss-parent:pom:7' in repository mygrid-repository (http://www.mygrid.org.uk/maven/repository)
Downloading: http://uk.maven.org/maven2/org/sonatype/oss/oss-parent/7/oss-parent-7.pom
4K downloaded  (oss-parent-7.pom)
Downloading: http://www.mygrid.org.uk/maven/repository/org/jvnet/jaxb2/maven2/maven-jaxb2-plugin/0.8.3/maven-jaxb2-plugin-0.8.3.jar
[INFO] Unable to find resource 'org.jvnet.jaxb2.maven2:maven-jaxb2-plugin:maven-plugin:0.8.3' in repository mygrid-repository (http://www.mygrid.org.uk/maven/repository)
Downloading: http://uk.maven.org/maven2/org/jvnet/jaxb2/maven2/maven-jaxb2-plugin/0.8.3/maven-jaxb2-plugin-0.8.3.jar
10K downloaded  (maven-jaxb2-plugin-0.8.3.jar)
[INFO] [clean:clean {execution: default-clean}]
Downloading: http://www.mygrid.org.uk/maven/repository/org/apache/maven/plugins/maven-resources-plugin/2.3/maven-resources-plugin-2.3.pom
[INFO] Unable to find resource 'org.apache.maven.plugins:maven-resources-plugin:pom:2.3' in repository mygrid-repository (http://www.mygrid.org.uk/maven/repository)
Downloading: http://uk.maven.org/maven2/org/apache/maven/plugins/maven-resources-plugin/2.3/maven-resources-plugin-2.3.pom
4K downloaded  (maven-resources-plugin-2.3.pom)
Downloading: http://www.mygrid.org.uk/maven/repository/org/apache/maven/plugins/maven-plugins/12/maven-plugins-12.pom
[INFO] Unable to find resource 'org.apache.maven.plugins:maven-plugins:pom:12' in repository mygrid-repository (http://www.mygrid.org.uk/maven/repository)
Downloading: http://uk.maven.org/maven2/org/apache/maven/plugins/maven-plugins/12/maven-plugins-12.pom
11K downloaded  (maven-plugins-12.pom)
Downloading: http://www.mygrid.org.uk/maven/repository/org/apache/maven/maven-parent/9/maven-parent-9.pom
[INFO] Unable to find resource 'org.apache.maven:maven-parent:pom:9' in repository mygrid-repository (http://www.mygrid.org.uk/maven/repository)
Downloading: http://uk.maven.org/maven2/org/apache/maven/maven-parent/9/maven-parent-9.pom
32K downloaded  (maven-parent-9.pom)
Downloading: http://www.mygrid.org.uk/maven/repository/org/apache/maven/plugins/maven-resources-plugin/2.3/maven-resources-plugin-2.3.jar
[INFO] Unable to find resource 'org.apache.maven.plugins:maven-resources-plugin:maven-plugin:2.3' in repository mygrid-repository (http://www.mygrid.org.uk/maven/repository)
Downloading: http://uk.maven.org/maven2/org/apache/maven/plugins/maven-resources-plugin/2.3/maven-resources-plugin-2.3.jar
20K downloaded  (maven-resources-plugin-2.3.jar)
Downloading: http://www.mygrid.org.uk/maven/repository/org/jdom/jdom/1.1/jdom-1.1.pom
[INFO] Unable to find resource 'org.jdom:jdom:pom:1.1' in repository mygrid-repository (http://www.mygrid.org.uk/maven/repository)
Downloading: http://54.228.194.171:8081/nexus/content/repositories/snapshots//org/jdom/jdom/1.1/jdom-1.1.pom
[WARNING] Unable to get resource 'org.jdom:jdom:pom:1.1' from repository vph-repository (http://54.228.194.171:8081/nexus/content/repositories/snapshots/): Error transferring file: Connection refused
Downloading: http://uk.maven.org/maven2/org/jdom/jdom/1.1/jdom-1.1.pom
2K downloaded  (jdom-1.1.pom)
Downloading: http://www.mygrid.org.uk/maven/repository/org/apache/jena/jena-core/2.7.4/jena-core-2.7.4.pom
[INFO] Unable to find resource 'org.apache.jena:jena-core:pom:2.7.4' in repository mygrid-repository (http://www.mygrid.org.uk/maven/repository)
Downloading: http://54.228.194.171:8081/nexus/content/repositories/snapshots//org/apache/jena/jena-core/2.7.4/jena-core-2.7.4.pom
[WARNING] Unable to get resource 'org.apache.jena:jena-core:pom:2.7.4' from repository vph-repository (http://54.228.194.171:8081/nexus/content/repositories/snapshots/): Error transferring file: Connection refused
Downloading: http://uk.maven.org/maven2/org/apache/jena/jena-core/2.7.4/jena-core-2.7.4.pom
7K downloaded  (jena-core-2.7.4.pom)
Downloading: http://www.mygrid.org.uk/maven/repository/org/apache/jena/jena-parent/4/jena-parent-4.pom
[INFO] Unable to find resource 'org.apache.jena:jena-parent:pom:4' in repository mygrid-repository (http://www.mygrid.org.uk/maven/repository)
Downloading: http://54.228.194.171:8081/nexus/content/repositories/snapshots//org/apache/jena/jena-parent/4/jena-parent-4.pom
[WARNING] Unable to get resource 'org.apache.jena:jena-parent:pom:4' from repository vph-repository (http://54.228.194.171:8081/nexus/content/repositories/snapshots/): Error transferring file: Connection refused
Downloading: http://uk.maven.org/maven2/org/apache/jena/jena-parent/4/jena-parent-4.pom
8K downloaded  (jena-parent-4.pom)
Downloading: http://www.mygrid.org.uk/maven/repository/org/apache/apache/10/apache-10.pom
[INFO] Unable to find resource 'org.apache:apache:pom:10' in repository mygrid-repository (http://www.mygrid.org.uk/maven/repository)
Downloading: http://54.228.194.171:8081/nexus/content/repositories/snapshots//org/apache/apache/10/apache-10.pom
[WARNING] Unable to get resource 'org.apache:apache:pom:10' from repository vph-repository (http://54.228.194.171:8081/nexus/content/repositories/snapshots/): Error transferring file: Connection refused
Downloading: http://uk.maven.org/maven2/org/apache/apache/10/apache-10.pom
14K downloaded  (apache-10.pom)
Downloading: http://www.mygrid.org.uk/maven/repository/org/apache/jena/jena-iri/0.9.4/jena-iri-0.9.4.pom
[INFO] Unable to find resource 'org.apache.jena:jena-iri:pom:0.9.4' in repository mygrid-repository (http://www.mygrid.org.uk/maven/repository)
Downloading: http://54.228.194.171:8081/nexus/content/repositories/snapshots//org/apache/jena/jena-iri/0.9.4/jena-iri-0.9.4.pom
[WARNING] Unable to get resource 'org.apache.jena:jena-iri:pom:0.9.4' from repository vph-repository (http://54.228.194.171:8081/nexus/content/repositories/snapshots/): Error transferring file: Connection refused
Downloading: http://uk.maven.org/maven2/org/apache/jena/jena-iri/0.9.4/jena-iri-0.9.4.pom
5K downloaded  (jena-iri-0.9.4.pom)
Downloading: http://www.mygrid.org.uk/maven/repository/org/slf4j/slf4j-api/1.6.4/slf4j-api-1.6.4.pom
[INFO] Unable to find resource 'org.slf4j:slf4j-api:pom:1.6.4' in repository mygrid-repository (http://www.mygrid.org.uk/maven/repository)
Downloading: http://54.228.194.171:8081/nexus/content/repositories/snapshots//org/slf4j/slf4j-api/1.6.4/slf4j-api-1.6.4.pom
[WARNING] Unable to get resource 'org.slf4j:slf4j-api:pom:1.6.4' from repository vph-repository (http://54.228.194.171:8081/nexus/content/repositories/snapshots/): Error transferring file: Connection refused
Downloading: http://uk.maven.org/maven2/org/slf4j/slf4j-api/1.6.4/slf4j-api-1.6.4.pom
2K downloaded  (slf4j-api-1.6.4.pom)
Downloading: http://www.mygrid.org.uk/maven/repository/org/slf4j/slf4j-parent/1.6.4/slf4j-parent-1.6.4.pom
[INFO] Unable to find resource 'org.slf4j:slf4j-parent:pom:1.6.4' in repository mygrid-repository (http://www.mygrid.org.uk/maven/repository)
Downloading: http://54.228.194.171:8081/nexus/content/repositories/snapshots//org/slf4j/slf4j-parent/1.6.4/slf4j-parent-1.6.4.pom
[WARNING] Unable to get resource 'org.slf4j:slf4j-parent:pom:1.6.4' from repository vph-repository (http://54.228.194.171:8081/nexus/content/repositories/snapshots/): Error transferring file: Connection refused
Downloading: http://uk.maven.org/maven2/org/slf4j/slf4j-parent/1.6.4/slf4j-parent-1.6.4.pom
11K downloaded  (slf4j-parent-1.6.4.pom)
Downloading: http://www.mygrid.org.uk/maven/repository/org/slf4j/slf4j-log4j12/1.6.4/slf4j-log4j12-1.6.4.pom
[INFO] Unable to find resource 'org.slf4j:slf4j-log4j12:pom:1.6.4' in repository mygrid-repository (http://www.mygrid.org.uk/maven/repository)
Downloading: http://54.228.194.171:8081/nexus/content/repositories/snapshots//org/slf4j/slf4j-log4j12/1.6.4/slf4j-log4j12-1.6.4.pom
[WARNING] Unable to get resource 'org.slf4j:slf4j-log4j12:pom:1.6.4' from repository vph-repository (http://54.228.194.171:8081/nexus/content/repositories/snapshots/): Error transferring file: Connection refused
Downloading: http://uk.maven.org/maven2/org/slf4j/slf4j-log4j12/1.6.4/slf4j-log4j12-1.6.4.pom
1K downloaded  (slf4j-log4j12-1.6.4.pom)
Downloading: http://www.mygrid.org.uk/maven/repository/log4j/log4j/1.2.16/log4j-1.2.16.pom
[INFO] Unable to find resource 'log4j:log4j:pom:1.2.16' in repository mygrid-repository (http://www.mygrid.org.uk/maven/repository)
Downloading: http://54.228.194.171:8081/nexus/content/repositories/snapshots//log4j/log4j/1.2.16/log4j-1.2.16.pom
[WARNING] Unable to get resource 'log4j:log4j:pom:1.2.16' from repository vph-repository (http://54.228.194.171:8081/nexus/content/repositories/snapshots/): Error transferring file: Connection refused
Downloading: http://uk.maven.org/maven2/log4j/log4j/1.2.16/log4j-1.2.16.pom
19K downloaded  (log4j-1.2.16.pom)
Downloading: http://www.mygrid.org.uk/maven/repository/xerces/xercesImpl/2.10.0/xercesImpl-2.10.0.pom
[INFO] Unable to find resource 'xerces:xercesImpl:pom:2.10.0' in repository mygrid-repository (http://www.mygrid.org.uk/maven/repository)
Downloading: http://54.228.194.171:8081/nexus/content/repositories/snapshots//xerces/xercesImpl/2.10.0/xercesImpl-2.10.0.pom
[WARNING] Unable to get resource 'xerces:xercesImpl:pom:2.10.0' from repository vph-repository (http://54.228.194.171:8081/nexus/content/repositories/snapshots/): Error transferring file: Connection refused
Downloading: http://uk.maven.org/maven2/xerces/xercesImpl/2.10.0/xercesImpl-2.10.0.pom
3K downloaded  (xercesImpl-2.10.0.pom)
Downloading: http://www.mygrid.org.uk/maven/repository/xml-apis/xml-apis/1.4.01/xml-apis-1.4.01.pom
[INFO] Unable to find resource 'xml-apis:xml-apis:pom:1.4.01' in repository mygrid-repository (http://www.mygrid.org.uk/maven/repository)
Downloading: http://54.228.194.171:8081/nexus/content/repositories/snapshots//xml-apis/xml-apis/1.4.01/xml-apis-1.4.01.pom
[WARNING] Unable to get resource 'xml-apis:xml-apis:pom:1.4.01' from repository vph-repository (http://54.228.194.171:8081/nexus/content/repositories/snapshots/): Error transferring file: Connection refused
Downloading: http://uk.maven.org/maven2/xml-apis/xml-apis/1.4.01/xml-apis-1.4.01.pom
2K downloaded  (xml-apis-1.4.01.pom)
Downloading: http://www.mygrid.org.uk/maven/repository/net/sf/taverna/t2/core/workflowmodel-api/1.4/workflowmodel-api-1.4.pom
1K downloaded  (workflowmodel-api-1.4.pom)
Downloading: http://www.mygrid.org.uk/maven/repository/net/sf/taverna/t2/core/1.4/core-1.4.pom
6K downloaded  (core-1.4.pom)
Downloading: http://www.mygrid.org.uk/maven/repository/net/sf/taverna/taverna-parent/2.4.0/taverna-parent-2.4.0.pom
8K downloaded  (taverna-parent-2.4.0.pom)
Downloading: http://www.mygrid.org.uk/maven/repository/net/sf/taverna/parent/0.2.2011-02-17/parent-0.2.2011-02-17.pom
5K downloaded  (parent-0.2.2011-02-17.pom)
Downloading: http://www.mygrid.org.uk/maven/repository/net/sf/taverna/t2/core/reference-api/1.4/reference-api-1.4.pom
916b downloaded  (reference-api-1.4.pom)
Downloading: http://www.mygrid.org.uk/maven/repository/org/springframework/spring-tx/2.5.4/spring-tx-2.5.4.pom
[INFO] Unable to find resource 'org.springframework:spring-tx:pom:2.5.4' in repository mygrid-repository (http://www.mygrid.org.uk/maven/repository)
Downloading: http://54.228.194.171:8081/nexus/content/repositories/snapshots//org/springframework/spring-tx/2.5.4/spring-tx-2.5.4.pom
[WARNING] Unable to get resource 'org.springframework:spring-tx:pom:2.5.4' from repository vph-repository (http://54.228.194.171:8081/nexus/content/repositories/snapshots/): Error transferring file: Connection refused
Downloading: http://uk.maven.org/maven2//org/springframework/spring-tx/2.5.4/spring-tx-2.5.4.pom
3K downloaded  (spring-tx-2.5.4.pom)
Downloading: http://www.mygrid.org.uk/maven/repository/commons-logging/commons-logging/1.1.1/commons-logging-1.1.1.pom
[INFO] Unable to find resource 'commons-logging:commons-logging:pom:1.1.1' in repository mygrid-repository (http://www.mygrid.org.uk/maven/repository)
Downloading: http://54.228.194.171:8081/nexus/content/repositories/snapshots//commons-logging/commons-logging/1.1.1/commons-logging-1.1.1.pom
[WARNING] Unable to get resource 'commons-logging:commons-logging:pom:1.1.1' from repository vph-repository (http://54.228.194.171:8081/nexus/content/repositories/snapshots/): Error transferring file: Connection refused
Downloading: http://uk.maven.org/maven2//commons-logging/commons-logging/1.1.1/commons-logging-1.1.1.pom
17K downloaded  (commons-logging-1.1.1.pom)
Downloading: http://www.mygrid.org.uk/maven/repository/org/apache/commons/commons-parent/5/commons-parent-5.pom
[INFO] Unable to find resource 'org.apache.commons:commons-parent:pom:5' in repository mygrid-repository (http://www.mygrid.org.uk/maven/repository)
Downloading: http://54.228.194.171:8081/nexus/content/repositories/snapshots//org/apache/commons/commons-parent/5/commons-parent-5.pom
[WARNING] Unable to get resource 'org.apache.commons:commons-parent:pom:5' from repository vph-repository (http://54.228.194.171:8081/nexus/content/repositories/snapshots/): Error transferring file: Connection refused
Downloading: http://uk.maven.org/maven2//org/apache/commons/commons-parent/5/commons-parent-5.pom
15K downloaded  (commons-parent-5.pom)
Downloading: http://www.mygrid.org.uk/maven/repository/org/springframework/spring-beans/2.5.4/spring-beans-2.5.4.pom
[INFO] Unable to find resource 'org.springframework:spring-beans:pom:2.5.4' in repository mygrid-repository (http://www.mygrid.org.uk/maven/repository)
Downloading: http://54.228.194.171:8081/nexus/content/repositories/snapshots//org/springframework/spring-beans/2.5.4/spring-beans-2.5.4.pom
[WARNING] Unable to get resource 'org.springframework:spring-beans:pom:2.5.4' from repository vph-repository (http://54.228.194.171:8081/nexus/content/repositories/snapshots/): Error transferring file: Connection refused
Downloading: http://uk.maven.org/maven2//org/springframework/spring-beans/2.5.4/spring-beans-2.5.4.pom
2K downloaded  (spring-beans-2.5.4.pom)
Downloading: http://www.mygrid.org.uk/maven/repository/org/springframework/spring-core/2.5.4/spring-core-2.5.4.pom
[INFO] Unable to find resource 'org.springframework:spring-core:pom:2.5.4' in repository mygrid-repository (http://www.mygrid.org.uk/maven/repository)
Downloading: http://54.228.194.171:8081/nexus/content/repositories/snapshots//org/springframework/spring-core/2.5.4/spring-core-2.5.4.pom
[WARNING] Unable to get resource 'org.springframework:spring-core:pom:2.5.4' from repository vph-repository (http://54.228.194.171:8081/nexus/content/repositories/snapshots/): Error transferring file: Connection refused
Downloading: http://uk.maven.org/maven2//org/springframework/spring-core/2.5.4/spring-core-2.5.4.pom
2K downloaded  (spring-core-2.5.4.pom)
Downloading: http://www.mygrid.org.uk/maven/repository/org/springframework/spring-context/2.5.4/spring-context-2.5.4.pom
[INFO] Unable to find resource 'org.springframework:spring-context:pom:2.5.4' in repository mygrid-repository (http://www.mygrid.org.uk/maven/repository)
Downloading: http://54.228.194.171:8081/nexus/content/repositories/snapshots//org/springframework/spring-context/2.5.4/spring-context-2.5.4.pom
[WARNING] Unable to get resource 'org.springframework:spring-context:pom:2.5.4' from repository vph-repository (http://54.228.194.171:8081/nexus/content/repositories/snapshots/): Error transferring file: Connection refused
Downloading: http://uk.maven.org/maven2//org/springframework/spring-context/2.5.4/spring-context-2.5.4.pom
3K downloaded  (spring-context-2.5.4.pom)
Downloading: http://www.mygrid.org.uk/maven/repository/aopalliance/aopalliance/1.0/aopalliance-1.0.pom
[INFO] Unable to find resource 'aopalliance:aopalliance:pom:1.0' in repository mygrid-repository (http://www.mygrid.org.uk/maven/repository)
Downloading: http://54.228.194.171:8081/nexus/content/repositories/snapshots//aopalliance/aopalliance/1.0/aopalliance-1.0.pom
[WARNING] Unable to get resource 'aopalliance:aopalliance:pom:1.0' from repository vph-repository (http://54.228.194.171:8081/nexus/content/repositories/snapshots/): Error transferring file: Connection refused
Downloading: http://uk.maven.org/maven2//aopalliance/aopalliance/1.0/aopalliance-1.0.pom
363b downloaded  (aopalliance-1.0.pom)
Downloading: http://www.mygrid.org.uk/maven/repository/net/sf/taverna/t2/infrastructure/spi-discovery-api/2.4/spi-discovery-api-2.4.pom
1K downloaded  (spi-discovery-api-2.4.pom)
Downloading: http://www.mygrid.org.uk/maven/repository/net/sf/taverna/t2/infrastructure/2.4/infrastructure-2.4.pom
3K downloaded  (infrastructure-2.4.pom)
Downloading: http://www.mygrid.org.uk/maven/repository/net/sf/taverna/t2/lang/observer/1.4/observer-1.4.pom
824b downloaded  (observer-1.4.pom)
Downloading: http://www.mygrid.org.uk/maven/repository/net/sf/taverna/t2/lang/1.4/lang-1.4.pom
2K downloaded  (lang-1.4.pom)
Downloading: http://www.mygrid.org.uk/maven/repository/net/sf/taverna/t2/infrastructure/raven/2.4/raven-2.4.pom
1K downloaded  (raven-2.4.pom)
Downloading: http://www.mygrid.org.uk/maven/repository/net/sf/taverna/t2/infrastructure/raven-log4j/2.4/raven-log4j-2.4.pom
943b downloaded  (raven-log4j-2.4.pom)
Downloading: http://www.mygrid.org.uk/maven/repository/net/sf/taverna/t2/infrastructure/appconfig/2.4/appconfig-2.4.pom
1K downloaded  (appconfig-2.4.pom)
Downloading: http://www.mygrid.org.uk/maven/repository/net/sf/taverna/t2/infrastructure/launcher-api/2.4/launcher-api-2.4.pom
540b downloaded  (launcher-api-2.4.pom)
Downloading: http://www.mygrid.org.uk/maven/repository/net/sf/taverna/t2/infrastructure/prelauncher/2.4/prelauncher-2.4.pom
1K downloaded  (prelauncher-2.4.pom)
Downloading: http://www.mygrid.org.uk/maven/repository/net/sf/taverna/t2/ui-api/file-api/1.4/file-api-1.4.pom
1K downloaded  (file-api-1.4.pom)
Downloading: http://www.mygrid.org.uk/maven/repository/net/sf/taverna/t2/ui-api/1.4/ui-api-1.4.pom
3K downloaded  (ui-api-1.4.pom)
Downloading: http://www.mygrid.org.uk/maven/repository/net/sf/taverna/t2/ui-api/edits-api/1.4/edits-api-1.4.pom
1K downloaded  (edits-api-1.4.pom)
Downloading: http://www.mygrid.org.uk/maven/repository/net/sf/taverna/t2/ui-api/menu-api/1.4/menu-api-1.4.pom
802b downloaded  (menu-api-1.4.pom)
Downloading: http://www.mygrid.org.uk/maven/repository/net/sf/taverna/t2/ui-api/workbench-api/1.4/workbench-api-1.4.pom
1K downloaded  (workbench-api-1.4.pom)
Downloading: http://www.mygrid.org.uk/maven/repository/net/sf/taverna/t2/lang/ui/1.4/ui-1.4.pom
811b downloaded  (ui-1.4.pom)
Downloading: http://www.mygrid.org.uk/maven/repository/net/sf/taverna/t2/security/credential-manager/1.4/credential-manager-1.4.pom
2K downloaded  (credential-manager-1.4.pom)
Downloading: http://www.mygrid.org.uk/maven/repository/net/sf/taverna/t2/security/1.4/security-1.4.pom
3K downloaded  (security-1.4.pom)
Downloading: http://www.mygrid.org.uk/maven/repository/bouncycastle/bcprov-jdk16/140/bcprov-jdk16-140.pom
[INFO] Unable to find resource 'bouncycastle:bcprov-jdk16:pom:140' in repository mygrid-repository (http://www.mygrid.org.uk/maven/repository)
Downloading: http://54.228.194.171:8081/nexus/content/repositories/snapshots//bouncycastle/bcprov-jdk16/140/bcprov-jdk16-140.pom
[WARNING] Unable to get resource 'bouncycastle:bcprov-jdk16:pom:140' from repository vph-repository (http://54.228.194.171:8081/nexus/content/repositories/snapshots/): Error transferring file: Connection refused
Downloading: http://uk.maven.org/maven2//bouncycastle/bcprov-jdk16/140/bcprov-jdk16-140.pom
1K downloaded  (bcprov-jdk16-140.pom)
Downloading: http://www.mygrid.org.uk/maven/repository/commons-httpclient/commons-httpclient/3.1/commons-httpclient-3.1.pom
[INFO] Unable to find resource 'commons-httpclient:commons-httpclient:pom:3.1' in repository mygrid-repository (http://www.mygrid.org.uk/maven/repository)
Downloading: http://54.228.194.171:8081/nexus/content/repositories/snapshots//commons-httpclient/commons-httpclient/3.1/commons-httpclient-3.1.pom
[WARNING] Unable to get resource 'commons-httpclient:commons-httpclient:pom:3.1' from repository vph-repository (http://54.228.194.171:8081/nexus/content/repositories/snapshots/): Error transferring file: Connection refused
Downloading: http://uk.maven.org/maven2/commons-httpclient/commons-httpclient/3.1/commons-httpclient-3.1.pom
7K downloaded  (commons-httpclient-3.1.pom)
Downloading: http://www.mygrid.org.uk/maven/repository/commons-logging/commons-logging/1.0.4/commons-logging-1.0.4.pom
[INFO] Unable to find resource 'commons-logging:commons-logging:pom:1.0.4' in repository mygrid-repository (http://www.mygrid.org.uk/maven/repository)
Downloading: http://54.228.194.171:8081/nexus/content/repositories/snapshots//commons-logging/commons-logging/1.0.4/commons-logging-1.0.4.pom
[WARNING] Unable to get resource 'commons-logging:commons-logging:pom:1.0.4' from repository vph-repository (http://54.228.194.171:8081/nexus/content/repositories/snapshots/): Error transferring file: Connection refused
Downloading: http://uk.maven.org/maven2/commons-logging/commons-logging/1.0.4/commons-logging-1.0.4.pom
5K downloaded  (commons-logging-1.0.4.pom)
Downloading: http://www.mygrid.org.uk/maven/repository/net/sf/taverna/t2/core/workflowmodel-impl/1.4/workflowmodel-impl-1.4.pom
1K downloaded  (workflowmodel-impl-1.4.pom)
Downloading: http://www.mygrid.org.uk/maven/repository/com/thoughtworks/xstream/xstream/1.4.1/xstream-1.4.1.pom
[INFO] Unable to find resource 'com.thoughtworks.xstream:xstream:pom:1.4.1' in repository mygrid-repository (http://www.mygrid.org.uk/maven/repository)
Downloading: http://54.228.194.171:8081/nexus/content/repositories/snapshots//com/thoughtworks/xstream/xstream/1.4.1/xstream-1.4.1.pom
[WARNING] Unable to get resource 'com.thoughtworks.xstream:xstream:pom:1.4.1' from repository vph-repository (http://54.228.194.171:8081/nexus/content/repositories/snapshots/): Error transferring file: Connection refused
Downloading: http://uk.maven.org/maven2//com/thoughtworks/xstream/xstream/1.4.1/xstream-1.4.1.pom
13K downloaded  (xstream-1.4.1.pom)
Downloading: http://www.mygrid.org.uk/maven/repository/com/thoughtworks/xstream/xstream-parent/1.4.1/xstream-parent-1.4.1.pom
[INFO] Unable to find resource 'com.thoughtworks.xstream:xstream-parent:pom:1.4.1' in repository mygrid-repository (http://www.mygrid.org.uk/maven/repository)
Downloading: http://54.228.194.171:8081/nexus/content/repositories/snapshots//com/thoughtworks/xstream/xstream-parent/1.4.1/xstream-parent-1.4.1.pom
[WARNING] Unable to get resource 'com.thoughtworks.xstream:xstream-parent:pom:1.4.1' from repository vph-repository (http://54.228.194.171:8081/nexus/content/repositories/snapshots/): Error transferring file: Connection refused
Downloading: http://uk.maven.org/maven2//com/thoughtworks/xstream/xstream-parent/1.4.1/xstream-parent-1.4.1.pom
14K downloaded  (xstream-parent-1.4.1.pom)
Downloading: http://www.mygrid.org.uk/maven/repository/org/codehaus/codehaus-parent/3/codehaus-parent-3.pom
[INFO] Unable to find resource 'org.codehaus:codehaus-parent:pom:3' in repository mygrid-repository (http://www.mygrid.org.uk/maven/repository)
Downloading: http://54.228.194.171:8081/nexus/content/repositories/snapshots//org/codehaus/codehaus-parent/3/codehaus-parent-3.pom
[WARNING] Unable to get resource 'org.codehaus:codehaus-parent:pom:3' from repository vph-repository (http://54.228.194.171:8081/nexus/content/repositories/snapshots/): Error transferring file: Connection refused
Downloading: http://uk.maven.org/maven2//org/codehaus/codehaus-parent/3/codehaus-parent-3.pom
4K downloaded  (codehaus-parent-3.pom)
Downloading: http://www.mygrid.org.uk/maven/repository/xmlpull/xmlpull/1.1.3.1/xmlpull-1.1.3.1.pom
[INFO] Unable to find resource 'xmlpull:xmlpull:pom:1.1.3.1' in repository mygrid-repository (http://www.mygrid.org.uk/maven/repository)
Downloading: http://54.228.194.171:8081/nexus/content/repositories/snapshots//xmlpull/xmlpull/1.1.3.1/xmlpull-1.1.3.1.pom
[WARNING] Unable to get resource 'xmlpull:xmlpull:pom:1.1.3.1' from repository vph-repository (http://54.228.194.171:8081/nexus/content/repositories/snapshots/): Error transferring file: Connection refused
Downloading: http://uk.maven.org/maven2//xmlpull/xmlpull/1.1.3.1/xmlpull-1.1.3.1.pom
386b downloaded  (xmlpull-1.1.3.1.pom)
Downloading: http://www.mygrid.org.uk/maven/repository/xpp3/xpp3_min/1.1.4c/xpp3_min-1.1.4c.pom
[INFO] Unable to find resource 'xpp3:xpp3_min:pom:1.1.4c' in repository mygrid-repository (http://www.mygrid.org.uk/maven/repository)
Downloading: http://54.228.194.171:8081/nexus/content/repositories/snapshots//xpp3/xpp3_min/1.1.4c/xpp3_min-1.1.4c.pom
[WARNING] Unable to get resource 'xpp3:xpp3_min:pom:1.1.4c' from repository vph-repository (http://54.228.194.171:8081/nexus/content/repositories/snapshots/): Error transferring file: Connection refused
Downloading: http://uk.maven.org/maven2//xpp3/xpp3_min/1.1.4c/xpp3_min-1.1.4c.pom
1K downloaded  (xpp3_min-1.1.4c.pom)
Downloading: http://www.mygrid.org.uk/maven/repository/net/sf/taverna/t2/ui-impl/file-impl/1.4/file-impl-1.4.pom
2K downloaded  (file-impl-1.4.pom)
Downloading: http://www.mygrid.org.uk/maven/repository/net/sf/taverna/t2/ui-impl/1.4/ui-impl-1.4.pom
3K downloaded  (ui-impl-1.4.pom)
Downloading: http://www.mygrid.org.uk/maven/repository/net/sf/taverna/t2/ui-api/common-icons/1.4/common-icons-1.4.pom
594b downloaded  (common-icons-1.4.pom)
Downloading: http://www.mygrid.org.uk/maven/repository/commons-collections/commons-collections/3.2.1/commons-collections-3.2.1.pom
[INFO] Unable to find resource 'commons-collections:commons-collections:pom:3.2.1' in repository mygrid-repository (http://www.mygrid.org.uk/maven/repository)
Downloading: http://54.228.194.171:8081/nexus/content/repositories/snapshots//commons-collections/commons-collections/3.2.1/commons-collections-3.2.1.pom
[WARNING] Unable to get resource 'commons-collections:commons-collections:pom:3.2.1' from repository vph-repository (http://54.228.194.171:8081/nexus/content/repositories/snapshots/): Error transferring file: Connection refused
Downloading: http://uk.maven.org/maven2//commons-collections/commons-collections/3.2.1/commons-collections-3.2.1.pom
12K downloaded  (commons-collections-3.2.1.pom)
Downloading: http://www.mygrid.org.uk/maven/repository/org/apache/commons/commons-parent/9/commons-parent-9.pom
[INFO] Unable to find resource 'org.apache.commons:commons-parent:pom:9' in repository mygrid-repository (http://www.mygrid.org.uk/maven/repository)
Downloading: http://54.228.194.171:8081/nexus/content/repositories/snapshots//org/apache/commons/commons-parent/9/commons-parent-9.pom
[WARNING] Unable to get resource 'org.apache.commons:commons-parent:pom:9' from repository vph-repository (http://54.228.194.171:8081/nexus/content/repositories/snapshots/): Error transferring file: Connection refused
Downloading: http://uk.maven.org/maven2//org/apache/commons/commons-parent/9/commons-parent-9.pom
21K downloaded  (commons-parent-9.pom)
Downloading: http://www.mygrid.org.uk/maven/repository/commons-lang/commons-lang/2.5/commons-lang-2.5.pom
[INFO] Unable to find resource 'commons-lang:commons-lang:pom:2.5' in repository mygrid-repository (http://www.mygrid.org.uk/maven/repository)
Downloading: http://54.228.194.171:8081/nexus/content/repositories/snapshots//commons-lang/commons-lang/2.5/commons-lang-2.5.pom
[WARNING] Unable to get resource 'commons-lang:commons-lang:pom:2.5' from repository vph-repository (http://54.228.194.171:8081/nexus/content/repositories/snapshots/): Error transferring file: Connection refused
Downloading: http://uk.maven.org/maven2//commons-lang/commons-lang/2.5/commons-lang-2.5.pom
16K downloaded  (commons-lang-2.5.pom)
Downloading: http://www.mygrid.org.uk/maven/repository/org/apache/commons/commons-parent/12/commons-parent-12.pom
[INFO] Unable to find resource 'org.apache.commons:commons-parent:pom:12' in repository mygrid-repository (http://www.mygrid.org.uk/maven/repository)
Downloading: http://54.228.194.171:8081/nexus/content/repositories/snapshots//org/apache/commons/commons-parent/12/commons-parent-12.pom
[WARNING] Unable to get resource 'org.apache.commons:commons-parent:pom:12' from repository vph-repository (http://54.228.194.171:8081/nexus/content/repositories/snapshots/): Error transferring file: Connection refused
Downloading: http://uk.maven.org/maven2//org/apache/commons/commons-parent/12/commons-parent-12.pom
26K downloaded  (commons-parent-12.pom)
Downloading: http://www.mygrid.org.uk/maven/repository/commons-codec/commons-codec/1.4/commons-codec-1.4.pom
[INFO] Unable to find resource 'commons-codec:commons-codec:pom:1.4' in repository mygrid-repository (http://www.mygrid.org.uk/maven/repository)
Downloading: http://54.228.194.171:8081/nexus/content/repositories/snapshots//commons-codec/commons-codec/1.4/commons-codec-1.4.pom
[WARNING] Unable to get resource 'commons-codec:commons-codec:pom:1.4' from repository vph-repository (http://54.228.194.171:8081/nexus/content/repositories/snapshots/): Error transferring file: Connection refused
Downloading: http://uk.maven.org/maven2//commons-codec/commons-codec/1.4/commons-codec-1.4.pom
10K downloaded  (commons-codec-1.4.pom)
Downloading: http://www.mygrid.org.uk/maven/repository/net/sf/taverna/t2/ui-api/helper-api/1.4/helper-api-1.4.pom
1K downloaded  (helper-api-1.4.pom)
Downloading: http://www.mygrid.org.uk/maven/repository/javax/help/javahelp/2.0.02/javahelp-2.0.02.pom
[INFO] Unable to find resource 'javax.help:javahelp:pom:2.0.02' in repository mygrid-repository (http://www.mygrid.org.uk/maven/repository)
Downloading: http://54.228.194.171:8081/nexus/content/repositories/snapshots//javax/help/javahelp/2.0.02/javahelp-2.0.02.pom
[WARNING] Unable to get resource 'javax.help:javahelp:pom:2.0.02' from repository vph-repository (http://54.228.194.171:8081/nexus/content/repositories/snapshots/): Error transferring file: Connection refused
Downloading: http://uk.maven.org/maven2//javax/help/javahelp/2.0.02/javahelp-2.0.02.pom
482b downloaded  (javahelp-2.0.02.pom)
Downloading: http://www.mygrid.org.uk/maven/repository/net/sf/taverna/t2/ui-impl/edits-impl/1.4/edits-impl-1.4.pom
1K downloaded  (edits-impl-1.4.pom)
Downloading: http://www.mygrid.org.uk/maven/repository/net/sf/taverna/t2/core/workflowmodel-api/1.4/workflowmodel-api-1.4.jar
Downloading: http://www.mygrid.org.uk/maven/repository/org/springframework/spring-tx/2.5.4/spring-tx-2.5.4.jar
Downloading: http://www.mygrid.org.uk/maven/repository/commons-httpclient/commons-httpclient/3.1/commons-httpclient-3.1.jar
Downloading: http://www.mygrid.org.uk/maven/repository/org/apache/jena/jena-core/2.7.4/jena-core-2.7.4.jar
[INFO] Unable to find resource 'org.springframework:spring-tx:jar:2.5.4' in repository mygrid-repository (http://www.mygrid.org.uk/maven/repository)
Downloading: http://54.228.194.171:8081/nexus/content/repositories/snapshots//org/springframework/spring-tx/2.5.4/spring-tx-2.5.4.jar
Downloading: http://www.mygrid.org.uk/maven/repository/xerces/xercesImpl/2.10.0/xercesImpl-2.10.0.jar
[INFO] Unable to find resource 'org.apache.jena:jena-core:jar:2.7.4' in repository mygrid-repository (http://www.mygrid.org.uk/maven/repository)
Downloading: http://54.228.194.171:8081/nexus/content/repositories/snapshots//org/apache/jena/jena-core/2.7.4/jena-core-2.7.4.jar
[INFO] Unable to find resource 'xerces:xercesImpl:jar:2.10.0' in repository mygrid-repository (http://www.mygrid.org.uk/maven/repository)
Downloading: http://54.228.194.171:8081/nexus/content/repositories/snapshots//xerces/xercesImpl/2.10.0/xercesImpl-2.10.0.jar
[INFO] Unable to find resource 'commons-httpclient:commons-httpclient:jar:3.1' in repository mygrid-repository (http://www.mygrid.org.uk/maven/repository)
Downloading: http://54.228.194.171:8081/nexus/content/repositories/snapshots//commons-httpclient/commons-httpclient/3.1/commons-httpclient-3.1.jar
[WARNING] Unable to get resource 'org.springframework:spring-tx:jar:2.5.4' from repository vph-repository (http://54.228.194.171:8081/nexus/content/repositories/snapshots/): Error transferring file: Connection refused
Downloading: http://uk.maven.org/maven2//org/springframework/spring-tx/2.5.4/spring-tx-2.5.4.jar
[WARNING] Unable to get resource 'org.apache.jena:jena-core:jar:2.7.4' from repository vph-repository (http://54.228.194.171:8081/nexus/content/repositories/snapshots/): Error transferring file: Connection refused
Downloading: http://uk.maven.org/maven2/org/apache/jena/jena-core/2.7.4/jena-core-2.7.4.jar
[WARNING] Unable to get resource 'xerces:xercesImpl:jar:2.10.0' from repository vph-repository (http://54.228.194.171:8081/nexus/content/repositories/snapshots/): Error transferring file: Connection refused
Downloading: http://uk.maven.org/maven2/xerces/xercesImpl/2.10.0/xercesImpl-2.10.0.jar
[WARNING] Unable to get resource 'commons-httpclient:commons-httpclient:jar:3.1' from repository vph-repository (http://54.228.194.171:8081/nexus/content/repositories/snapshots/): Error transferring file: Connection refused
Downloading: http://uk.maven.org/maven2/commons-httpclient/commons-httpclient/3.1/commons-httpclient-3.1.jar
167K downloaded  (workflowmodel-api-1.4.jar)
Downloading: http://www.mygrid.org.uk/maven/repository/net/sf/taverna/t2/ui-api/file-api/1.4/file-api-1.4.jar
222K downloaded  (spring-tx-2.5.4.jar)
Downloading: http://www.mygrid.org.uk/maven/repository/net/sf/taverna/t2/lang/observer/1.4/observer-1.4.jar
4K downloaded  (observer-1.4.jar)
297K downloaded  (commons-httpclient-3.1.jar)
Downloading: http://www.mygrid.org.uk/maven/repository/net/sf/taverna/t2/infrastructure/spi-discovery-api/2.4/spi-discovery-api-2.4.jar
Downloading: http://www.mygrid.org.uk/maven/repository/org/slf4j/slf4j-api/1.6.4/slf4j-api-1.6.4.jar
[INFO] Unable to find resource 'org.slf4j:slf4j-api:jar:1.6.4' in repository mygrid-repository (http://www.mygrid.org.uk/maven/repository)
Downloading: http://54.228.194.171:8081/nexus/content/repositories/snapshots//org/slf4j/slf4j-api/1.6.4/slf4j-api-1.6.4.jar
5K downloaded  (spi-discovery-api-2.4.jar)
Downloading: http://www.mygrid.org.uk/maven/repository/aopalliance/aopalliance/1.0/aopalliance-1.0.jar
[WARNING] Unable to get resource 'org.slf4j:slf4j-api:jar:1.6.4' from repository vph-repository (http://54.228.194.171:8081/nexus/content/repositories/snapshots/): Error transferring file: Connection refused
Downloading: http://uk.maven.org/maven2/org/slf4j/slf4j-api/1.6.4/slf4j-api-1.6.4.jar
[INFO] Unable to find resource 'aopalliance:aopalliance:jar:1.0' in repository mygrid-repository (http://www.mygrid.org.uk/maven/repository)
Downloading: http://54.228.194.171:8081/nexus/content/repositories/snapshots//aopalliance/aopalliance/1.0/aopalliance-1.0.jar
25K downloaded  (slf4j-api-1.6.4.jar)
Downloading: http://www.mygrid.org.uk/maven/repository/net/sf/taverna/t2/security/credential-manager/1.4/credential-manager-1.4.jar
[WARNING] Unable to get resource 'aopalliance:aopalliance:jar:1.0' from repository vph-repository (http://54.228.194.171:8081/nexus/content/repositories/snapshots/): Error transferring file: Connection refused
Downloading: http://uk.maven.org/maven2//aopalliance/aopalliance/1.0/aopalliance-1.0.jar
13K downloaded  (file-api-1.4.jar)
1331K downloaded  (xercesImpl-2.10.0.jar)
4K downloaded  (aopalliance-1.0.jar)
Downloading: http://www.mygrid.org.uk/maven/repository/commons-codec/commons-codec/1.2/commons-codec-1.2.jar
64K downloaded  (credential-manager-1.4.jar)
Downloading: http://www.mygrid.org.uk/maven/repository/org/jdom/jdom/1.1/jdom-1.1.jar
1676K downloaded  (jena-core-2.7.4.jar)
Downloading: http://www.mygrid.org.uk/maven/repository/commons-logging/commons-logging/1.0.4/commons-logging-1.0.4.jar
[INFO] Unable to find resource 'commons-codec:commons-codec:jar:1.2' in repository mygrid-repository (http://www.mygrid.org.uk/maven/repository)
Downloading: http://54.228.194.171:8081/nexus/content/repositories/snapshots//commons-codec/commons-codec/1.2/commons-codec-1.2.jar
Downloading: http://www.mygrid.org.uk/maven/repository/bouncycastle/bcprov-jdk16/140/bcprov-jdk16-140.jar
[WARNING] Unable to get resource 'commons-codec:commons-codec:jar:1.2' from repository vph-repository (http://54.228.194.171:8081/nexus/content/repositories/snapshots/): Error transferring file: Connection refused
Downloading: http://uk.maven.org/maven2/commons-codec/commons-codec/1.2/commons-codec-1.2.jar
29K downloaded  (commons-codec-1.2.jar)
Downloading: http://www.mygrid.org.uk/maven/repository/xml-apis/xml-apis/1.4.01/xml-apis-1.4.01.jar
[INFO] Unable to find resource 'org.jdom:jdom:jar:1.1' in repository mygrid-repository (http://www.mygrid.org.uk/maven/repository)
Downloading: http://54.228.194.171:8081/nexus/content/repositories/snapshots//org/jdom/jdom/1.1/jdom-1.1.jar
Downloading: http://www.mygrid.org.uk/maven/repository/log4j/log4j/1.2.16/log4j-1.2.16.jar
[INFO] Unable to find resource 'commons-logging:commons-logging:jar:1.0.4' in repository mygrid-repository (http://www.mygrid.org.uk/maven/repository)
Downloading: http://54.228.194.171:8081/nexus/content/repositories/snapshots//commons-logging/commons-logging/1.0.4/commons-logging-1.0.4.jar
[WARNING] Unable to get resource 'commons-logging:commons-logging:jar:1.0.4' from repository vph-repository (http://54.228.194.171:8081/nexus/content/repositories/snapshots/): Error transferring file: Connection refused
Downloading: http://uk.maven.org/maven2/commons-logging/commons-logging/1.0.4/commons-logging-1.0.4.jar
[INFO] Unable to find resource 'xml-apis:xml-apis:jar:1.4.01' in repository mygrid-repository (http://www.mygrid.org.uk/maven/repository)
[INFO] Unable to find resource 'bouncycastle:bcprov-jdk16:jar:140' in repository mygrid-repository (http://www.mygrid.org.uk/maven/repository)
Downloading: http://54.228.194.171:8081/nexus/content/repositories/snapshots//xml-apis/xml-apis/1.4.01/xml-apis-1.4.01.jar
Downloading: http://54.228.194.171:8081/nexus/content/repositories/snapshots//bouncycastle/bcprov-jdk16/140/bcprov-jdk16-140.jar
[INFO] Unable to find resource 'log4j:log4j:jar:1.2.16' in repository mygrid-repository (http://www.mygrid.org.uk/maven/repository)
Downloading: http://54.228.194.171:8081/nexus/content/repositories/snapshots//log4j/log4j/1.2.16/log4j-1.2.16.jar
[WARNING] Unable to get resource 'org.jdom:jdom:jar:1.1' from repository vph-repository (http://54.228.194.171:8081/nexus/content/repositories/snapshots/): Error transferring file: Connection refused
Downloading: http://uk.maven.org/maven2/org/jdom/jdom/1.1/jdom-1.1.jar
37K downloaded  (commons-logging-1.0.4.jar)
[WARNING] Unable to get resource 'bouncycastle:bcprov-jdk16:jar:140' from repository vph-repository (http://54.228.194.171:8081/nexus/content/repositories/snapshots/): Error transferring file: Connection refused
[WARNING] Unable to get resource 'xml-apis:xml-apis:jar:1.4.01' from repository vph-repository (http://54.228.194.171:8081/nexus/content/repositories/snapshots/): Error transferring file: Connection refused
Downloading: http://uk.maven.org/maven2//bouncycastle/bcprov-jdk16/140/bcprov-jdk16-140.jar
Downloading: http://uk.maven.org/maven2/xml-apis/xml-apis/1.4.01/xml-apis-1.4.01.jar
[WARNING] Unable to get resource 'log4j:log4j:jar:1.2.16' from repository vph-repository (http://54.228.194.171:8081/nexus/content/repositories/snapshots/): Error transferring file: Connection refused
Downloading: http://uk.maven.org/maven2/log4j/log4j/1.2.16/log4j-1.2.16.jar
Downloading: http://www.mygrid.org.uk/maven/repository/net/sf/taverna/t2/core/reference-api/1.4/reference-api-1.4.jar
149K downloaded  (jdom-1.1.jar)
215K downloaded  (xml-apis-1.4.01.jar)
Downloading: http://www.mygrid.org.uk/maven/repository/org/springframework/spring-beans/2.5.4/spring-beans-2.5.4.jar
[INFO] Unable to find resource 'org.springframework:spring-beans:jar:2.5.4' in repository mygrid-repository (http://www.mygrid.org.uk/maven/repository)
Downloading: http://54.228.194.171:8081/nexus/content/repositories/snapshots//org/springframework/spring-beans/2.5.4/spring-beans-2.5.4.jar
Downloading: http://www.mygrid.org.uk/maven/repository/net/sf/taverna/t2/lang/ui/1.4/ui-1.4.jar
[WARNING] Unable to get resource 'org.springframework:spring-beans:jar:2.5.4' from repository vph-repository (http://54.228.194.171:8081/nexus/content/repositories/snapshots/): Error transferring file: Connection refused
Downloading: http://uk.maven.org/maven2//org/springframework/spring-beans/2.5.4/spring-beans-2.5.4.jar
80K downloaded  (ui-1.4.jar)
27K downloaded  (reference-api-1.4.jar)
470K downloaded  (log4j-1.2.16.jar)
Downloading: http://www.mygrid.org.uk/maven/repository/net/sf/taverna/t2/infrastructure/raven/2.4/raven-2.4.jar
472K downloaded  (spring-beans-2.5.4.jar)
Downloading: http://www.mygrid.org.uk/maven/repository/org/slf4j/slf4j-log4j12/1.6.4/slf4j-log4j12-1.6.4.jar
[INFO] Unable to find resource 'org.slf4j:slf4j-log4j12:jar:1.6.4' in repository mygrid-repository (http://www.mygrid.org.uk/maven/repository)
84K downloaded  (raven-2.4.jar)
Downloading: http://54.228.194.171:8081/nexus/content/repositories/snapshots//org/slf4j/slf4j-log4j12/1.6.4/slf4j-log4j12-1.6.4.jar
Downloading: http://www.mygrid.org.uk/maven/repository/org/apache/jena/jena-iri/0.9.4/jena-iri-0.9.4.jar
[INFO] Unable to find resource 'org.apache.jena:jena-iri:jar:0.9.4' in repository mygrid-repository (http://www.mygrid.org.uk/maven/repository)
Downloading: http://54.228.194.171:8081/nexus/content/repositories/snapshots//org/apache/jena/jena-iri/0.9.4/jena-iri-0.9.4.jar
Downloading: http://www.mygrid.org.uk/maven/repository/net/sf/taverna/t2/ui-api/edits-api/1.4/edits-api-1.4.jar
Downloading: http://www.mygrid.org.uk/maven/repository/org/springframework/spring-core/2.5.4/spring-core-2.5.4.jar
[WARNING] Unable to get resource 'org.slf4j:slf4j-log4j12:jar:1.6.4' from repository vph-repository (http://54.228.194.171:8081/nexus/content/repositories/snapshots/): Error transferring file: Connection refused
Downloading: http://uk.maven.org/maven2/org/slf4j/slf4j-log4j12/1.6.4/slf4j-log4j12-1.6.4.jar
6K downloaded  (edits-api-1.4.jar)
[WARNING] Unable to get resource 'org.apache.jena:jena-iri:jar:0.9.4' from repository vph-repository (http://54.228.194.171:8081/nexus/content/repositories/snapshots/): Error transferring file: Connection refused
Downloading: http://uk.maven.org/maven2/org/apache/jena/jena-iri/0.9.4/jena-iri-0.9.4.jar
[INFO] Unable to find resource 'org.springframework:spring-core:jar:2.5.4' in repository mygrid-repository (http://www.mygrid.org.uk/maven/repository)
9K downloaded  (slf4j-log4j12-1.6.4.jar)
133K downloaded  (jena-iri-0.9.4.jar)
Downloading: http://www.mygrid.org.uk/maven/repository/net/sf/taverna/t2/infrastructure/raven-log4j/2.4/raven-log4j-2.4.jar
Downloading: http://www.mygrid.org.uk/maven/repository/net/sf/taverna/t2/ui-api/menu-api/1.4/menu-api-1.4.jar
Downloading: http://54.228.194.171:8081/nexus/content/repositories/snapshots//org/springframework/spring-core/2.5.4/spring-core-2.5.4.jar
16K downloaded  (menu-api-1.4.jar)
3K downloaded  (raven-log4j-2.4.jar)
Downloading: http://www.mygrid.org.uk/maven/repository/net/sf/taverna/t2/ui-api/workbench-api/1.4/workbench-api-1.4.jar
[WARNING] Unable to get resource 'org.springframework:spring-core:jar:2.5.4' from repository vph-repository (http://54.228.194.171:8081/nexus/content/repositories/snapshots/): Error transferring file: Connection refused
Downloading: http://uk.maven.org/maven2//org/springframework/spring-core/2.5.4/spring-core-2.5.4.jar
1613K downloaded  (bcprov-jdk16-140.jar)
9K downloaded  (workbench-api-1.4.jar)
Downloading: http://www.mygrid.org.uk/maven/repository/net/sf/taverna/t2/infrastructure/appconfig/2.4/appconfig-2.4.jar
279K downloaded  (spring-core-2.5.4.jar)
Downloading: http://www.mygrid.org.uk/maven/repository/org/springframework/spring-context/2.5.4/spring-context-2.5.4.jar
[INFO] Unable to find resource 'org.springframework:spring-context:jar:2.5.4' in repository mygrid-repository (http://www.mygrid.org.uk/maven/repository)
Downloading: http://54.228.194.171:8081/nexus/content/repositories/snapshots//org/springframework/spring-context/2.5.4/spring-context-2.5.4.jar
35K downloaded  (appconfig-2.4.jar)
Downloading: http://www.mygrid.org.uk/maven/repository/net/sf/taverna/t2/infrastructure/launcher-api/2.4/launcher-api-2.4.jar
[WARNING] Unable to get resource 'org.springframework:spring-context:jar:2.5.4' from repository vph-repository (http://54.228.194.171:8081/nexus/content/repositories/snapshots/): Error transferring file: Connection refused
Downloading: http://uk.maven.org/maven2//org/springframework/spring-context/2.5.4/spring-context-2.5.4.jar
2K downloaded  (launcher-api-2.4.jar)
458K downloaded  (spring-context-2.5.4.jar)
Downloading: http://www.mygrid.org.uk/maven/repository/net/sf/taverna/t2/infrastructure/prelauncher/2.4/prelauncher-2.4.jar
8K downloaded  (prelauncher-2.4.jar)
Downloading: http://www.mygrid.org.uk/maven/repository/org/jvnet/jaxb2/maven2/maven-jaxb2-plugin-core/0.8.3/maven-jaxb2-plugin-core-0.8.3.pom
[INFO] Unable to find resource 'org.jvnet.jaxb2.maven2:maven-jaxb2-plugin-core:pom:0.8.3' in repository mygrid-repository (http://www.mygrid.org.uk/maven/repository)
Downloading: http://uk.maven.org/maven2/org/jvnet/jaxb2/maven2/maven-jaxb2-plugin-core/0.8.3/maven-jaxb2-plugin-core-0.8.3.pom
1K downloaded  (maven-jaxb2-plugin-core-0.8.3.pom)
Downloading: http://www.mygrid.org.uk/maven/repository/com/sun/org/apache/xml/internal/resolver/20050927/resolver-20050927.pom
[INFO] Unable to find resource 'com.sun.org.apache.xml.internal:resolver:pom:20050927' in repository mygrid-repository (http://www.mygrid.org.uk/maven/repository)
Downloading: http://www.mygrid.org.uk/maven/repository/com/sun/org/apache/xml/internal/resolver/20050927/resolver-20050927.pom
[INFO] Unable to find resource 'com.sun.org.apache.xml.internal:resolver:pom:20050927' in repository mygrid-repository (http://www.mygrid.org.uk/maven/repository)
Downloading: http://54.228.194.171:8081/nexus/content/repositories/snapshots//com/sun/org/apache/xml/internal/resolver/20050927/resolver-20050927.pom
[WARNING] Unable to get resource 'com.sun.org.apache.xml.internal:resolver:pom:20050927' from repository vph-repository (http://54.228.194.171:8081/nexus/content/repositories/snapshots/): Error transferring file: Connection refused
Downloading: http://uk.maven.org/maven2/com/sun/org/apache/xml/internal/resolver/20050927/resolver-20050927.pom
183b downloaded  (resolver-20050927.pom)
Downloading: http://www.mygrid.org.uk/maven/repository/org/sonatype/plexus/plexus-build-api/0.0.7/plexus-build-api-0.0.7.pom
[INFO] Unable to find resource 'org.sonatype.plexus:plexus-build-api:pom:0.0.7' in repository mygrid-repository (http://www.mygrid.org.uk/maven/repository)
Downloading: http://www.mygrid.org.uk/maven/repository/org/sonatype/plexus/plexus-build-api/0.0.7/plexus-build-api-0.0.7.pom
[INFO] Unable to find resource 'org.sonatype.plexus:plexus-build-api:pom:0.0.7' in repository mygrid-repository (http://www.mygrid.org.uk/maven/repository)
Downloading: http://54.228.194.171:8081/nexus/content/repositories/snapshots//org/sonatype/plexus/plexus-build-api/0.0.7/plexus-build-api-0.0.7.pom
[WARNING] Unable to get resource 'org.sonatype.plexus:plexus-build-api:pom:0.0.7' from repository vph-repository (http://54.228.194.171:8081/nexus/content/repositories/snapshots/): Error transferring file: Connection refused
Downloading: http://uk.maven.org/maven2/org/sonatype/plexus/plexus-build-api/0.0.7/plexus-build-api-0.0.7.pom
3K downloaded  (plexus-build-api-0.0.7.pom)
Downloading: http://www.mygrid.org.uk/maven/repository/org/sonatype/spice/spice-parent/15/spice-parent-15.pom
[INFO] Unable to find resource 'org.sonatype.spice:spice-parent:pom:15' in repository mygrid-repository (http://www.mygrid.org.uk/maven/repository)
Downloading: http://www.mygrid.org.uk/maven/repository/org/sonatype/spice/spice-parent/15/spice-parent-15.pom
[INFO] Unable to find resource 'org.sonatype.spice:spice-parent:pom:15' in repository mygrid-repository (http://www.mygrid.org.uk/maven/repository)
Downloading: http://54.228.194.171:8081/nexus/content/repositories/snapshots//org/sonatype/spice/spice-parent/15/spice-parent-15.pom
[WARNING] Unable to get resource 'org.sonatype.spice:spice-parent:pom:15' from repository vph-repository (http://54.228.194.171:8081/nexus/content/repositories/snapshots/): Error transferring file: Connection refused
Downloading: http://uk.maven.org/maven2/org/sonatype/spice/spice-parent/15/spice-parent-15.pom
8K downloaded  (spice-parent-15.pom)
Downloading: http://www.mygrid.org.uk/maven/repository/org/sonatype/forge/forge-parent/5/forge-parent-5.pom
[INFO] Unable to find resource 'org.sonatype.forge:forge-parent:pom:5' in repository mygrid-repository (http://www.mygrid.org.uk/maven/repository)
Downloading: http://www.mygrid.org.uk/maven/repository/org/sonatype/forge/forge-parent/5/forge-parent-5.pom
[INFO] Unable to find resource 'org.sonatype.forge:forge-parent:pom:5' in repository mygrid-repository (http://www.mygrid.org.uk/maven/repository)
Downloading: http://54.228.194.171:8081/nexus/content/repositories/snapshots//org/sonatype/forge/forge-parent/5/forge-parent-5.pom
[WARNING] Unable to get resource 'org.sonatype.forge:forge-parent:pom:5' from repository vph-repository (http://54.228.194.171:8081/nexus/content/repositories/snapshots/): Error transferring file: Connection refused
Downloading: http://uk.maven.org/maven2/org/sonatype/forge/forge-parent/5/forge-parent-5.pom
8K downloaded  (forge-parent-5.pom)
Downloading: http://www.mygrid.org.uk/maven/repository/junit/junit/4.8.1/junit-4.8.1.pom
[INFO] Unable to find resource 'junit:junit:pom:4.8.1' in repository mygrid-repository (http://www.mygrid.org.uk/maven/repository)
Downloading: http://www.mygrid.org.uk/maven/repository/junit/junit/4.8.1/junit-4.8.1.pom
[INFO] Unable to find resource 'junit:junit:pom:4.8.1' in repository mygrid-repository (http://www.mygrid.org.uk/maven/repository)
Downloading: http://54.228.194.171:8081/nexus/content/repositories/snapshots//junit/junit/4.8.1/junit-4.8.1.pom
[WARNING] Unable to get resource 'junit:junit:pom:4.8.1' from repository vph-repository (http://54.228.194.171:8081/nexus/content/repositories/snapshots/): Error transferring file: Connection refused
Downloading: http://uk.maven.org/maven2/junit/junit/4.8.1/junit-4.8.1.pom
949b downloaded  (junit-4.8.1.pom)
Downloading: http://www.mygrid.org.uk/maven/repository/br/com/ingenieux/maven/annomojo/org.jfrog.maven.maven-plugin-anno/1.4.1/org.jfrog.maven.maven-plugin-anno-1.4.1.pom
[INFO] Unable to find resource 'br.com.ingenieux.maven.annomojo:org.jfrog.maven.maven-plugin-anno:pom:1.4.1' in repository mygrid-repository (http://www.mygrid.org.uk/maven/repository)
Downloading: http://www.mygrid.org.uk/maven/repository/br/com/ingenieux/maven/annomojo/org.jfrog.maven.maven-plugin-anno/1.4.1/org.jfrog.maven.maven-plugin-anno-1.4.1.pom
[INFO] Unable to find resource 'br.com.ingenieux.maven.annomojo:org.jfrog.maven.maven-plugin-anno:pom:1.4.1' in repository mygrid-repository (http://www.mygrid.org.uk/maven/repository)
Downloading: http://54.228.194.171:8081/nexus/content/repositories/snapshots//br/com/ingenieux/maven/annomojo/org.jfrog.maven.maven-plugin-anno/1.4.1/org.jfrog.maven.maven-plugin-anno-1.4.1.pom
[WARNING] Unable to get resource 'br.com.ingenieux.maven.annomojo:org.jfrog.maven.maven-plugin-anno:pom:1.4.1' from repository vph-repository (http://54.228.194.171:8081/nexus/content/repositories/snapshots/): Error transferring file: Connection refused
Downloading: http://uk.maven.org/maven2/br/com/ingenieux/maven/annomojo/org.jfrog.maven.maven-plugin-anno/1.4.1/org.jfrog.maven.maven-plugin-anno-1.4.1.pom
1K downloaded  (org.jfrog.maven.maven-plugin-anno-1.4.1.pom)
Downloading: http://www.mygrid.org.uk/maven/repository/br/com/ingenieux/maven/annomojo/org.jfrog.maven.maven-plugin-anno-parent/1.4.1/org.jfrog.maven.maven-plugin-anno-parent-1.4.1.pom
[INFO] Unable to find resource 'br.com.ingenieux.maven.annomojo:org.jfrog.maven.maven-plugin-anno-parent:pom:1.4.1' in repository mygrid-repository (http://www.mygrid.org.uk/maven/repository)
Downloading: http://www.mygrid.org.uk/maven/repository/br/com/ingenieux/maven/annomojo/org.jfrog.maven.maven-plugin-anno-parent/1.4.1/org.jfrog.maven.maven-plugin-anno-parent-1.4.1.pom
[INFO] Unable to find resource 'br.com.ingenieux.maven.annomojo:org.jfrog.maven.maven-plugin-anno-parent:pom:1.4.1' in repository mygrid-repository (http://www.mygrid.org.uk/maven/repository)
Downloading: http://54.228.194.171:8081/nexus/content/repositories/snapshots//br/com/ingenieux/maven/annomojo/org.jfrog.maven.maven-plugin-anno-parent/1.4.1/org.jfrog.maven.maven-plugin-anno-parent-1.4.1.pom
[WARNING] Unable to get resource 'br.com.ingenieux.maven.annomojo:org.jfrog.maven.maven-plugin-anno-parent:pom:1.4.1' from repository vph-repository (http://54.228.194.171:8081/nexus/content/repositories/snapshots/): Error transferring file: Connection refused
Downloading: http://uk.maven.org/maven2/br/com/ingenieux/maven/annomojo/org.jfrog.maven.maven-plugin-anno-parent/1.4.1/org.jfrog.maven.maven-plugin-anno-parent-1.4.1.pom
7K downloaded  (org.jfrog.maven.maven-plugin-anno-parent-1.4.1.pom)
Downloading: http://www.mygrid.org.uk/maven/repository/org/jvnet/jaxb2/maven2/maven-jaxb22-plugin/0.8.3/maven-jaxb22-plugin-0.8.3.pom
[INFO] Unable to find resource 'org.jvnet.jaxb2.maven2:maven-jaxb22-plugin:pom:0.8.3' in repository mygrid-repository (http://www.mygrid.org.uk/maven/repository)
Downloading: http://uk.maven.org/maven2/org/jvnet/jaxb2/maven2/maven-jaxb22-plugin/0.8.3/maven-jaxb22-plugin-0.8.3.pom
2K downloaded  (maven-jaxb22-plugin-0.8.3.pom)
Downloading: http://www.mygrid.org.uk/maven/repository/com/sun/xml/bind/jaxb-impl/2.2.6/jaxb-impl-2.2.6.pom
[INFO] Unable to find resource 'com.sun.xml.bind:jaxb-impl:pom:2.2.6' in repository mygrid-repository (http://www.mygrid.org.uk/maven/repository)
Downloading: http://www.mygrid.org.uk/maven/repository/com/sun/xml/bind/jaxb-impl/2.2.6/jaxb-impl-2.2.6.pom
[INFO] Unable to find resource 'com.sun.xml.bind:jaxb-impl:pom:2.2.6' in repository mygrid-repository (http://www.mygrid.org.uk/maven/repository)
Downloading: http://54.228.194.171:8081/nexus/content/repositories/snapshots//com/sun/xml/bind/jaxb-impl/2.2.6/jaxb-impl-2.2.6.pom
[WARNING] Unable to get resource 'com.sun.xml.bind:jaxb-impl:pom:2.2.6' from repository vph-repository (http://54.228.194.171:8081/nexus/content/repositories/snapshots/): Error transferring file: Connection refused
Downloading: http://uk.maven.org/maven2/com/sun/xml/bind/jaxb-impl/2.2.6/jaxb-impl-2.2.6.pom
4K downloaded  (jaxb-impl-2.2.6.pom)
Downloading: https://maven.java.net/content/repositories/releases//net/java/jvnet-parent/1/jvnet-parent-1.pom
4K downloaded  (jvnet-parent-1.pom)
Downloading: http://www.mygrid.org.uk/maven/repository/com/sun/xml/bind/jaxb-xjc/2.2.6/jaxb-xjc-2.2.6.pom
[INFO] Unable to find resource 'com.sun.xml.bind:jaxb-xjc:pom:2.2.6' in repository mygrid-repository (http://www.mygrid.org.uk/maven/repository)
Downloading: http://www.mygrid.org.uk/maven/repository/com/sun/xml/bind/jaxb-xjc/2.2.6/jaxb-xjc-2.2.6.pom
[INFO] Unable to find resource 'com.sun.xml.bind:jaxb-xjc:pom:2.2.6' in repository mygrid-repository (http://www.mygrid.org.uk/maven/repository)
Downloading: http://54.228.194.171:8081/nexus/content/repositories/snapshots//com/sun/xml/bind/jaxb-xjc/2.2.6/jaxb-xjc-2.2.6.pom
[WARNING] Unable to get resource 'com.sun.xml.bind:jaxb-xjc:pom:2.2.6' from repository vph-repository (http://54.228.194.171:8081/nexus/content/repositories/snapshots/): Error transferring file: Connection refused
Downloading: http://uk.maven.org/maven2/com/sun/xml/bind/jaxb-xjc/2.2.6/jaxb-xjc-2.2.6.pom
4K downloaded  (jaxb-xjc-2.2.6.pom)
Downloading: http://www.mygrid.org.uk/maven/repository/javax/xml/bind/jaxb-api/2.2.6/jaxb-api-2.2.6.pom
[INFO] Unable to find resource 'javax.xml.bind:jaxb-api:pom:2.2.6' in repository mygrid-repository (http://www.mygrid.org.uk/maven/repository)
Downloading: http://uk.maven.org/maven2/javax/xml/bind/jaxb-api/2.2.6/jaxb-api-2.2.6.pom
7K downloaded  (jaxb-api-2.2.6.pom)
Downloading: http://www.mygrid.org.uk/maven/repository/org/codehaus/plexus/plexus-utils/1.5.15/plexus-utils-1.5.15.jar
Downloading: http://www.mygrid.org.uk/maven/repository/br/com/ingenieux/maven/annomojo/org.jfrog.maven.maven-plugin-anno/1.4.1/org.jfrog.maven.maven-plugin-anno-1.4.1.jar
Downloading: http://www.mygrid.org.uk/maven/repository/org/sonatype/plexus/plexus-build-api/0.0.7/plexus-build-api-0.0.7.jar
Downloading: http://www.mygrid.org.uk/maven/repository/com/sun/xml/bind/jaxb-impl/2.2.6/jaxb-impl-2.2.6.jar
[INFO] Unable to find resource 'org.sonatype.plexus:plexus-build-api:jar:0.0.7' in repository mygrid-repository (http://www.mygrid.org.uk/maven/repository)
[INFO] Unable to find resource 'com.sun.xml.bind:jaxb-impl:jar:2.2.6' in repository mygrid-repository (http://www.mygrid.org.uk/maven/repository)
Downloading: http://www.mygrid.org.uk/maven/repository/javax/xml/bind/jaxb-api/2.2.6/jaxb-api-2.2.6.jar
Downloading: http://uk.maven.org/maven2/com/sun/xml/bind/jaxb-impl/2.2.6/jaxb-impl-2.2.6.jar
[INFO] Unable to find resource 'org.codehaus.plexus:plexus-utils:jar:1.5.15' in repository mygrid-repository (http://www.mygrid.org.uk/maven/repository)
Downloading: http://www.mygrid.org.uk/maven/repository/org/sonatype/plexus/plexus-build-api/0.0.7/plexus-build-api-0.0.7.jar
[INFO] Unable to find resource 'org.sonatype.plexus:plexus-build-api:jar:0.0.7' in repository mygrid-repository (http://www.mygrid.org.uk/maven/repository)
Downloading: http://uk.maven.org/maven2/org/codehaus/plexus/plexus-utils/1.5.15/plexus-utils-1.5.15.jar
Downloading: http://54.228.194.171:8081/nexus/content/repositories/snapshots//org/sonatype/plexus/plexus-build-api/0.0.7/plexus-build-api-0.0.7.jar
[INFO] Unable to find resource 'br.com.ingenieux.maven.annomojo:org.jfrog.maven.maven-plugin-anno:jar:1.4.1' in repository mygrid-repository (http://www.mygrid.org.uk/maven/repository)
Downloading: http://www.mygrid.org.uk/maven/repository/br/com/ingenieux/maven/annomojo/org.jfrog.maven.maven-plugin-anno/1.4.1/org.jfrog.maven.maven-plugin-anno-1.4.1.jar
[INFO] Unable to find resource 'javax.xml.bind:jaxb-api:jar:2.2.6' in repository mygrid-repository (http://www.mygrid.org.uk/maven/repository)
[INFO] Unable to find resource 'br.com.ingenieux.maven.annomojo:org.jfrog.maven.maven-plugin-anno:jar:1.4.1' in repository mygrid-repository (http://www.mygrid.org.uk/maven/repository)
[WARNING] Unable to get resource 'org.sonatype.plexus:plexus-build-api:jar:0.0.7' from repository vph-repository (http://54.228.194.171:8081/nexus/content/repositories/snapshots/): Error transferring file: Connection refused
Downloading: http://uk.maven.org/maven2/org/sonatype/plexus/plexus-build-api/0.0.7/plexus-build-api-0.0.7.jar
Downloading: http://uk.maven.org/maven2/javax/xml/bind/jaxb-api/2.2.6/jaxb-api-2.2.6.jar
8K downloaded  (plexus-build-api-0.0.7.jar)
Downloading: http://54.228.194.171:8081/nexus/content/repositories/snapshots//br/com/ingenieux/maven/annomojo/org.jfrog.maven.maven-plugin-anno/1.4.1/org.jfrog.maven.maven-plugin-anno-1.4.1.jar
1086K downloaded  (jaxb-impl-2.2.6.jar)
97K downloaded  (jaxb-api-2.2.6.jar)
Downloading: http://www.mygrid.org.uk/maven/repository/com/sun/org/apache/xml/internal/resolver/20050927/resolver-20050927.jar
[WARNING] Unable to get resource 'br.com.ingenieux.maven.annomojo:org.jfrog.maven.maven-plugin-anno:jar:1.4.1' from repository vph-repository (http://54.228.194.171:8081/nexus/content/repositories/snapshots/): Error transferring file: Connection refused
Downloading: http://uk.maven.org/maven2/br/com/ingenieux/maven/annomojo/org.jfrog.maven.maven-plugin-anno/1.4.1/org.jfrog.maven.maven-plugin-anno-1.4.1.jar
[INFO] Unable to find resource 'com.sun.org.apache.xml.internal:resolver:jar:20050927' in repository mygrid-repository (http://www.mygrid.org.uk/maven/repository)
11K downloaded  (org.jfrog.maven.maven-plugin-anno-1.4.1.jar)
Downloading: http://www.mygrid.org.uk/maven/repository/org/jvnet/jaxb2/maven2/maven-jaxb2-plugin-core/0.8.3/maven-jaxb2-plugin-core-0.8.3.jar
Downloading: http://www.mygrid.org.uk/maven/repository/com/sun/org/apache/xml/internal/resolver/20050927/resolver-20050927.jar
222K downloaded  (plexus-utils-1.5.15.jar)
[INFO] Unable to find resource 'org.jvnet.jaxb2.maven2:maven-jaxb2-plugin-core:jar:0.8.3' in repository mygrid-repository (http://www.mygrid.org.uk/maven/repository)
Downloading: http://www.mygrid.org.uk/maven/repository/com/sun/xml/bind/jaxb-xjc/2.2.6/jaxb-xjc-2.2.6.jar
Downloading: http://uk.maven.org/maven2/org/jvnet/jaxb2/maven2/maven-jaxb2-plugin-core/0.8.3/maven-jaxb2-plugin-core-0.8.3.jar
[INFO] Unable to find resource 'com.sun.xml.bind:jaxb-xjc:jar:2.2.6' in repository mygrid-repository (http://www.mygrid.org.uk/maven/repository)
[INFO] Unable to find resource 'com.sun.org.apache.xml.internal:resolver:jar:20050927' in repository mygrid-repository (http://www.mygrid.org.uk/maven/repository)
Downloading: http://uk.maven.org/maven2/com/sun/xml/bind/jaxb-xjc/2.2.6/jaxb-xjc-2.2.6.jar
Downloading: http://54.228.194.171:8081/nexus/content/repositories/snapshots//com/sun/org/apache/xml/internal/resolver/20050927/resolver-20050927.jar
[WARNING] Unable to get resource 'com.sun.org.apache.xml.internal:resolver:jar:20050927' from repository vph-repository (http://54.228.194.171:8081/nexus/content/repositories/snapshots/): Error transferring file: Connection refused
Downloading: http://uk.maven.org/maven2/com/sun/org/apache/xml/internal/resolver/20050927/resolver-20050927.jar
44K downloaded  (maven-jaxb2-plugin-core-0.8.3.jar)
66K downloaded  (resolver-20050927.jar)
Downloading: http://www.mygrid.org.uk/maven/repository/org/jvnet/jaxb2/maven2/maven-jaxb22-plugin/0.8.3/maven-jaxb22-plugin-0.8.3.jar
[INFO] Unable to find resource 'org.jvnet.jaxb2.maven2:maven-jaxb22-plugin:jar:0.8.3' in repository mygrid-repository (http://www.mygrid.org.uk/maven/repository)
Downloading: http://uk.maven.org/maven2/org/jvnet/jaxb2/maven2/maven-jaxb22-plugin/0.8.3/maven-jaxb22-plugin-0.8.3.jar
14K downloaded  (maven-jaxb22-plugin-0.8.3.jar)
2029K downloaded  (jaxb-xjc-2.2.6.jar)
[INFO] [jaxb2:generate {execution: default}]
Downloading: http://www.mygrid.org.uk/maven/repository/org/codehaus/plexus/plexus-utils/1.5.6/plexus-utils-1.5.6.pom
[INFO] Unable to find resource 'org.codehaus.plexus:plexus-utils:pom:1.5.6' in repository mygrid-repository (http://www.mygrid.org.uk/maven/repository)
Downloading: http://uk.maven.org/maven2/org/codehaus/plexus/plexus-utils/1.5.6/plexus-utils-1.5.6.pom
5K downloaded  (plexus-utils-1.5.6.pom)
Downloading: http://www.mygrid.org.uk/maven/repository/org/codehaus/plexus/plexus/1.0.12/plexus-1.0.12.pom
[INFO] Unable to find resource 'org.codehaus.plexus:plexus:pom:1.0.12' in repository mygrid-repository (http://www.mygrid.org.uk/maven/repository)
Downloading: http://uk.maven.org/maven2/org/codehaus/plexus/plexus/1.0.12/plexus-1.0.12.pom
9K downloaded  (plexus-1.0.12.pom)
Downloading: http://www.mygrid.org.uk/maven/repository/org/apache/maven/shared/maven-filtering/1.0-beta-2/maven-filtering-1.0-beta-2.pom
[INFO] Unable to find resource 'org.apache.maven.shared:maven-filtering:pom:1.0-beta-2' in repository mygrid-repository (http://www.mygrid.org.uk/maven/repository)
Downloading: http://uk.maven.org/maven2/org/apache/maven/shared/maven-filtering/1.0-beta-2/maven-filtering-1.0-beta-2.pom
3K downloaded  (maven-filtering-1.0-beta-2.pom)
Downloading: http://www.mygrid.org.uk/maven/repository/org/apache/maven/shared/maven-shared-components/10/maven-shared-components-10.pom
[INFO] Unable to find resource 'org.apache.maven.shared:maven-shared-components:pom:10' in repository mygrid-repository (http://www.mygrid.org.uk/maven/repository)
Downloading: http://uk.maven.org/maven2/org/apache/maven/shared/maven-shared-components/10/maven-shared-components-10.pom
8K downloaded  (maven-shared-components-10.pom)
Downloading: http://www.mygrid.org.uk/maven/repository/org/apache/maven/maven-core/2.0.6/maven-core-2.0.6.pom
[INFO] Unable to find resource 'org.apache.maven:maven-core:pom:2.0.6' in repository mygrid-repository (http://www.mygrid.org.uk/maven/repository)
Downloading: http://www.mygrid.org.uk/maven/repository/org/apache/maven/maven-core/2.0.6/maven-core-2.0.6.pom
[INFO] Unable to find resource 'org.apache.maven:maven-core:pom:2.0.6' in repository mygrid-repository (http://www.mygrid.org.uk/maven/repository)
Downloading: http://54.228.194.171:8081/nexus/content/repositories/snapshots//org/apache/maven/maven-core/2.0.6/maven-core-2.0.6.pom
[WARNING] Unable to get resource 'org.apache.maven:maven-core:pom:2.0.6' from repository vph-repository (http://54.228.194.171:8081/nexus/content/repositories/snapshots/): Error transferring file: Connection refused
Downloading: http://uk.maven.org/maven2/org/apache/maven/maven-core/2.0.6/maven-core-2.0.6.pom
6K downloaded  (maven-core-2.0.6.pom)
Downloading: http://www.mygrid.org.uk/maven/repository/org/apache/maven/wagon/wagon-file/1.0-beta-2/wagon-file-1.0-beta-2.pom
[INFO] Unable to find resource 'org.apache.maven.wagon:wagon-file:pom:1.0-beta-2' in repository mygrid-repository (http://www.mygrid.org.uk/maven/repository)
Downloading: http://www.mygrid.org.uk/maven/repository/org/apache/maven/wagon/wagon-file/1.0-beta-2/wagon-file-1.0-beta-2.pom
[INFO] Unable to find resource 'org.apache.maven.wagon:wagon-file:pom:1.0-beta-2' in repository mygrid-repository (http://www.mygrid.org.uk/maven/repository)
Downloading: http://54.228.194.171:8081/nexus/content/repositories/snapshots//org/apache/maven/wagon/wagon-file/1.0-beta-2/wagon-file-1.0-beta-2.pom
[WARNING] Unable to get resource 'org.apache.maven.wagon:wagon-file:pom:1.0-beta-2' from repository vph-repository (http://54.228.194.171:8081/nexus/content/repositories/snapshots/): Error transferring file: Connection refused
Downloading: http://uk.maven.org/maven2/org/apache/maven/wagon/wagon-file/1.0-beta-2/wagon-file-1.0-beta-2.pom
637b downloaded  (wagon-file-1.0-beta-2.pom)
Downloading: http://www.mygrid.org.uk/maven/repository/org/apache/maven/wagon/wagon-providers/1.0-beta-2/wagon-providers-1.0-beta-2.pom
[INFO] Unable to find resource 'org.apache.maven.wagon:wagon-providers:pom:1.0-beta-2' in repository mygrid-repository (http://www.mygrid.org.uk/maven/repository)
Downloading: http://www.mygrid.org.uk/maven/repository/org/apache/maven/wagon/wagon-providers/1.0-beta-2/wagon-providers-1.0-beta-2.pom
[INFO] Unable to find resource 'org.apache.maven.wagon:wagon-providers:pom:1.0-beta-2' in repository mygrid-repository (http://www.mygrid.org.uk/maven/repository)
Downloading: http://54.228.194.171:8081/nexus/content/repositories/snapshots//org/apache/maven/wagon/wagon-providers/1.0-beta-2/wagon-providers-1.0-beta-2.pom
[WARNING] Unable to get resource 'org.apache.maven.wagon:wagon-providers:pom:1.0-beta-2' from repository vph-repository (http://54.228.194.171:8081/nexus/content/repositories/snapshots/): Error transferring file: Connection refused
Downloading: http://uk.maven.org/maven2/org/apache/maven/wagon/wagon-providers/1.0-beta-2/wagon-providers-1.0-beta-2.pom
1K downloaded  (wagon-providers-1.0-beta-2.pom)
Downloading: http://www.mygrid.org.uk/maven/repository/org/apache/maven/maven-plugin-parameter-documenter/2.0.6/maven-plugin-parameter-documenter-2.0.6.pom
[INFO] Unable to find resource 'org.apache.maven:maven-plugin-parameter-documenter:pom:2.0.6' in repository mygrid-repository (http://www.mygrid.org.uk/maven/repository)
Downloading: http://www.mygrid.org.uk/maven/repository/org/apache/maven/maven-plugin-parameter-documenter/2.0.6/maven-plugin-parameter-documenter-2.0.6.pom
[INFO] Unable to find resource 'org.apache.maven:maven-plugin-parameter-documenter:pom:2.0.6' in repository mygrid-repository (http://www.mygrid.org.uk/maven/repository)
Downloading: http://54.228.194.171:8081/nexus/content/repositories/snapshots//org/apache/maven/maven-plugin-parameter-documenter/2.0.6/maven-plugin-parameter-documenter-2.0.6.pom
[WARNING] Unable to get resource 'org.apache.maven:maven-plugin-parameter-documenter:pom:2.0.6' from repository vph-repository (http://54.228.194.171:8081/nexus/content/repositories/snapshots/): Error transferring file: Connection refused
Downloading: http://uk.maven.org/maven2/org/apache/maven/maven-plugin-parameter-documenter/2.0.6/maven-plugin-parameter-documenter-2.0.6.pom
1K downloaded  (maven-plugin-parameter-documenter-2.0.6.pom)
Downloading: http://www.mygrid.org.uk/maven/repository/org/apache/maven/wagon/wagon-http-lightweight/1.0-beta-2/wagon-http-lightweight-1.0-beta-2.pom
[INFO] Unable to find resource 'org.apache.maven.wagon:wagon-http-lightweight:pom:1.0-beta-2' in repository mygrid-repository (http://www.mygrid.org.uk/maven/repository)
Downloading: http://www.mygrid.org.uk/maven/repository/org/apache/maven/wagon/wagon-http-lightweight/1.0-beta-2/wagon-http-lightweight-1.0-beta-2.pom
[INFO] Unable to find resource 'org.apache.maven.wagon:wagon-http-lightweight:pom:1.0-beta-2' in repository mygrid-repository (http://www.mygrid.org.uk/maven/repository)
Downloading: http://54.228.194.171:8081/nexus/content/repositories/snapshots//org/apache/maven/wagon/wagon-http-lightweight/1.0-beta-2/wagon-http-lightweight-1.0-beta-2.pom
[WARNING] Unable to get resource 'org.apache.maven.wagon:wagon-http-lightweight:pom:1.0-beta-2' from repository vph-repository (http://54.228.194.171:8081/nexus/content/repositories/snapshots/): Error transferring file: Connection refused
Downloading: http://uk.maven.org/maven2/org/apache/maven/wagon/wagon-http-lightweight/1.0-beta-2/wagon-http-lightweight-1.0-beta-2.pom
1K downloaded  (wagon-http-lightweight-1.0-beta-2.pom)
Downloading: http://www.mygrid.org.uk/maven/repository/org/apache/maven/wagon/wagon-http-shared/1.0-beta-2/wagon-http-shared-1.0-beta-2.pom
[INFO] Unable to find resource 'org.apache.maven.wagon:wagon-http-shared:pom:1.0-beta-2' in repository mygrid-repository (http://www.mygrid.org.uk/maven/repository)
Downloading: http://www.mygrid.org.uk/maven/repository/org/apache/maven/wagon/wagon-http-shared/1.0-beta-2/wagon-http-shared-1.0-beta-2.pom
[INFO] Unable to find resource 'org.apache.maven.wagon:wagon-http-shared:pom:1.0-beta-2' in repository mygrid-repository (http://www.mygrid.org.uk/maven/repository)
Downloading: http://54.228.194.171:8081/nexus/content/repositories/snapshots//org/apache/maven/wagon/wagon-http-shared/1.0-beta-2/wagon-http-shared-1.0-beta-2.pom
[WARNING] Unable to get resource 'org.apache.maven.wagon:wagon-http-shared:pom:1.0-beta-2' from repository vph-repository (http://54.228.194.171:8081/nexus/content/repositories/snapshots/): Error transferring file: Connection refused
Downloading: http://uk.maven.org/maven2/org/apache/maven/wagon/wagon-http-shared/1.0-beta-2/wagon-http-shared-1.0-beta-2.pom
845b downloaded  (wagon-http-shared-1.0-beta-2.pom)
Downloading: http://www.mygrid.org.uk/maven/repository/jtidy/jtidy/4aug2000r7-dev/jtidy-4aug2000r7-dev.pom
[INFO] Unable to find resource 'jtidy:jtidy:pom:4aug2000r7-dev' in repository mygrid-repository (http://www.mygrid.org.uk/maven/repository)
Downloading: http://www.mygrid.org.uk/maven/repository/jtidy/jtidy/4aug2000r7-dev/jtidy-4aug2000r7-dev.pom
[INFO] Unable to find resource 'jtidy:jtidy:pom:4aug2000r7-dev' in repository mygrid-repository (http://www.mygrid.org.uk/maven/repository)
Downloading: http://54.228.194.171:8081/nexus/content/repositories/snapshots//jtidy/jtidy/4aug2000r7-dev/jtidy-4aug2000r7-dev.pom
[WARNING] Unable to get resource 'jtidy:jtidy:pom:4aug2000r7-dev' from repository vph-repository (http://54.228.194.171:8081/nexus/content/repositories/snapshots/): Error transferring file: Connection refused
Downloading: http://uk.maven.org/maven2/jtidy/jtidy/4aug2000r7-dev/jtidy-4aug2000r7-dev.pom
1K downloaded  (jtidy-4aug2000r7-dev.pom)
Downloading: http://www.mygrid.org.uk/maven/repository/xml-apis/xml-apis/1.0.b2/xml-apis-1.0.b2.pom
[INFO] Unable to find resource 'xml-apis:xml-apis:pom:1.0.b2' in repository mygrid-repository (http://www.mygrid.org.uk/maven/repository)
Downloading: http://www.mygrid.org.uk/maven/repository/xml-apis/xml-apis/1.0.b2/xml-apis-1.0.b2.pom
[INFO] Unable to find resource 'xml-apis:xml-apis:pom:1.0.b2' in repository mygrid-repository (http://www.mygrid.org.uk/maven/repository)
Downloading: http://54.228.194.171:8081/nexus/content/repositories/snapshots//xml-apis/xml-apis/1.0.b2/xml-apis-1.0.b2.pom
[WARNING] Unable to get resource 'xml-apis:xml-apis:pom:1.0.b2' from repository vph-repository (http://54.228.194.171:8081/nexus/content/repositories/snapshots/): Error transferring file: Connection refused
Downloading: http://uk.maven.org/maven2/xml-apis/xml-apis/1.0.b2/xml-apis-1.0.b2.pom
2K downloaded  (xml-apis-1.0.b2.pom)
Downloading: http://www.mygrid.org.uk/maven/repository/org/apache/maven/reporting/maven-reporting-api/2.0.6/maven-reporting-api-2.0.6.pom
[INFO] Unable to find resource 'org.apache.maven.reporting:maven-reporting-api:pom:2.0.6' in repository mygrid-repository (http://www.mygrid.org.uk/maven/repository)
Downloading: http://www.mygrid.org.uk/maven/repository/org/apache/maven/reporting/maven-reporting-api/2.0.6/maven-reporting-api-2.0.6.pom
[INFO] Unable to find resource 'org.apache.maven.reporting:maven-reporting-api:pom:2.0.6' in repository mygrid-repository (http://www.mygrid.org.uk/maven/repository)
Downloading: http://54.228.194.171:8081/nexus/content/repositories/snapshots//org/apache/maven/reporting/maven-reporting-api/2.0.6/maven-reporting-api-2.0.6.pom
[WARNING] Unable to get resource 'org.apache.maven.reporting:maven-reporting-api:pom:2.0.6' from repository vph-repository (http://54.228.194.171:8081/nexus/content/repositories/snapshots/): Error transferring file: Connection refused
Downloading: http://uk.maven.org/maven2/org/apache/maven/reporting/maven-reporting-api/2.0.6/maven-reporting-api-2.0.6.pom
1K downloaded  (maven-reporting-api-2.0.6.pom)
Downloading: http://www.mygrid.org.uk/maven/repository/org/apache/maven/reporting/maven-reporting/2.0.6/maven-reporting-2.0.6.pom
[INFO] Unable to find resource 'org.apache.maven.reporting:maven-reporting:pom:2.0.6' in repository mygrid-repository (http://www.mygrid.org.uk/maven/repository)
Downloading: http://www.mygrid.org.uk/maven/repository/org/apache/maven/reporting/maven-reporting/2.0.6/maven-reporting-2.0.6.pom
[INFO] Unable to find resource 'org.apache.maven.reporting:maven-reporting:pom:2.0.6' in repository mygrid-repository (http://www.mygrid.org.uk/maven/repository)
Downloading: http://54.228.194.171:8081/nexus/content/repositories/snapshots//org/apache/maven/reporting/maven-reporting/2.0.6/maven-reporting-2.0.6.pom
[WARNING] Unable to get resource 'org.apache.maven.reporting:maven-reporting:pom:2.0.6' from repository vph-repository (http://54.228.194.171:8081/nexus/content/repositories/snapshots/): Error transferring file: Connection refused
Downloading: http://uk.maven.org/maven2/org/apache/maven/reporting/maven-reporting/2.0.6/maven-reporting-2.0.6.pom
1K downloaded  (maven-reporting-2.0.6.pom)
Downloading: http://www.mygrid.org.uk/maven/repository/org/apache/maven/maven-error-diagnostics/2.0.6/maven-error-diagnostics-2.0.6.pom
[INFO] Unable to find resource 'org.apache.maven:maven-error-diagnostics:pom:2.0.6' in repository mygrid-repository (http://www.mygrid.org.uk/maven/repository)
Downloading: http://www.mygrid.org.uk/maven/repository/org/apache/maven/maven-error-diagnostics/2.0.6/maven-error-diagnostics-2.0.6.pom
[INFO] Unable to find resource 'org.apache.maven:maven-error-diagnostics:pom:2.0.6' in repository mygrid-repository (http://www.mygrid.org.uk/maven/repository)
Downloading: http://54.228.194.171:8081/nexus/content/repositories/snapshots//org/apache/maven/maven-error-diagnostics/2.0.6/maven-error-diagnostics-2.0.6.pom
[WARNING] Unable to get resource 'org.apache.maven:maven-error-diagnostics:pom:2.0.6' from repository vph-repository (http://54.228.194.171:8081/nexus/content/repositories/snapshots/): Error transferring file: Connection refused
Downloading: http://uk.maven.org/maven2/org/apache/maven/maven-error-diagnostics/2.0.6/maven-error-diagnostics-2.0.6.pom
1K downloaded  (maven-error-diagnostics-2.0.6.pom)
Downloading: http://www.mygrid.org.uk/maven/repository/commons-cli/commons-cli/1.0/commons-cli-1.0.pom
[INFO] Unable to find resource 'commons-cli:commons-cli:pom:1.0' in repository mygrid-repository (http://www.mygrid.org.uk/maven/repository)
Downloading: http://www.mygrid.org.uk/maven/repository/commons-cli/commons-cli/1.0/commons-cli-1.0.pom
[INFO] Unable to find resource 'commons-cli:commons-cli:pom:1.0' in repository mygrid-repository (http://www.mygrid.org.uk/maven/repository)
Downloading: http://54.228.194.171:8081/nexus/content/repositories/snapshots//commons-cli/commons-cli/1.0/commons-cli-1.0.pom
[WARNING] Unable to get resource 'commons-cli:commons-cli:pom:1.0' from repository vph-repository (http://54.228.194.171:8081/nexus/content/repositories/snapshots/): Error transferring file: Connection refused
Downloading: http://uk.maven.org/maven2/commons-cli/commons-cli/1.0/commons-cli-1.0.pom
2K downloaded  (commons-cli-1.0.pom)
Downloading: http://www.mygrid.org.uk/maven/repository/org/apache/maven/wagon/wagon-ssh-external/1.0-beta-2/wagon-ssh-external-1.0-beta-2.pom
[INFO] Unable to find resource 'org.apache.maven.wagon:wagon-ssh-external:pom:1.0-beta-2' in repository mygrid-repository (http://www.mygrid.org.uk/maven/repository)
Downloading: http://www.mygrid.org.uk/maven/repository/org/apache/maven/wagon/wagon-ssh-external/1.0-beta-2/wagon-ssh-external-1.0-beta-2.pom
[INFO] Unable to find resource 'org.apache.maven.wagon:wagon-ssh-external:pom:1.0-beta-2' in repository mygrid-repository (http://www.mygrid.org.uk/maven/repository)
Downloading: http://54.228.194.171:8081/nexus/content/repositories/snapshots//org/apache/maven/wagon/wagon-ssh-external/1.0-beta-2/wagon-ssh-external-1.0-beta-2.pom
[WARNING] Unable to get resource 'org.apache.maven.wagon:wagon-ssh-external:pom:1.0-beta-2' from repository vph-repository (http://54.228.194.171:8081/nexus/content/repositories/snapshots/): Error transferring file: Connection refused
Downloading: http://uk.maven.org/maven2/org/apache/maven/wagon/wagon-ssh-external/1.0-beta-2/wagon-ssh-external-1.0-beta-2.pom
1K downloaded  (wagon-ssh-external-1.0-beta-2.pom)
Downloading: http://www.mygrid.org.uk/maven/repository/org/apache/maven/wagon/wagon-ssh-common/1.0-beta-2/wagon-ssh-common-1.0-beta-2.pom
[INFO] Unable to find resource 'org.apache.maven.wagon:wagon-ssh-common:pom:1.0-beta-2' in repository mygrid-repository (http://www.mygrid.org.uk/maven/repository)
Downloading: http://www.mygrid.org.uk/maven/repository/org/apache/maven/wagon/wagon-ssh-common/1.0-beta-2/wagon-ssh-common-1.0-beta-2.pom
[INFO] Unable to find resource 'org.apache.maven.wagon:wagon-ssh-common:pom:1.0-beta-2' in repository mygrid-repository (http://www.mygrid.org.uk/maven/repository)
Downloading: http://54.228.194.171:8081/nexus/content/repositories/snapshots//org/apache/maven/wagon/wagon-ssh-common/1.0-beta-2/wagon-ssh-common-1.0-beta-2.pom
[WARNING] Unable to get resource 'org.apache.maven.wagon:wagon-ssh-common:pom:1.0-beta-2' from repository vph-repository (http://54.228.194.171:8081/nexus/content/repositories/snapshots/): Error transferring file: Connection refused
Downloading: http://uk.maven.org/maven2/org/apache/maven/wagon/wagon-ssh-common/1.0-beta-2/wagon-ssh-common-1.0-beta-2.pom
851b downloaded  (wagon-ssh-common-1.0-beta-2.pom)
Downloading: http://www.mygrid.org.uk/maven/repository/org/codehaus/plexus/plexus-container-default/1.0-alpha-7/plexus-container-default-1.0-alpha-7.pom
[INFO] Unable to find resource 'org.codehaus.plexus:plexus-container-default:pom:1.0-alpha-7' in repository mygrid-repository (http://www.mygrid.org.uk/maven/repository)
Downloading: http://www.mygrid.org.uk/maven/repository/org/codehaus/plexus/plexus-container-default/1.0-alpha-7/plexus-container-default-1.0-alpha-7.pom
[INFO] Unable to find resource 'org.codehaus.plexus:plexus-container-default:pom:1.0-alpha-7' in repository mygrid-repository (http://www.mygrid.org.uk/maven/repository)
Downloading: http://54.228.194.171:8081/nexus/content/repositories/snapshots//org/codehaus/plexus/plexus-container-default/1.0-alpha-7/plexus-container-default-1.0-alpha-7.pom
[WARNING] Unable to get resource 'org.codehaus.plexus:plexus-container-default:pom:1.0-alpha-7' from repository vph-repository (http://54.228.194.171:8081/nexus/content/repositories/snapshots/): Error transferring file: Connection refused
Downloading: http://uk.maven.org/maven2/org/codehaus/plexus/plexus-container-default/1.0-alpha-7/plexus-container-default-1.0-alpha-7.pom
1K downloaded  (plexus-container-default-1.0-alpha-7.pom)
Downloading: http://www.mygrid.org.uk/maven/repository/plexus/plexus-containers/1.0.2/plexus-containers-1.0.2.pom
[INFO] Unable to find resource 'plexus:plexus-containers:pom:1.0.2' in repository mygrid-repository (http://www.mygrid.org.uk/maven/repository)
Downloading: http://www.mygrid.org.uk/maven/repository/plexus/plexus-containers/1.0.2/plexus-containers-1.0.2.pom
[INFO] Unable to find resource 'plexus:plexus-containers:pom:1.0.2' in repository mygrid-repository (http://www.mygrid.org.uk/maven/repository)
Downloading: http://54.228.194.171:8081/nexus/content/repositories/snapshots//plexus/plexus-containers/1.0.2/plexus-containers-1.0.2.pom
[WARNING] Unable to get resource 'plexus:plexus-containers:pom:1.0.2' from repository vph-repository (http://54.228.194.171:8081/nexus/content/repositories/snapshots/): Error transferring file: Connection refused
Downloading: http://uk.maven.org/maven2/plexus/plexus-containers/1.0.2/plexus-containers-1.0.2.pom
471b downloaded  (plexus-containers-1.0.2.pom)
Downloading: http://www.mygrid.org.uk/maven/repository/plexus/plexus-root/1.0.3/plexus-root-1.0.3.pom
[INFO] Unable to find resource 'plexus:plexus-root:pom:1.0.3' in repository mygrid-repository (http://www.mygrid.org.uk/maven/repository)
Downloading: http://www.mygrid.org.uk/maven/repository/plexus/plexus-root/1.0.3/plexus-root-1.0.3.pom
[INFO] Unable to find resource 'plexus:plexus-root:pom:1.0.3' in repository mygrid-repository (http://www.mygrid.org.uk/maven/repository)
Downloading: http://54.228.194.171:8081/nexus/content/repositories/snapshots//plexus/plexus-root/1.0.3/plexus-root-1.0.3.pom
[WARNING] Unable to get resource 'plexus:plexus-root:pom:1.0.3' from repository vph-repository (http://54.228.194.171:8081/nexus/content/repositories/snapshots/): Error transferring file: Connection refused
Downloading: http://uk.maven.org/maven2/plexus/plexus-root/1.0.3/plexus-root-1.0.3.pom
5K downloaded  (plexus-root-1.0.3.pom)
Downloading: http://www.mygrid.org.uk/maven/repository/plexus/plexus-utils/1.0.2/plexus-utils-1.0.2.pom
[INFO] Unable to find resource 'plexus:plexus-utils:pom:1.0.2' in repository mygrid-repository (http://www.mygrid.org.uk/maven/repository)
Downloading: http://www.mygrid.org.uk/maven/repository/plexus/plexus-utils/1.0.2/plexus-utils-1.0.2.pom
[INFO] Unable to find resource 'plexus:plexus-utils:pom:1.0.2' in repository mygrid-repository (http://www.mygrid.org.uk/maven/repository)
Downloading: http://54.228.194.171:8081/nexus/content/repositories/snapshots//plexus/plexus-utils/1.0.2/plexus-utils-1.0.2.pom
[WARNING] Unable to get resource 'plexus:plexus-utils:pom:1.0.2' from repository vph-repository (http://54.228.194.171:8081/nexus/content/repositories/snapshots/): Error transferring file: Connection refused
Downloading: http://uk.maven.org/maven2/plexus/plexus-utils/1.0.2/plexus-utils-1.0.2.pom
740b downloaded  (plexus-utils-1.0.2.pom)
Downloading: http://www.mygrid.org.uk/maven/repository/org/apache/maven/maven-plugin-descriptor/2.0.6/maven-plugin-descriptor-2.0.6.pom
[INFO] Unable to find resource 'org.apache.maven:maven-plugin-descriptor:pom:2.0.6' in repository mygrid-repository (http://www.mygrid.org.uk/maven/repository)
Downloading: http://www.mygrid.org.uk/maven/repository/org/apache/maven/maven-plugin-descriptor/2.0.6/maven-plugin-descriptor-2.0.6.pom
[INFO] Unable to find resource 'org.apache.maven:maven-plugin-descriptor:pom:2.0.6' in repository mygrid-repository (http://www.mygrid.org.uk/maven/repository)
Downloading: http://54.228.194.171:8081/nexus/content/repositories/snapshots//org/apache/maven/maven-plugin-descriptor/2.0.6/maven-plugin-descriptor-2.0.6.pom
[WARNING] Unable to get resource 'org.apache.maven:maven-plugin-descriptor:pom:2.0.6' from repository vph-repository (http://54.228.194.171:8081/nexus/content/repositories/snapshots/): Error transferring file: Connection refused
Downloading: http://uk.maven.org/maven2/org/apache/maven/maven-plugin-descriptor/2.0.6/maven-plugin-descriptor-2.0.6.pom
1K downloaded  (maven-plugin-descriptor-2.0.6.pom)
Downloading: http://www.mygrid.org.uk/maven/repository/org/apache/maven/maven-monitor/2.0.6/maven-monitor-2.0.6.pom
[INFO] Unable to find resource 'org.apache.maven:maven-monitor:pom:2.0.6' in repository mygrid-repository (http://www.mygrid.org.uk/maven/repository)
Downloading: http://www.mygrid.org.uk/maven/repository/org/apache/maven/maven-monitor/2.0.6/maven-monitor-2.0.6.pom
[INFO] Unable to find resource 'org.apache.maven:maven-monitor:pom:2.0.6' in repository mygrid-repository (http://www.mygrid.org.uk/maven/repository)
Downloading: http://54.228.194.171:8081/nexus/content/repositories/snapshots//org/apache/maven/maven-monitor/2.0.6/maven-monitor-2.0.6.pom
[WARNING] Unable to get resource 'org.apache.maven:maven-monitor:pom:2.0.6' from repository vph-repository (http://54.228.194.171:8081/nexus/content/repositories/snapshots/): Error transferring file: Connection refused
Downloading: http://uk.maven.org/maven2/org/apache/maven/maven-monitor/2.0.6/maven-monitor-2.0.6.pom
1K downloaded  (maven-monitor-2.0.6.pom)
Downloading: http://www.mygrid.org.uk/maven/repository/org/apache/maven/wagon/wagon-ssh/1.0-beta-2/wagon-ssh-1.0-beta-2.pom
[INFO] Unable to find resource 'org.apache.maven.wagon:wagon-ssh:pom:1.0-beta-2' in repository mygrid-repository (http://www.mygrid.org.uk/maven/repository)
Downloading: http://www.mygrid.org.uk/maven/repository/org/apache/maven/wagon/wagon-ssh/1.0-beta-2/wagon-ssh-1.0-beta-2.pom
[INFO] Unable to find resource 'org.apache.maven.wagon:wagon-ssh:pom:1.0-beta-2' in repository mygrid-repository (http://www.mygrid.org.uk/maven/repository)
Downloading: http://54.228.194.171:8081/nexus/content/repositories/snapshots//org/apache/maven/wagon/wagon-ssh/1.0-beta-2/wagon-ssh-1.0-beta-2.pom
[WARNING] Unable to get resource 'org.apache.maven.wagon:wagon-ssh:pom:1.0-beta-2' from repository vph-repository (http://54.228.194.171:8081/nexus/content/repositories/snapshots/): Error transferring file: Connection refused
Downloading: http://uk.maven.org/maven2/org/apache/maven/wagon/wagon-ssh/1.0-beta-2/wagon-ssh-1.0-beta-2.pom
1K downloaded  (wagon-ssh-1.0-beta-2.pom)
Downloading: http://www.mygrid.org.uk/maven/repository/com/jcraft/jsch/0.1.27/jsch-0.1.27.pom
[INFO] Unable to find resource 'com.jcraft:jsch:pom:0.1.27' in repository mygrid-repository (http://www.mygrid.org.uk/maven/repository)
Downloading: http://www.mygrid.org.uk/maven/repository/com/jcraft/jsch/0.1.27/jsch-0.1.27.pom
[INFO] Unable to find resource 'com.jcraft:jsch:pom:0.1.27' in repository mygrid-repository (http://www.mygrid.org.uk/maven/repository)
Downloading: http://54.228.194.171:8081/nexus/content/repositories/snapshots//com/jcraft/jsch/0.1.27/jsch-0.1.27.pom
[WARNING] Unable to get resource 'com.jcraft:jsch:pom:0.1.27' from repository vph-repository (http://54.228.194.171:8081/nexus/content/repositories/snapshots/): Error transferring file: Connection refused
Downloading: http://uk.maven.org/maven2/com/jcraft/jsch/0.1.27/jsch-0.1.27.pom
965b downloaded  (jsch-0.1.27.pom)
Downloading: http://www.mygrid.org.uk/maven/repository/org/codehaus/plexus/plexus-interpolation/1.6/plexus-interpolation-1.6.pom
[INFO] Unable to find resource 'org.codehaus.plexus:plexus-interpolation:pom:1.6' in repository mygrid-repository (http://www.mygrid.org.uk/maven/repository)
Downloading: http://www.mygrid.org.uk/maven/repository/org/codehaus/plexus/plexus-interpolation/1.6/plexus-interpolation-1.6.pom
[INFO] Unable to find resource 'org.codehaus.plexus:plexus-interpolation:pom:1.6' in repository mygrid-repository (http://www.mygrid.org.uk/maven/repository)
Downloading: http://54.228.194.171:8081/nexus/content/repositories/snapshots//org/codehaus/plexus/plexus-interpolation/1.6/plexus-interpolation-1.6.pom
[WARNING] Unable to get resource 'org.codehaus.plexus:plexus-interpolation:pom:1.6' from repository vph-repository (http://54.228.194.171:8081/nexus/content/repositories/snapshots/): Error transferring file: Connection refused
Downloading: http://uk.maven.org/maven2/org/codehaus/plexus/plexus-interpolation/1.6/plexus-interpolation-1.6.pom
2K downloaded  (plexus-interpolation-1.6.pom)
Downloading: http://www.mygrid.org.uk/maven/repository/org/codehaus/plexus/plexus-utils/1.5.6/plexus-utils-1.5.6.jar
Downloading: http://www.mygrid.org.uk/maven/repository/org/apache/maven/shared/maven-filtering/1.0-beta-2/maven-filtering-1.0-beta-2.jar
[INFO] Unable to find resource 'org.apache.maven.shared:maven-filtering:jar:1.0-beta-2' in repository mygrid-repository (http://www.mygrid.org.uk/maven/repository)
Downloading: http://uk.maven.org/maven2/org/apache/maven/shared/maven-filtering/1.0-beta-2/maven-filtering-1.0-beta-2.jar
[INFO] Unable to find resource 'org.codehaus.plexus:plexus-utils:jar:1.5.6' in repository mygrid-repository (http://www.mygrid.org.uk/maven/repository)
Downloading: http://uk.maven.org/maven2/org/codehaus/plexus/plexus-utils/1.5.6/plexus-utils-1.5.6.jar
32K downloaded  (maven-filtering-1.0-beta-2.jar)
244K downloaded  (plexus-utils-1.5.6.jar)
Downloading: http://www.mygrid.org.uk/maven/repository/org/codehaus/plexus/plexus-interpolation/1.6/plexus-interpolation-1.6.jar
[INFO] Unable to find resource 'org.codehaus.plexus:plexus-interpolation:jar:1.6' in repository mygrid-repository (http://www.mygrid.org.uk/maven/repository)
Downloading: http://www.mygrid.org.uk/maven/repository/org/codehaus/plexus/plexus-interpolation/1.6/plexus-interpolation-1.6.jar
[INFO] Unable to find resource 'org.codehaus.plexus:plexus-interpolation:jar:1.6' in repository mygrid-repository (http://www.mygrid.org.uk/maven/repository)
Downloading: http://54.228.194.171:8081/nexus/content/repositories/snapshots//org/codehaus/plexus/plexus-interpolation/1.6/plexus-interpolation-1.6.jar
[WARNING] Unable to get resource 'org.codehaus.plexus:plexus-interpolation:jar:1.6' from repository vph-repository (http://54.228.194.171:8081/nexus/content/repositories/snapshots/): Error transferring file: Connection refused
Downloading: http://uk.maven.org/maven2/org/codehaus/plexus/plexus-interpolation/1.6/plexus-interpolation-1.6.jar
49K downloaded  (plexus-interpolation-1.6.jar)
[INFO] [resources:resources {execution: default-resources}]
[WARNING] Using platform encoding (ANSI_X3.4-1968 actually) to copy filtered resources, i.e. build is platform dependent!
[INFO] Copying 5 resources
[INFO] Copying 1 resource
Downloading: http://www.mygrid.org.uk/maven/repository/org/apache/maven/maven-toolchain/1.0/maven-toolchain-1.0.pom
[INFO] Unable to find resource 'org.apache.maven:maven-toolchain:pom:1.0' in repository mygrid-repository (http://www.mygrid.org.uk/maven/repository)
Downloading: http://uk.maven.org/maven2/org/apache/maven/maven-toolchain/1.0/maven-toolchain-1.0.pom
3K downloaded  (maven-toolchain-1.0.pom)
Downloading: http://www.mygrid.org.uk/maven/repository/org/codehaus/plexus/plexus-compiler-api/1.8.1/plexus-compiler-api-1.8.1.pom
[INFO] Unable to find resource 'org.codehaus.plexus:plexus-compiler-api:pom:1.8.1' in repository mygrid-repository (http://www.mygrid.org.uk/maven/repository)
Downloading: http://uk.maven.org/maven2/org/codehaus/plexus/plexus-compiler-api/1.8.1/plexus-compiler-api-1.8.1.pom
805b downloaded  (plexus-compiler-api-1.8.1.pom)
Downloading: http://www.mygrid.org.uk/maven/repository/org/codehaus/plexus/plexus-compiler/1.8.1/plexus-compiler-1.8.1.pom
[INFO] Unable to find resource 'org.codehaus.plexus:plexus-compiler:pom:1.8.1' in repository mygrid-repository (http://www.mygrid.org.uk/maven/repository)
Downloading: http://uk.maven.org/maven2/org/codehaus/plexus/plexus-compiler/1.8.1/plexus-compiler-1.8.1.pom
3K downloaded  (plexus-compiler-1.8.1.pom)
Downloading: http://www.mygrid.org.uk/maven/repository/org/codehaus/plexus/plexus-components/1.1.18/plexus-components-1.1.18.pom
[INFO] Unable to find resource 'org.codehaus.plexus:plexus-components:pom:1.1.18' in repository mygrid-repository (http://www.mygrid.org.uk/maven/repository)
Downloading: http://uk.maven.org/maven2/org/codehaus/plexus/plexus-components/1.1.18/plexus-components-1.1.18.pom
5K downloaded  (plexus-components-1.1.18.pom)
Downloading: http://www.mygrid.org.uk/maven/repository/org/codehaus/plexus/plexus/2.0.7/plexus-2.0.7.pom
[INFO] Unable to find resource 'org.codehaus.plexus:plexus:pom:2.0.7' in repository mygrid-repository (http://www.mygrid.org.uk/maven/repository)
Downloading: http://uk.maven.org/maven2/org/codehaus/plexus/plexus/2.0.7/plexus-2.0.7.pom
16K downloaded  (plexus-2.0.7.pom)
Downloading: http://www.mygrid.org.uk/maven/repository/org/codehaus/plexus/plexus-compiler-manager/1.8.1/plexus-compiler-manager-1.8.1.pom
[INFO] Unable to find resource 'org.codehaus.plexus:plexus-compiler-manager:pom:1.8.1' in repository mygrid-repository (http://www.mygrid.org.uk/maven/repository)
Downloading: http://uk.maven.org/maven2/org/codehaus/plexus/plexus-compiler-manager/1.8.1/plexus-compiler-manager-1.8.1.pom
713b downloaded  (plexus-compiler-manager-1.8.1.pom)
Downloading: http://www.mygrid.org.uk/maven/repository/org/codehaus/plexus/plexus-compiler-javac/1.8.1/plexus-compiler-javac-1.8.1.pom
[INFO] Unable to find resource 'org.codehaus.plexus:plexus-compiler-javac:pom:1.8.1' in repository mygrid-repository (http://www.mygrid.org.uk/maven/repository)
Downloading: http://uk.maven.org/maven2/org/codehaus/plexus/plexus-compiler-javac/1.8.1/plexus-compiler-javac-1.8.1.pom
710b downloaded  (plexus-compiler-javac-1.8.1.pom)
Downloading: http://www.mygrid.org.uk/maven/repository/org/codehaus/plexus/plexus-compilers/1.8.1/plexus-compilers-1.8.1.pom
[INFO] Unable to find resource 'org.codehaus.plexus:plexus-compilers:pom:1.8.1' in repository mygrid-repository (http://www.mygrid.org.uk/maven/repository)
Downloading: http://uk.maven.org/maven2/org/codehaus/plexus/plexus-compilers/1.8.1/plexus-compilers-1.8.1.pom
1K downloaded  (plexus-compilers-1.8.1.pom)
Downloading: http://www.mygrid.org.uk/maven/repository/org/codehaus/plexus/plexus-compiler-api/1.8.1/plexus-compiler-api-1.8.1.jar
[INFO] Unable to find resource 'org.codehaus.plexus:plexus-compiler-api:jar:1.8.1' in repository mygrid-repository (http://www.mygrid.org.uk/maven/repository)
Downloading: http://uk.maven.org/maven2/org/codehaus/plexus/plexus-compiler-api/1.8.1/plexus-compiler-api-1.8.1.jar
19K downloaded  (plexus-compiler-api-1.8.1.jar)
Downloading: http://www.mygrid.org.uk/maven/repository/org/codehaus/plexus/plexus-compiler-manager/1.8.1/plexus-compiler-manager-1.8.1.jar
[INFO] Unable to find resource 'org.codehaus.plexus:plexus-compiler-manager:jar:1.8.1' in repository mygrid-repository (http://www.mygrid.org.uk/maven/repository)
Downloading: http://uk.maven.org/maven2/org/codehaus/plexus/plexus-compiler-manager/1.8.1/plexus-compiler-manager-1.8.1.jar
5K downloaded  (plexus-compiler-manager-1.8.1.jar)
Downloading: http://www.mygrid.org.uk/maven/repository/org/codehaus/plexus/plexus-compiler-javac/1.8.1/plexus-compiler-javac-1.8.1.jar
[INFO] Unable to find resource 'org.codehaus.plexus:plexus-compiler-javac:jar:1.8.1' in repository mygrid-repository (http://www.mygrid.org.uk/maven/repository)
Downloading: http://uk.maven.org/maven2/org/codehaus/plexus/plexus-compiler-javac/1.8.1/plexus-compiler-javac-1.8.1.jar
12K downloaded  (plexus-compiler-javac-1.8.1.jar)
[INFO] [compiler:compile {execution: default-compile}]
[WARNING] File encoding has not been set, using platform encoding ANSI_X3.4-1968, i.e. build is platform dependent!
[INFO] Compiling 196 source files to /var/lib/jenkins/workspace/components-snapshots/component/component-registry/target/classes
[INFO] -------------------------------------------------------------
[ERROR] COMPILATION ERROR : 
[INFO] -------------------------------------------------------------
[ERROR] /var/lib/jenkins/workspace/components-snapshots/component/component-registry/src/main/java/net/sf/taverna/t2/component/registry/standard/Utils.java:[14,44] error: package net.sf.taverna.t2.workbench.file.impl does not exist
[ERROR] /var/lib/jenkins/workspace/components-snapshots/component/component-registry/src/main/java/net/sf/taverna/t2/component/registry/standard/Utils.java:[15,44] error: package net.sf.taverna.t2.workbench.file.impl does not exist
[ERROR] /var/lib/jenkins/workspace/components-snapshots/component/component-registry/src/main/java/net/sf/taverna/t2/component/registry/standard/Utils.java:[17,44] error: package net.sf.taverna.t2.workflowmodel.utils does not exist
[ERROR] /var/lib/jenkins/workspace/components-snapshots/component/component-registry/src/main/java/net/sf/taverna/t2/component/registry/standard/Utils.java:[20,22] error: cannot find symbol
[ERROR]  class Utils
/var/lib/jenkins/workspace/components-snapshots/component/component-registry/src/main/java/net/sf/taverna/t2/component/registry/standard/Utils.java:[21,22] error: cannot find symbol
[ERROR]  class Utils
/var/lib/jenkins/workspace/components-snapshots/component/component-registry/src/main/java/net/sf/taverna/t2/component/registry/standard/Utils.java:[22,22] error: cannot find symbol
[ERROR]  class Utils
/var/lib/jenkins/workspace/components-snapshots/component/component-registry/src/main/java/net/sf/taverna/t2/component/registry/myexperiment/MyExperimentComponent.java:[34,44] error: package net.sf.taverna.t2.workbench.file.impl does not exist
[ERROR] /var/lib/jenkins/workspace/components-snapshots/component/component-registry/src/main/java/net/sf/taverna/t2/component/registry/myexperiment/MyExperimentComponent.java:[36,44] error: package net.sf.taverna.t2.workflowmodel.utils does not exist
[ERROR] /var/lib/jenkins/workspace/components-snapshots/component/component-registry/src/main/java/net/sf/taverna/t2/component/registry/myexperiment/MyExperimentComponent.java:[38,30] error: package org.apache.commons.lang does not exist
[ERROR] /var/lib/jenkins/workspace/components-snapshots/component/component-registry/src/main/java/net/sf/taverna/t2/component/registry/myexperiment/MyExperimentComponentRegistry.java:[47,30] error: package org.apache.commons.lang does not exist
[ERROR] /var/lib/jenkins/workspace/components-snapshots/component/component-registry/src/main/java/net/sf/taverna/t2/component/registry/myexperiment/MyExperimentComponent.java:[49,15] error: cannot find symbol
[ERROR]  class MyExperimentComponent
/var/lib/jenkins/workspace/components-snapshots/component/component-registry/src/main/java/net/sf/taverna/t2/component/registry/myexperiment/MyExperimentComponentVersion.java:[31,44] error: package net.sf.taverna.t2.workbench.file.impl does not exist
[ERROR] /var/lib/jenkins/workspace/components-snapshots/component/component-registry/src/main/java/net/sf/taverna/t2/component/registry/myexperiment/MyExperimentComponentVersion.java:[32,44] error: package net.sf.taverna.t2.workbench.file.impl does not exist
[ERROR] /var/lib/jenkins/workspace/components-snapshots/component/component-registry/src/main/java/net/sf/taverna/t2/component/registry/myexperiment/MyExperimentComponentVersion.java:[35,30] error: package org.apache.commons.lang does not exist
[ERROR] /var/lib/jenkins/workspace/components-snapshots/component/component-registry/src/main/java/net/sf/taverna/t2/component/registry/myexperiment/MyExperimentComponentVersion.java:[50,22] error: cannot find symbol
[ERROR]  class MyExperimentComponentVersion
/var/lib/jenkins/workspace/components-snapshots/component/component-registry/src/main/java/net/sf/taverna/t2/component/registry/local/LocalComponent.java:[14,44] error: package net.sf.taverna.t2.workbench.file.impl does not exist
[ERROR] /var/lib/jenkins/workspace/components-snapshots/component/component-registry/src/main/java/net/sf/taverna/t2/component/registry/local/LocalComponent.java:[15,44] error: package net.sf.taverna.t2.workbench.file.impl does not exist
[ERROR] /var/lib/jenkins/workspace/components-snapshots/component/component-registry/src/main/java/net/sf/taverna/t2/component/registry/local/LocalComponent.java:[29,22] error: cannot find symbol
[ERROR]  class LocalComponent
/var/lib/jenkins/workspace/components-snapshots/component/component-registry/src/main/java/net/sf/taverna/t2/component/registry/myexperiment/MyExperimentComponentFamily.java:[39,44] error: package net.sf.taverna.t2.workbench.file.impl does not exist
[ERROR] /var/lib/jenkins/workspace/components-snapshots/component/component-registry/src/main/java/net/sf/taverna/t2/component/registry/myexperiment/MyExperimentComponentFamily.java:[41,44] error: package net.sf.taverna.t2.workflowmodel.utils does not exist
[ERROR] /var/lib/jenkins/workspace/components-snapshots/component/component-registry/src/main/java/net/sf/taverna/t2/component/registry/myexperiment/MyExperimentComponentFamily.java:[43,30] error: package org.apache.commons.lang does not exist
[ERROR] /var/lib/jenkins/workspace/components-snapshots/component/component-registry/src/main/java/net/sf/taverna/t2/component/registry/myexperiment/MyExperimentComponentFamily.java:[59,15] error: cannot find symbol
[ERROR]  class MyExperimentComponentFamily
/var/lib/jenkins/workspace/components-snapshots/component/component-registry/src/main/java/net/sf/taverna/t2/component/registry/local/LocalComponentVersion.java:[13,44] error: package net.sf.taverna.t2.workbench.file.impl does not exist
[ERROR] /var/lib/jenkins/workspace/components-snapshots/component/component-registry/src/main/java/net/sf/taverna/t2/component/registry/local/LocalComponentVersion.java:[14,44] error: package net.sf.taverna.t2.workbench.file.impl does not exist
[ERROR] /var/lib/jenkins/workspace/components-snapshots/component/component-registry/src/main/java/net/sf/taverna/t2/component/registry/local/LocalComponentVersion.java:[29,22] error: cannot find symbol
[ERROR]  class LocalComponentVersion
/var/lib/jenkins/workspace/components-snapshots/component/component-registry/src/main/java/net/sf/taverna/t2/component/registry/standard/Utils.java:[20,61] error: cannot find symbol
[ERROR]  class Utils
/var/lib/jenkins/workspace/components-snapshots/component/component-registry/src/main/java/net/sf/taverna/t2/component/registry/standard/Utils.java:[21,60] error: cannot find symbol
[ERROR]  class Utils
/var/lib/jenkins/workspace/components-snapshots/component/component-registry/src/main/java/net/sf/taverna/t2/component/registry/standard/Utils.java:[22,52] error: cannot find symbol
[ERROR]  class Utils
/var/lib/jenkins/workspace/components-snapshots/component/component-registry/src/main/java/net/sf/taverna/t2/component/registry/standard/Utils.java:[30,9] error: cannot find symbol
[ERROR]  class Utils
/var/lib/jenkins/workspace/components-snapshots/component/component-registry/src/main/java/net/sf/taverna/t2/component/registry/myexperiment/MyExperimentComponent.java:[62,24] error: cannot find symbol
[ERROR]  class MyExperimentComponent
/var/lib/jenkins/workspace/components-snapshots/component/component-registry/src/main/java/net/sf/taverna/t2/component/registry/myexperiment/MyExperimentComponent.java:[105,64] error: cannot find symbol
[ERROR]  class MyExperimentComponent
/var/lib/jenkins/workspace/components-snapshots/component/component-registry/src/main/java/net/sf/taverna/t2/component/registry/myexperiment/MyExperimentComponent.java:[120,23] error: cannot find symbol
[ERROR]  class MyExperimentComponent
/var/lib/jenkins/workspace/components-snapshots/component/component-registry/src/main/java/net/sf/taverna/t2/component/registry/myexperiment/MyExperimentComponentRegistry.java:[150,18] error: cannot find symbol
[ERROR]  class MyExperimentComponentRegistry
/var/lib/jenkins/workspace/components-snapshots/component/component-registry/src/main/java/net/sf/taverna/t2/component/registry/myexperiment/MyExperimentComponentRegistry.java:[544,16] error: cannot find symbol
[ERROR]  class MyExperimentComponentRegistry
/var/lib/jenkins/workspace/components-snapshots/component/component-registry/src/main/java/net/sf/taverna/t2/component/registry/myexperiment/MyExperimentComponentVersion.java:[50,61] error: cannot find symbol
[ERROR]  class MyExperimentComponentVersion
/var/lib/jenkins/workspace/components-snapshots/component/component-registry/src/main/java/net/sf/taverna/t2/component/registry/myexperiment/MyExperimentComponentVersion.java:[97,17] error: cannot find symbol
[ERROR]  class MyExperimentComponentVersion
/var/lib/jenkins/workspace/components-snapshots/component/component-registry/src/main/java/net/sf/taverna/t2/component/registry/myexperiment/MyExperimentComponentVersion.java:[100,3] error: cannot find symbol
[ERROR]  class MyExperimentComponentVersion
/var/lib/jenkins/workspace/components-snapshots/component/component-registry/src/main/java/net/sf/taverna/t2/component/registry/myexperiment/MyExperimentComponentVersion.java:[100,33] error: cannot find symbol
[ERROR]  class MyExperimentComponentVersion
/var/lib/jenkins/workspace/components-snapshots/component/component-registry/src/main/java/net/sf/taverna/t2/component/registry/myexperiment/MyExperimentComponentVersion.java:[143,10] error: cannot find symbol
[ERROR]  class MyExperimentComponentVersion
/var/lib/jenkins/workspace/components-snapshots/component/component-registry/src/main/java/net/sf/taverna/t2/component/registry/local/LocalComponent.java:[29,61] error: cannot find symbol
[ERROR]  class LocalComponent
/var/lib/jenkins/workspace/components-snapshots/component/component-registry/src/main/java/net/sf/taverna/t2/component/registry/local/LocalComponent.java:[53,2] error: cannot find symbol
[ERROR]  class LocalComponent
/var/lib/jenkins/workspace/components-snapshots/component/component-registry/src/main/java/net/sf/taverna/t2/component/registry/local/LocalComponent.java:[53,30] error: cannot find symbol
[ERROR]  class LocalComponent
/var/lib/jenkins/workspace/components-snapshots/component/component-registry/src/main/java/net/sf/taverna/t2/component/registry/myexperiment/MyExperimentComponentFamily.java:[73,24] error: cannot find symbol
[ERROR]  class MyExperimentComponentFamily
/var/lib/jenkins/workspace/components-snapshots/component/component-registry/src/main/java/net/sf/taverna/t2/component/registry/myexperiment/MyExperimentComponentFamily.java:[142,27] error: cannot find symbol
[ERROR]  class MyExperimentComponentFamily
/var/lib/jenkins/workspace/components-snapshots/component/component-registry/src/main/java/net/sf/taverna/t2/component/registry/myexperiment/MyExperimentComponentFamily.java:[157,15] error: cannot find symbol
[ERROR]  class MyExperimentComponentFamily
/var/lib/jenkins/workspace/components-snapshots/component/component-registry/src/main/java/net/sf/taverna/t2/component/registry/myexperiment/MyExperimentComponentFamily.java:[229,9] error: cannot find symbol
[ERROR]  class MyExperimentComponentFamily
/var/lib/jenkins/workspace/components-snapshots/component/component-registry/src/main/java/net/sf/taverna/t2/component/registry/local/LocalComponentVersion.java:[29,61] error: cannot find symbol
[ERROR]  class LocalComponentVersion
/var/lib/jenkins/workspace/components-snapshots/component/component-registry/src/main/java/net/sf/taverna/t2/component/registry/local/LocalComponentVersion.java:[64,2] error: cannot find symbol
[ERROR]  class LocalComponentVersion
/var/lib/jenkins/workspace/components-snapshots/component/component-registry/src/main/java/net/sf/taverna/t2/component/registry/local/LocalComponentVersion.java:[64,32] error: cannot find symbol
[INFO] 49 errors 
[INFO] -------------------------------------------------------------
[INFO] ------------------------------------------------------------------------
[ERROR] BUILD FAILURE
[INFO] ------------------------------------------------------------------------
[INFO] Compilation failure

/var/lib/jenkins/workspace/components-snapshots/component/component-registry/src/main/java/net/sf/taverna/t2/component/registry/standard/Utils.java:[14,44] error: package net.sf.taverna.t2.workbench.file.impl does not exist
/var/lib/jenkins/workspace/components-snapshots/component/component-registry/src/main/java/net/sf/taverna/t2/component/registry/standard/Utils.java:[15,44] error: package net.sf.taverna.t2.workbench.file.impl does not exist
/var/lib/jenkins/workspace/components-snapshots/component/component-registry/src/main/java/net/sf/taverna/t2/component/registry/standard/Utils.java:[17,44] error: package net.sf.taverna.t2.workflowmodel.utils does not exist
/var/lib/jenkins/workspace/components-snapshots/component/component-registry/src/main/java/net/sf/taverna/t2/component/registry/standard/Utils.java:[20,22] error: cannot find symbol
 class Utils
/var/lib/jenkins/workspace/components-snapshots/component/component-registry/src/main/java/net/sf/taverna/t2/component/registry/standard/Utils.java:[21,22] error: cannot find symbol
 class Utils
/var/lib/jenkins/workspace/components-snapshots/component/component-registry/src/main/java/net/sf/taverna/t2/component/registry/standard/Utils.java:[22,22] error: cannot find symbol
 class Utils
/var/lib/jenkins/workspace/components-snapshots/component/component-registry/src/main/java/net/sf/taverna/t2/component/registry/myexperiment/MyExperimentComponent.java:[34,44] error: package net.sf.taverna.t2.workbench.file.impl does not exist
/var/lib/jenkins/workspace/components-snapshots/component/component-registry/src/main/java/net/sf/taverna/t2/component/registry/myexperiment/MyExperimentComponent.java:[36,44] error: package net.sf.taverna.t2.workflowmodel.utils does not exist
/var/lib/jenkins/workspace/components-snapshots/component/component-registry/src/main/java/net/sf/taverna/t2/component/registry/myexperiment/MyExperimentComponent.java:[38,30] error: package org.apache.commons.lang does not exist
/var/lib/jenkins/workspace/components-snapshots/component/component-registry/src/main/java/net/sf/taverna/t2/component/registry/myexperiment/MyExperimentComponentRegistry.java:[47,30] error: package org.apache.commons.lang does not exist
/var/lib/jenkins/workspace/components-snapshots/component/component-registry/src/main/java/net/sf/taverna/t2/component/registry/myexperiment/MyExperimentComponent.java:[49,15] error: cannot find symbol
 class MyExperimentComponent
/var/lib/jenkins/workspace/components-snapshots/component/component-registry/src/main/java/net/sf/taverna/t2/component/registry/myexperiment/MyExperimentComponentVersion.java:[31,44] error: package net.sf.taverna.t2.workbench.file.impl does not exist
/var/lib/jenkins/workspace/components-snapshots/component/component-registry/src/main/java/net/sf/taverna/t2/component/registry/myexperiment/MyExperimentComponentVersion.java:[32,44] error: package net.sf.taverna.t2.workbench.file.impl does not exist
/var/lib/jenkins/workspace/components-snapshots/component/component-registry/src/main/java/net/sf/taverna/t2/component/registry/myexperiment/MyExperimentComponentVersion.java:[35,30] error: package org.apache.commons.lang does not exist
/var/lib/jenkins/workspace/components-snapshots/component/component-registry/src/main/java/net/sf/taverna/t2/component/registry/myexperiment/MyExperimentComponentVersion.java:[50,22] error: cannot find symbol
 class MyExperimentComponentVersion
/var/lib/jenkins/workspace/components-snapshots/component/component-registry/src/main/java/net/sf/taverna/t2/component/registry/local/LocalComponent.java:[14,44] error: package net.sf.taverna.t2.workbench.file.impl does not exist
/var/lib/jenkins/workspace/components-snapshots/component/component-registry/src/main/java/net/sf/taverna/t2/component/registry/local/LocalComponent.java:[15,44] error: package net.sf.taverna.t2.workbench.file.impl does not exist
/var/lib/jenkins/workspace/components-snapshots/component/component-registry/src/main/java/net/sf/taverna/t2/component/registry/local/LocalComponent.java:[29,22] error: cannot find symbol
 class LocalComponent
/var/lib/jenkins/workspace/components-snapshots/component/component-registry/src/main/java/net/sf/taverna/t2/component/registry/myexperiment/MyExperimentComponentFamily.java:[39,44] error: package net.sf.taverna.t2.workbench.file.impl does not exist
/var/lib/jenkins/workspace/components-snapshots/component/component-registry/src/main/java/net/sf/taverna/t2/component/registry/myexperiment/MyExperimentComponentFamily.java:[41,44] error: package net.sf.taverna.t2.workflowmodel.utils does not exist
/var/lib/jenkins/workspace/components-snapshots/component/component-registry/src/main/java/net/sf/taverna/t2/component/registry/myexperiment/MyExperimentComponentFamily.java:[43,30] error: package org.apache.commons.lang does not exist
/var/lib/jenkins/workspace/components-snapshots/component/component-registry/src/main/java/net/sf/taverna/t2/component/registry/myexperiment/MyExperimentComponentFamily.java:[59,15] error: cannot find symbol
 class MyExperimentComponentFamily
/var/lib/jenkins/workspace/components-snapshots/component/component-registry/src/main/java/net/sf/taverna/t2/component/registry/local/LocalComponentVersion.java:[13,44] error: package net.sf.taverna.t2.workbench.file.impl does not exist
/var/lib/jenkins/workspace/components-snapshots/component/component-registry/src/main/java/net/sf/taverna/t2/component/registry/local/LocalComponentVersion.java:[14,44] error: package net.sf.taverna.t2.workbench.file.impl does not exist
/var/lib/jenkins/workspace/components-snapshots/component/component-registry/src/main/java/net/sf/taverna/t2/component/registry/local/LocalComponentVersion.java:[29,22] error: cannot find symbol
 class LocalComponentVersion
/var/lib/jenkins/workspace/components-snapshots/component/component-registry/src/main/java/net/sf/taverna/t2/component/registry/standard/Utils.java:[20,61] error: cannot find symbol
 class Utils
/var/lib/jenkins/workspace/components-snapshots/component/component-registry/src/main/java/net/sf/taverna/t2/component/registry/standard/Utils.java:[21,60] error: cannot find symbol
 class Utils
/var/lib/jenkins/workspace/components-snapshots/component/component-registry/src/main/java/net/sf/taverna/t2/component/registry/standard/Utils.java:[22,52] error: cannot find symbol
 class Utils
/var/lib/jenkins/workspace/components-snapshots/component/component-registry/src/main/java/net/sf/taverna/t2/component/registry/standard/Utils.java:[30,9] error: cannot find symbol
 class Utils
/var/lib/jenkins/workspace/components-snapshots/component/component-registry/src/main/java/net/sf/taverna/t2/component/registry/myexperiment/MyExperimentComponent.java:[62,24] error: cannot find symbol
 class MyExperimentComponent
/var/lib/jenkins/workspace/components-snapshots/component/component-registry/src/main/java/net/sf/taverna/t2/component/registry/myexperiment/MyExperimentComponent.java:[105,64] error: cannot find symbol
 class MyExperimentComponent
/var/lib/jenkins/workspace/components-snapshots/component/component-registry/src/main/java/net/sf/taverna/t2/component/registry/myexperiment/MyExperimentComponent.java:[120,23] error: cannot find symbol
 class MyExperimentComponent
/var/lib/jenkins/workspace/components-snapshots/component/component-registry/src/main/java/net/sf/taverna/t2/component/registry/myexperiment/MyExperimentComponentRegistry.java:[150,18] error: cannot find symbol
 class MyExperimentComponentRegistry
/var/lib/jenkins/workspace/components-snapshots/component/component-registry/src/main/java/net/sf/taverna/t2/component/registry/myexperiment/MyExperimentComponentRegistry.java:[544,16] error: cannot find symbol
 class MyExperimentComponentRegistry
/var/lib/jenkins/workspace/components-snapshots/component/component-registry/src/main/java/net/sf/taverna/t2/component/registry/myexperiment/MyExperimentComponentVersion.java:[50,61] error: cannot find symbol
 class MyExperimentComponentVersion
/var/lib/jenkins/workspace/components-snapshots/component/component-registry/src/main/java/net/sf/taverna/t2/component/registry/myexperiment/MyExperimentComponentVersion.java:[97,17] error: cannot find symbol
 class MyExperimentComponentVersion
/var/lib/jenkins/workspace/components-snapshots/component/component-registry/src/main/java/net/sf/taverna/t2/component/registry/myexperiment/MyExperimentComponentVersion.java:[100,3] error: cannot find symbol
 class MyExperimentComponentVersion
/var/lib/jenkins/workspace/components-snapshots/component/component-registry/src/main/java/net/sf/taverna/t2/component/registry/myexperiment/MyExperimentComponentVersion.java:[100,33] error: cannot find symbol
 class MyExperimentComponentVersion
/var/lib/jenkins/workspace/components-snapshots/component/component-registry/src/main/java/net/sf/taverna/t2/component/registry/myexperiment/MyExperimentComponentVersion.java:[143,10] error: cannot find symbol
 class MyExperimentComponentVersion
/var/lib/jenkins/workspace/components-snapshots/component/component-registry/src/main/java/net/sf/taverna/t2/component/registry/local/LocalComponent.java:[29,61] error: cannot find symbol
 class LocalComponent
/var/lib/jenkins/workspace/components-snapshots/component/component-registry/src/main/java/net/sf/taverna/t2/component/registry/local/LocalComponent.java:[53,2] error: cannot find symbol
 class LocalComponent
/var/lib/jenkins/workspace/components-snapshots/component/component-registry/src/main/java/net/sf/taverna/t2/component/registry/local/LocalComponent.java:[53,30] error: cannot find symbol
 class LocalComponent
/var/lib/jenkins/workspace/components-snapshots/component/component-registry/src/main/java/net/sf/taverna/t2/component/registry/myexperiment/MyExperimentComponentFamily.java:[73,24] error: cannot find symbol
 class MyExperimentComponentFamily
/var/lib/jenkins/workspace/components-snapshots/component/component-registry/src/main/java/net/sf/taverna/t2/component/registry/myexperiment/MyExperimentComponentFamily.java:[142,27] error: cannot find symbol
 class MyExperimentComponentFamily
/var/lib/jenkins/workspace/components-snapshots/component/component-registry/src/main/java/net/sf/taverna/t2/component/registry/myexperiment/MyExperimentComponentFamily.java:[157,15] error: cannot find symbol
 class MyExperimentComponentFamily
/var/lib/jenkins/workspace/components-snapshots/component/component-registry/src/main/java/net/sf/taverna/t2/component/registry/myexperiment/MyExperimentComponentFamily.java:[229,9] error: cannot find symbol
 class MyExperimentComponentFamily
/var/lib/jenkins/workspace/components-snapshots/component/component-registry/src/main/java/net/sf/taverna/t2/component/registry/local/LocalComponentVersion.java:[29,61] error: cannot find symbol
 class LocalComponentVersion
/var/lib/jenkins/workspace/components-snapshots/component/component-registry/src/main/java/net/sf/taverna/t2/component/registry/local/LocalComponentVersion.java:[64,2] error: cannot find symbol
 class LocalComponentVersion
/var/lib/jenkins/workspace/components-snapshots/component/component-registry/src/main/java/net/sf/taverna/t2/component/registry/local/LocalComponentVersion.java:[64,32] error: cannot find symbol

[INFO] ------------------------------------------------------------------------
[INFO] For more information, run Maven with the -e switch
[INFO] ------------------------------------------------------------------------
[INFO] Total time: 2 minutes 31 seconds
[INFO] Finished at: Wed Oct 16 13:54:55 BST 2013
[INFO] Final Memory: 42M/154M
[INFO] ------------------------------------------------------------------------
[JENKINS] Archiving /var/lib/jenkins/workspace/components-snapshots/.repository/net/sf/taverna/t2/component/component/1.1.0-SNAPSHOT/component-1.1.0-SNAPSHOT.pom to net.sf.taverna.t2.component/component/1.1.0-SNAPSHOT/component-1.1.0-SNAPSHOT.pom
[JENKINS] Archiving /var/lib/jenkins/workspace/components-snapshots/component/target/component-1.1.0-SNAPSHOT-tests.jar to net.sf.taverna.t2.component/component/1.1.0-SNAPSHOT/component-1.1.0-SNAPSHOT-tests.jar
/var/lib/jenkins/workspace/components-snapshots/.repository/net/sf/taverna/t2/component/component/1.1.0-SNAPSHOT/component-1.1.0-SNAPSHOT.pom is not inside /var/lib/jenkins/workspace/components-snapshots/component/; will archive in a separate pass
[JENKINS] Archiving /var/lib/jenkins/workspace/components-snapshots/component/component-registry/pom.xml to net.sf.taverna.t2.component/component-registry/1.1.0-SNAPSHOT/component-registry-1.1.0-SNAPSHOT.pom
channel stopped
Finished: FAILURE