FailedConsole Output

Skipping 215 KB.. Full Log
apshots/org/apache/geronimo/specs/geronimo-javamail_1.4_spec/1.6/geronimo-javamail_1.4_spec-1.6.pom
[INFO] Unable to find resource 'org.apache.geronimo.specs:geronimo-javamail_1.4_spec:pom:1.6' in repository apache.snapshots (http://repository.apache.org/snapshots)
Downloading: http://uk.maven.org/maven2/org/apache/geronimo/specs/geronimo-javamail_1.4_spec/1.6/geronimo-javamail_1.4_spec-1.6.pom
2K downloaded  (geronimo-javamail_1.4_spec-1.6.pom)
Downloading: http://www.mygrid.org.uk/maven/repository/org/apache/geronimo/specs/specs-parent/1.6/specs-parent-1.6.pom
[INFO] Unable to find resource 'org.apache.geronimo.specs:specs-parent:pom:1.6' in repository mygrid-repository (http://www.mygrid.org.uk/maven/repository)
Downloading: http://repository.apache.org/snapshots/org/apache/geronimo/specs/specs-parent/1.6/specs-parent-1.6.pom
[INFO] Unable to find resource 'org.apache.geronimo.specs:specs-parent:pom:1.6' in repository apache.snapshots (http://repository.apache.org/snapshots)
Downloading: http://uk.maven.org/maven2/org/apache/geronimo/specs/specs-parent/1.6/specs-parent-1.6.pom
5K downloaded  (specs-parent-1.6.pom)
Downloading: http://www.mygrid.org.uk/maven/repository/org/apache/geronimo/genesis/config/project-config/1.5/project-config-1.5.pom
[INFO] Unable to find resource 'org.apache.geronimo.genesis.config:project-config:pom:1.5' in repository mygrid-repository (http://www.mygrid.org.uk/maven/repository)
Downloading: http://repository.apache.org/snapshots/org/apache/geronimo/genesis/config/project-config/1.5/project-config-1.5.pom
[INFO] Unable to find resource 'org.apache.geronimo.genesis.config:project-config:pom:1.5' in repository apache.snapshots (http://repository.apache.org/snapshots)
Downloading: http://uk.maven.org/maven2/org/apache/geronimo/genesis/config/project-config/1.5/project-config-1.5.pom
16K downloaded  (project-config-1.5.pom)
Downloading: http://people.apache.org/repo/m2-incubating-repository//org/apache/geronimo/genesis/config/config/1.5/config-1.5.pom
[INFO] Unable to find resource 'org.apache.geronimo.genesis.config:config:pom:1.5' in repository apache-incubator (http://people.apache.org/repo/m2-incubating-repository/)
Downloading: http://www.mygrid.org.uk/maven/repository/org/apache/geronimo/genesis/config/config/1.5/config-1.5.pom
[INFO] Unable to find resource 'org.apache.geronimo.genesis.config:config:pom:1.5' in repository mygrid-repository (http://www.mygrid.org.uk/maven/repository)
Downloading: http://repository.apache.org/snapshots/org/apache/geronimo/genesis/config/config/1.5/config-1.5.pom
[INFO] Unable to find resource 'org.apache.geronimo.genesis.config:config:pom:1.5' in repository apache.snapshots (http://repository.apache.org/snapshots)
Downloading: http://uk.maven.org/maven2/org/apache/geronimo/genesis/config/config/1.5/config-1.5.pom
2K downloaded  (config-1.5.pom)
Downloading: http://people.apache.org/repo/m2-incubating-repository//org/apache/geronimo/genesis/genesis/1.5/genesis-1.5.pom
[INFO] Unable to find resource 'org.apache.geronimo.genesis:genesis:pom:1.5' in repository apache-incubator (http://people.apache.org/repo/m2-incubating-repository/)
Downloading: http://www.mygrid.org.uk/maven/repository/org/apache/geronimo/genesis/genesis/1.5/genesis-1.5.pom
[INFO] Unable to find resource 'org.apache.geronimo.genesis:genesis:pom:1.5' in repository mygrid-repository (http://www.mygrid.org.uk/maven/repository)
Downloading: http://repository.apache.org/snapshots/org/apache/geronimo/genesis/genesis/1.5/genesis-1.5.pom
[INFO] Unable to find resource 'org.apache.geronimo.genesis:genesis:pom:1.5' in repository apache.snapshots (http://repository.apache.org/snapshots)
Downloading: http://uk.maven.org/maven2/org/apache/geronimo/genesis/genesis/1.5/genesis-1.5.pom
14K downloaded  (genesis-1.5.pom)
Downloading: http://www.mygrid.org.uk/maven/repository/jaxen/jaxen/1.1.1/jaxen-1.1.1.pom
[INFO] Unable to find resource 'jaxen:jaxen:pom:1.1.1' in repository mygrid-repository (http://www.mygrid.org.uk/maven/repository)
Downloading: http://repository.apache.org/snapshots/jaxen/jaxen/1.1.1/jaxen-1.1.1.pom
[INFO] Unable to find resource 'jaxen:jaxen:pom:1.1.1' in repository apache.snapshots (http://repository.apache.org/snapshots)
Downloading: http://uk.maven.org/maven2/jaxen/jaxen/1.1.1/jaxen-1.1.1.pom
7K downloaded  (jaxen-1.1.1.pom)
Downloading: http://www.mygrid.org.uk/maven/repository/org/codehaus/woodstox/wstx-asl/3.2.9/wstx-asl-3.2.9.pom
[INFO] Unable to find resource 'org.codehaus.woodstox:wstx-asl:pom:3.2.9' in repository mygrid-repository (http://www.mygrid.org.uk/maven/repository)
Downloading: http://repository.apache.org/snapshots/org/codehaus/woodstox/wstx-asl/3.2.9/wstx-asl-3.2.9.pom
[INFO] Unable to find resource 'org.codehaus.woodstox:wstx-asl:pom:3.2.9' in repository apache.snapshots (http://repository.apache.org/snapshots)
Downloading: http://uk.maven.org/maven2/org/codehaus/woodstox/wstx-asl/3.2.9/wstx-asl-3.2.9.pom
1K downloaded  (wstx-asl-3.2.9.pom)
Downloading: http://www.mygrid.org.uk/maven/repository/org/codehaus/woodstox/wstx-asl/3.2.6/wstx-asl-3.2.6.pom
[INFO] Unable to find resource 'org.codehaus.woodstox:wstx-asl:pom:3.2.6' in repository mygrid-repository (http://www.mygrid.org.uk/maven/repository)
Downloading: http://repository.apache.org/snapshots/org/codehaus/woodstox/wstx-asl/3.2.6/wstx-asl-3.2.6.pom
[INFO] Unable to find resource 'org.codehaus.woodstox:wstx-asl:pom:3.2.6' in repository apache.snapshots (http://repository.apache.org/snapshots)
Downloading: http://uk.maven.org/maven2/org/codehaus/woodstox/wstx-asl/3.2.6/wstx-asl-3.2.6.pom
1K downloaded  (wstx-asl-3.2.6.pom)
Downloading: http://www.mygrid.org.uk/maven/repository/xml-apis/xml-apis/1.3.02/xml-apis-1.3.02.pom
[INFO] Unable to find resource 'xml-apis:xml-apis:pom:1.3.02' in repository mygrid-repository (http://www.mygrid.org.uk/maven/repository)
Downloading: http://repository.apache.org/snapshots/xml-apis/xml-apis/1.3.02/xml-apis-1.3.02.pom
[INFO] Unable to find resource 'xml-apis:xml-apis:pom:1.3.02' in repository apache.snapshots (http://repository.apache.org/snapshots)
Downloading: http://uk.maven.org/maven2/xml-apis/xml-apis/1.3.02/xml-apis-1.3.02.pom
357b downloaded  (xml-apis-1.3.02.pom)
Downloading: http://www.mygrid.org.uk/maven/repository/xerces/xercesImpl/2.6.2/xercesImpl-2.6.2.pom
[INFO] Unable to find resource 'xerces:xercesImpl:pom:2.6.2' in repository mygrid-repository (http://www.mygrid.org.uk/maven/repository)
Downloading: http://repository.apache.org/snapshots/xerces/xercesImpl/2.6.2/xercesImpl-2.6.2.pom
[INFO] Unable to find resource 'xerces:xercesImpl:pom:2.6.2' in repository apache.snapshots (http://repository.apache.org/snapshots)
Downloading: http://uk.maven.org/maven2/xerces/xercesImpl/2.6.2/xercesImpl-2.6.2.pom
150b downloaded  (xercesImpl-2.6.2.pom)
Downloading: http://www.mygrid.org.uk/maven/repository/org/apache/abdera/abdera-server/1.1.2/abdera-server-1.1.2.pom
[INFO] Unable to find resource 'org.apache.abdera:abdera-server:pom:1.1.2' in repository mygrid-repository (http://www.mygrid.org.uk/maven/repository)
Downloading: http://uk.maven.org/maven2/org/apache/abdera/abdera-server/1.1.2/abdera-server-1.1.2.pom
3K downloaded  (abdera-server-1.1.2.pom)
Downloading: http://www.mygrid.org.uk/maven/repository/javax/servlet/servlet-api/2.5/servlet-api-2.5.pom
[INFO] Unable to find resource 'javax.servlet:servlet-api:pom:2.5' in repository mygrid-repository (http://www.mygrid.org.uk/maven/repository)
Downloading: http://uk.maven.org/maven2/javax/servlet/servlet-api/2.5/servlet-api-2.5.pom
157b downloaded  (servlet-api-2.5.pom)
Downloading: http://www.mygrid.org.uk/maven/repository/javax/mail/mail/1.4/mail-1.4.pom
[INFO] Unable to find resource 'javax.mail:mail:pom:1.4' in repository mygrid-repository (http://www.mygrid.org.uk/maven/repository)
Downloading: http://uk.maven.org/maven2/javax/mail/mail/1.4/mail-1.4.pom
993b downloaded  (mail-1.4.pom)
Downloading: http://www.mygrid.org.uk/maven/repository/javax/activation/activation/1.1/activation-1.1.pom
[INFO] Unable to find resource 'javax.activation:activation:pom:1.1' in repository mygrid-repository (http://www.mygrid.org.uk/maven/repository)
Downloading: http://uk.maven.org/maven2/javax/activation/activation/1.1/activation-1.1.pom
1K downloaded  (activation-1.1.pom)
Downloading: http://www.mygrid.org.uk/maven/repository/org/apache/abdera/abdera-extensions-main/1.1.2/abdera-extensions-main-1.1.2.pom
[INFO] Unable to find resource 'org.apache.abdera:abdera-extensions-main:pom:1.1.2' in repository mygrid-repository (http://www.mygrid.org.uk/maven/repository)
Downloading: http://uk.maven.org/maven2/org/apache/abdera/abdera-extensions-main/1.1.2/abdera-extensions-main-1.1.2.pom
1K downloaded  (abdera-extensions-main-1.1.2.pom)
Downloading: http://www.mygrid.org.uk/maven/repository/org/apache/abdera/abdera-extensions-html/1.1.2/abdera-extensions-html-1.1.2.pom
[INFO] Unable to find resource 'org.apache.abdera:abdera-extensions-html:pom:1.1.2' in repository mygrid-repository (http://www.mygrid.org.uk/maven/repository)
Downloading: http://uk.maven.org/maven2/org/apache/abdera/abdera-extensions-html/1.1.2/abdera-extensions-html-1.1.2.pom
1K downloaded  (abdera-extensions-html-1.1.2.pom)
Downloading: http://www.mygrid.org.uk/maven/repository/nu/validator/htmlparser/htmlparser/1.0.5/htmlparser-1.0.5.pom
[INFO] Unable to find resource 'nu.validator.htmlparser:htmlparser:pom:1.0.5' in repository mygrid-repository (http://www.mygrid.org.uk/maven/repository)
Downloading: http://uk.maven.org/maven2/nu/validator/htmlparser/htmlparser/1.0.5/htmlparser-1.0.5.pom
3K downloaded  (htmlparser-1.0.5.pom)
Downloading: http://www.mygrid.org.uk/maven/repository/org/apache/abdera/abdera-extensions-json/1.1.2/abdera-extensions-json-1.1.2.pom
[INFO] Unable to find resource 'org.apache.abdera:abdera-extensions-json:pom:1.1.2' in repository mygrid-repository (http://www.mygrid.org.uk/maven/repository)
Downloading: http://uk.maven.org/maven2/org/apache/abdera/abdera-extensions-json/1.1.2/abdera-extensions-json-1.1.2.pom
1K downloaded  (abdera-extensions-json-1.1.2.pom)
Downloading: http://www.mygrid.org.uk/maven/repository/org/apache/velocity/velocity/1.7/velocity-1.7.pom
[INFO] Unable to find resource 'org.apache.velocity:velocity:pom:1.7' in repository mygrid-repository (http://www.mygrid.org.uk/maven/repository)
Downloading: http://uk.maven.org/maven2/org/apache/velocity/velocity/1.7/velocity-1.7.pom
10K downloaded  (velocity-1.7.pom)
Downloading: http://www.mygrid.org.uk/maven/repository/commons-collections/commons-collections/3.2.1/commons-collections-3.2.1.pom
[INFO] Unable to find resource 'commons-collections:commons-collections:pom:3.2.1' in repository mygrid-repository (http://www.mygrid.org.uk/maven/repository)
Downloading: http://uk.maven.org/maven2/commons-collections/commons-collections/3.2.1/commons-collections-3.2.1.pom
12K downloaded  (commons-collections-3.2.1.pom)
Downloading: http://www.mygrid.org.uk/maven/repository/org/apache/commons/commons-parent/9/commons-parent-9.pom
[INFO] Unable to find resource 'org.apache.commons:commons-parent:pom:9' in repository mygrid-repository (http://www.mygrid.org.uk/maven/repository)
Downloading: http://uk.maven.org/maven2/org/apache/commons/commons-parent/9/commons-parent-9.pom
21K downloaded  (commons-parent-9.pom)
Downloading: http://www.mygrid.org.uk/maven/repository/commons-lang/commons-lang/2.4/commons-lang-2.4.pom
[INFO] Unable to find resource 'commons-lang:commons-lang:pom:2.4' in repository mygrid-repository (http://www.mygrid.org.uk/maven/repository)
Downloading: http://uk.maven.org/maven2/commons-lang/commons-lang/2.4/commons-lang-2.4.pom
13K downloaded  (commons-lang-2.4.pom)
Downloading: http://www.mygrid.org.uk/maven/repository/velocity-tools/velocity-tools-generic/1.2/velocity-tools-generic-1.2.pom
[INFO] Unable to find resource 'velocity-tools:velocity-tools-generic:pom:1.2' in repository mygrid-repository (http://www.mygrid.org.uk/maven/repository)
Downloading: http://uk.maven.org/maven2/velocity-tools/velocity-tools-generic/1.2/velocity-tools-generic-1.2.pom
168b downloaded  (velocity-tools-generic-1.2.pom)
Downloading: http://www.mygrid.org.uk/maven/repository/org/codehaus/jackson/jackson-core-lgpl/1.9.4/jackson-core-lgpl-1.9.4.pom
[INFO] Unable to find resource 'org.codehaus.jackson:jackson-core-lgpl:pom:1.9.4' in repository mygrid-repository (http://www.mygrid.org.uk/maven/repository)
Downloading: http://uk.maven.org/maven2/org/codehaus/jackson/jackson-core-lgpl/1.9.4/jackson-core-lgpl-1.9.4.pom
1021b downloaded  (jackson-core-lgpl-1.9.4.pom)
Downloading: http://www.mygrid.org.uk/maven/repository/org/codehaus/jackson/jackson-mapper-lgpl/1.9.4/jackson-mapper-lgpl-1.9.4.pom
[INFO] Unable to find resource 'org.codehaus.jackson:jackson-mapper-lgpl:pom:1.9.4' in repository mygrid-repository (http://www.mygrid.org.uk/maven/repository)
Downloading: http://uk.maven.org/maven2/org/codehaus/jackson/jackson-mapper-lgpl/1.9.4/jackson-mapper-lgpl-1.9.4.pom
1K downloaded  (jackson-mapper-lgpl-1.9.4.pom)
Downloading: http://www.mygrid.org.uk/maven/repository/org/mortbay/jetty/jetty/6.1.24/jetty-6.1.24.jar
Downloading: http://www.mygrid.org.uk/maven/repository/net/sf/taverna/t2/core/workflowmodel-api/1.4/workflowmodel-api-1.4.jar
[INFO] Unable to find resource 'org.mortbay.jetty:jetty:jar:6.1.24' in repository mygrid-repository (http://www.mygrid.org.uk/maven/repository)
Downloading: http://www.mygrid.org.uk/maven/repository/net/sf/taverna/t2/infrastructure/spi-discovery-api/2.4/spi-discovery-api-2.4.jar
Downloading: http://www.mygrid.org.uk/maven/repository/commons-httpclient/commons-httpclient/3.1/commons-httpclient-3.1.jar
Downloading: http://www.mygrid.org.uk/maven/repository/org/springframework/spring-tx/2.5.4/spring-tx-2.5.4.jar
Downloading: http://uk.maven.org/maven2/org/mortbay/jetty/jetty/6.1.24/jetty-6.1.24.jar
[INFO] Unable to find resource 'org.springframework:spring-tx:jar:2.5.4' in repository mygrid-repository (http://www.mygrid.org.uk/maven/repository)
Downloading: http://uk.maven.org/maven2//org/springframework/spring-tx/2.5.4/spring-tx-2.5.4.jar
[INFO] Unable to find resource 'commons-httpclient:commons-httpclient:jar:3.1' in repository mygrid-repository (http://www.mygrid.org.uk/maven/repository)
Downloading: http://uk.maven.org/maven2/commons-httpclient/commons-httpclient/3.1/commons-httpclient-3.1.jar
167K downloaded  (workflowmodel-api-1.4.jar)
5K downloaded  (spi-discovery-api-2.4.jar)
Downloading: http://www.mygrid.org.uk/maven/repository/javax/servlet/servlet-api/2.5/servlet-api-2.5.jar
Downloading: http://www.mygrid.org.uk/maven/repository/net/sf/webdav-servlet/webdav-servlet/2.0/webdav-servlet-2.0.jar
[INFO] Unable to find resource 'javax.servlet:servlet-api:jar:2.5' in repository mygrid-repository (http://www.mygrid.org.uk/maven/repository)
Downloading: http://uk.maven.org/maven2/javax/servlet/servlet-api/2.5/servlet-api-2.5.jar
525K downloaded  (jetty-6.1.24.jar)
[INFO] Unable to find resource 'net.sf.webdav-servlet:webdav-servlet:jar:2.0' in repository mygrid-repository (http://www.mygrid.org.uk/maven/repository)
Downloading: http://www.mygrid.org.uk/maven/repository/org/apache/geronimo/specs/geronimo-activation_1.0.2_spec/1.1/geronimo-activation_1.0.2_spec-1.1.jar
Downloading: http://uk.maven.org/maven2/net/sf/webdav-servlet/webdav-servlet/2.0/webdav-servlet-2.0.jar
[INFO] Unable to find resource 'org.apache.geronimo.specs:geronimo-activation_1.0.2_spec:jar:1.1' in repository mygrid-repository (http://www.mygrid.org.uk/maven/repository)
Downloading: http://uk.maven.org/maven2/org/apache/geronimo/specs/geronimo-activation_1.0.2_spec/1.1/geronimo-activation_1.0.2_spec-1.1.jar
297K downloaded  (commons-httpclient-3.1.jar)
Downloading: http://www.mygrid.org.uk/maven/repository/commons-lang/commons-lang/2.4/commons-lang-2.4.jar
222K downloaded  (spring-tx-2.5.4.jar)
102K downloaded  (servlet-api-2.5.jar)
[INFO] Unable to find resource 'commons-lang:commons-lang:jar:2.4' in repository mygrid-repository (http://www.mygrid.org.uk/maven/repository)
Downloading: http://uk.maven.org/maven2/commons-lang/commons-lang/2.4/commons-lang-2.4.jar
Downloading: http://www.mygrid.org.uk/maven/repository/org/jdom/jdom/1.1/jdom-1.1.jar
Downloading: http://www.mygrid.org.uk/maven/repository/commons-logging/commons-logging/1.0.4/commons-logging-1.0.4.jar
[INFO] Unable to find resource 'commons-logging:commons-logging:jar:1.0.4' in repository mygrid-repository (http://www.mygrid.org.uk/maven/repository)
Downloading: http://uk.maven.org/maven2/commons-logging/commons-logging/1.0.4/commons-logging-1.0.4.jar
[INFO] Unable to find resource 'org.jdom:jdom:jar:1.1' in repository mygrid-repository (http://www.mygrid.org.uk/maven/repository)
Downloading: http://uk.maven.org/maven2//org/jdom/jdom/1.1/jdom-1.1.jar
37K downloaded  (commons-logging-1.0.4.jar)
255K downloaded  (commons-lang-2.4.jar)
Downloading: http://www.mygrid.org.uk/maven/repository/xml-apis/xml-apis/1.3.02/xml-apis-1.3.02.jar
Downloading: http://www.mygrid.org.uk/maven/repository/commons-collections/commons-collections/3.2.1/commons-collections-3.2.1.jar
[INFO] Unable to find resource 'commons-collections:commons-collections:jar:3.2.1' in repository mygrid-repository (http://www.mygrid.org.uk/maven/repository)
Downloading: http://uk.maven.org/maven2/commons-collections/commons-collections/3.2.1/commons-collections-3.2.1.jar
[INFO] Unable to find resource 'xml-apis:xml-apis:jar:1.3.02' in repository mygrid-repository (http://www.mygrid.org.uk/maven/repository)
Downloading: http://repository.apache.org/snapshots/xml-apis/xml-apis/1.3.02/xml-apis-1.3.02.jar
149K downloaded  (jdom-1.1.jar)
Downloading: http://www.mygrid.org.uk/maven/repository/xerces/xercesImpl/2.6.2/xercesImpl-2.6.2.jar
[INFO] Unable to find resource 'xerces:xercesImpl:jar:2.6.2' in repository mygrid-repository (http://www.mygrid.org.uk/maven/repository)
Downloading: http://repository.apache.org/snapshots/xerces/xercesImpl/2.6.2/xercesImpl-2.6.2.jar
32K downloaded  (geronimo-activation_1.0.2_spec-1.1.jar)
Downloading: http://www.mygrid.org.uk/maven/repository/org/apache/abdera/abdera-core/1.1.2/abdera-core-1.1.2.jar
[INFO] Unable to find resource 'org.apache.abdera:abdera-core:jar:1.1.2' in repository mygrid-repository (http://www.mygrid.org.uk/maven/repository)
Downloading: http://uk.maven.org/maven2/org/apache/abdera/abdera-core/1.1.2/abdera-core-1.1.2.jar
156K downloaded  (abdera-core-1.1.2.jar)
Downloading: http://www.mygrid.org.uk/maven/repository/org/codehaus/woodstox/wstx-asl/3.2.6/wstx-asl-3.2.6.jar
[INFO] Unable to find resource 'org.codehaus.woodstox:wstx-asl:jar:3.2.6' in repository mygrid-repository (http://www.mygrid.org.uk/maven/repository)
Downloading: http://repository.apache.org/snapshots/org/codehaus/woodstox/wstx-asl/3.2.6/wstx-asl-3.2.6.jar
561K downloaded  (commons-collections-3.2.1.jar)
81K downloaded  (webdav-servlet-2.0.jar)
Downloading: http://www.mygrid.org.uk/maven/repository/net/sf/taverna/t2/lang/observer/1.4/observer-1.4.jar
4K downloaded  (observer-1.4.jar)
Downloading: http://www.mygrid.org.uk/maven/repository/aopalliance/aopalliance/1.0/aopalliance-1.0.jar
[INFO] Unable to find resource 'aopalliance:aopalliance:jar:1.0' in repository mygrid-repository (http://www.mygrid.org.uk/maven/repository)
Downloading: http://uk.maven.org/maven2//aopalliance/aopalliance/1.0/aopalliance-1.0.jar
4K downloaded  (aopalliance-1.0.jar)
Downloading: http://www.mygrid.org.uk/maven/repository/org/slf4j/slf4j-api/1.4.3/slf4j-api-1.4.3.jar
[INFO] Unable to find resource 'org.slf4j:slf4j-api:jar:1.4.3' in repository mygrid-repository (http://www.mygrid.org.uk/maven/repository)
Downloading: http://uk.maven.org/maven2/org/slf4j/slf4j-api/1.4.3/slf4j-api-1.4.3.jar
14K downloaded  (slf4j-api-1.4.3.jar)
Downloading: http://www.mygrid.org.uk/maven/repository/commons-io/commons-io/2.4/commons-io-2.4.jar
Downloading: http://www.mygrid.org.uk/maven/repository/javax/activation/activation/1.1/activation-1.1.jar
[INFO] Unable to find resource 'commons-io:commons-io:jar:2.4' in repository mygrid-repository (http://www.mygrid.org.uk/maven/repository)
Downloading: http://uk.maven.org/maven2/commons-io/commons-io/2.4/commons-io-2.4.jar
180K downloaded  (commons-io-2.4.jar)
Downloading: http://www.mygrid.org.uk/maven/repository/velocity-tools/velocity-tools-generic/1.2/velocity-tools-generic-1.2.jar
[INFO] Unable to find resource 'xml-apis:xml-apis:jar:1.3.02' in repository apache.snapshots (http://repository.apache.org/snapshots)
Downloading: http://uk.maven.org/maven2/xml-apis/xml-apis/1.3.02/xml-apis-1.3.02.jar
[INFO] Unable to find resource 'xerces:xercesImpl:jar:2.6.2' in repository apache.snapshots (http://repository.apache.org/snapshots)
Downloading: http://uk.maven.org/maven2/xerces/xercesImpl/2.6.2/xercesImpl-2.6.2.jar
189K downloaded  (xml-apis-1.3.02.jar)
Downloading: http://www.mygrid.org.uk/maven/repository/org/apache/velocity/velocity/1.7/velocity-1.7.jar
[INFO] Unable to find resource 'org.codehaus.woodstox:wstx-asl:jar:3.2.6' in repository apache.snapshots (http://repository.apache.org/snapshots)
Downloading: http://uk.maven.org/maven2/org/codehaus/woodstox/wstx-asl/3.2.6/wstx-asl-3.2.6.jar
[INFO] Unable to find resource 'javax.activation:activation:jar:1.1' in repository mygrid-repository (http://www.mygrid.org.uk/maven/repository)
Downloading: http://uk.maven.org/maven2/javax/activation/activation/1.1/activation-1.1.jar
[INFO] Unable to find resource 'velocity-tools:velocity-tools-generic:jar:1.2' in repository mygrid-repository (http://www.mygrid.org.uk/maven/repository)
61K downloaded  (activation-1.1.jar)
Downloading: http://uk.maven.org/maven2/velocity-tools/velocity-tools-generic/1.2/velocity-tools-generic-1.2.jar
Downloading: http://www.mygrid.org.uk/maven/repository/org/apache/ws/commons/axiom/axiom-impl/1.2.10/axiom-impl-1.2.10.jar
508K downloaded  (wstx-asl-3.2.6.jar)
Downloading: http://www.mygrid.org.uk/maven/repository/net/sf/taverna/t2/security/credential-manager/1.4/credential-manager-1.4.jar
[INFO] Unable to find resource 'org.apache.velocity:velocity:jar:1.7' in repository mygrid-repository (http://www.mygrid.org.uk/maven/repository)
Downloading: http://uk.maven.org/maven2/org/apache/velocity/velocity/1.7/velocity-1.7.jar
[INFO] Unable to find resource 'org.apache.ws.commons.axiom:axiom-impl:jar:1.2.10' in repository mygrid-repository (http://www.mygrid.org.uk/maven/repository)
Downloading: http://repository.apache.org/snapshots/org/apache/ws/commons/axiom/axiom-impl/1.2.10/axiom-impl-1.2.10.jar
986K downloaded  (xercesImpl-2.6.2.jar)
18K downloaded  (velocity-tools-generic-1.2.jar)
Downloading: http://www.mygrid.org.uk/maven/repository/jaxen/jaxen/1.1.1/jaxen-1.1.1.jar
64K downloaded  (credential-manager-1.4.jar)
[INFO] Unable to find resource 'jaxen:jaxen:jar:1.1.1' in repository mygrid-repository (http://www.mygrid.org.uk/maven/repository)
Downloading: http://repository.apache.org/snapshots/jaxen/jaxen/1.1.1/jaxen-1.1.1.jar
Downloading: http://www.mygrid.org.uk/maven/repository/commons-codec/commons-codec/1.4/commons-codec-1.4.jar
438K downloaded  (velocity-1.7.jar)
Downloading: http://www.mygrid.org.uk/maven/repository/org/codehaus/jackson/jackson-core-lgpl/1.9.4/jackson-core-lgpl-1.9.4.jar
[INFO] Unable to find resource 'commons-codec:commons-codec:jar:1.4' in repository mygrid-repository (http://www.mygrid.org.uk/maven/repository)
Downloading: http://uk.maven.org/maven2/commons-codec/commons-codec/1.4/commons-codec-1.4.jar
Downloading: http://www.mygrid.org.uk/maven/repository/bouncycastle/bcprov-jdk16/140/bcprov-jdk16-140.jar
56K downloaded  (commons-codec-1.4.jar)
Downloading: http://www.mygrid.org.uk/maven/repository/javax/mail/mail/1.4/mail-1.4.jar
[INFO] Unable to find resource 'org.apache.ws.commons.axiom:axiom-impl:jar:1.2.10' in repository apache.snapshots (http://repository.apache.org/snapshots)
Downloading: http://uk.maven.org/maven2/org/apache/ws/commons/axiom/axiom-impl/1.2.10/axiom-impl-1.2.10.jar
118K downloaded  (axiom-impl-1.2.10.jar)
Downloading: http://www.mygrid.org.uk/maven/repository/nu/validator/htmlparser/htmlparser/1.0.5/htmlparser-1.0.5.jar
[INFO] Unable to find resource 'jaxen:jaxen:jar:1.1.1' in repository apache.snapshots (http://repository.apache.org/snapshots)
Downloading: http://uk.maven.org/maven2/jaxen/jaxen/1.1.1/jaxen-1.1.1.jar
[INFO] Unable to find resource 'org.codehaus.jackson:jackson-core-lgpl:jar:1.9.4' in repository mygrid-repository (http://www.mygrid.org.uk/maven/repository)
Downloading: http://uk.maven.org/maven2/org/codehaus/jackson/jackson-core-lgpl/1.9.4/jackson-core-lgpl-1.9.4.jar
228K downloaded  (jackson-core-lgpl-1.9.4.jar)
221K downloaded  (jaxen-1.1.1.jar)
Downloading: http://www.mygrid.org.uk/maven/repository/log4j/log4j/1.2.12/log4j-1.2.12.jar
Downloading: http://www.mygrid.org.uk/maven/repository/net/sf/taverna/t2/core/reference-api/1.4/reference-api-1.4.jar
[INFO] Unable to find resource 'bouncycastle:bcprov-jdk16:jar:140' in repository mygrid-repository (http://www.mygrid.org.uk/maven/repository)
Downloading: http://uk.maven.org/maven2//bouncycastle/bcprov-jdk16/140/bcprov-jdk16-140.jar
[INFO] Unable to find resource 'javax.mail:mail:jar:1.4' in repository mygrid-repository (http://www.mygrid.org.uk/maven/repository)
Downloading: http://uk.maven.org/maven2/javax/mail/mail/1.4/mail-1.4.jar
[INFO] Unable to find resource 'nu.validator.htmlparser:htmlparser:jar:1.0.5' in repository mygrid-repository (http://www.mygrid.org.uk/maven/repository)
Downloading: http://uk.maven.org/maven2/nu/validator/htmlparser/htmlparser/1.0.5/htmlparser-1.0.5.jar
[INFO] Unable to find resource 'log4j:log4j:jar:1.2.12' in repository mygrid-repository (http://www.mygrid.org.uk/maven/repository)
Downloading: http://uk.maven.org/maven2/log4j/log4j/1.2.12/log4j-1.2.12.jar
349K downloaded  (log4j-1.2.12.jar)
27K downloaded  (reference-api-1.4.jar)
Downloading: http://www.mygrid.org.uk/maven/repository/net/sf/taverna/t2/infrastructure/raven/2.4/raven-2.4.jar
Downloading: http://www.mygrid.org.uk/maven/repository/org/mortbay/jetty/jetty-util/6.1.24/jetty-util-6.1.24.jar
[INFO] Unable to find resource 'org.mortbay.jetty:jetty-util:jar:6.1.24' in repository mygrid-repository (http://www.mygrid.org.uk/maven/repository)
Downloading: http://uk.maven.org/maven2/org/mortbay/jetty/jetty-util/6.1.24/jetty-util-6.1.24.jar
379K downloaded  (mail-1.4.jar)
Downloading: http://www.mygrid.org.uk/maven/repository/org/springframework/spring-beans/2.5.4/spring-beans-2.5.4.jar
84K downloaded  (raven-2.4.jar)
Downloading: http://www.mygrid.org.uk/maven/repository/org/apache/geronimo/specs/geronimo-stax-api_1.0_spec/1.0.1/geronimo-stax-api_1.0_spec-1.0.1.jar
[INFO] Unable to find resource 'org.springframework:spring-beans:jar:2.5.4' in repository mygrid-repository (http://www.mygrid.org.uk/maven/repository)
Downloading: http://uk.maven.org/maven2//org/springframework/spring-beans/2.5.4/spring-beans-2.5.4.jar
[INFO] Unable to find resource 'org.apache.geronimo.specs:geronimo-stax-api_1.0_spec:jar:1.0.1' in repository mygrid-repository (http://www.mygrid.org.uk/maven/repository)
173K downloaded  (jetty-util-6.1.24.jar)
Downloading: http://uk.maven.org/maven2/org/apache/geronimo/specs/geronimo-stax-api_1.0_spec/1.0.1/geronimo-stax-api_1.0_spec-1.0.1.jar
Downloading: http://www.mygrid.org.uk/maven/repository/org/apache/abdera/abdera-i18n/1.1.2/abdera-i18n-1.1.2.jar
28K downloaded  (geronimo-stax-api_1.0_spec-1.0.1.jar)
[INFO] Unable to find resource 'org.apache.abdera:abdera-i18n:jar:1.1.2' in repository mygrid-repository (http://www.mygrid.org.uk/maven/repository)
Downloading: http://uk.maven.org/maven2/org/apache/abdera/abdera-i18n/1.1.2/abdera-i18n-1.1.2.jar
Downloading: http://www.mygrid.org.uk/maven/repository/org/slf4j/slf4j-log4j12/1.4.3/slf4j-log4j12-1.4.3.jar
[INFO] Unable to find resource 'org.slf4j:slf4j-log4j12:jar:1.4.3' in repository mygrid-repository (http://www.mygrid.org.uk/maven/repository)
Downloading: http://uk.maven.org/maven2/org/slf4j/slf4j-log4j12/1.4.3/slf4j-log4j12-1.4.3.jar
8K downloaded  (slf4j-log4j12-1.4.3.jar)
Downloading: http://www.mygrid.org.uk/maven/repository/org/apache/ws/commons/axiom/axiom-api/1.2.10/axiom-api-1.2.10.jar
[INFO] Unable to find resource 'org.apache.ws.commons.axiom:axiom-api:jar:1.2.10' in repository mygrid-repository (http://www.mygrid.org.uk/maven/repository)
Downloading: http://repository.apache.org/snapshots/org/apache/ws/commons/axiom/axiom-api/1.2.10/axiom-api-1.2.10.jar
132K downloaded  (htmlparser-1.0.5.jar)
603K downloaded  (abdera-i18n-1.1.2.jar)
Downloading: http://www.mygrid.org.uk/maven/repository/org/codehaus/jackson/jackson-mapper-lgpl/1.9.4/jackson-mapper-lgpl-1.9.4.jar
[INFO] Unable to find resource 'org.codehaus.jackson:jackson-mapper-lgpl:jar:1.9.4' in repository mygrid-repository (http://www.mygrid.org.uk/maven/repository)
Downloading: http://uk.maven.org/maven2/org/codehaus/jackson/jackson-mapper-lgpl/1.9.4/jackson-mapper-lgpl-1.9.4.jar
Downloading: http://www.mygrid.org.uk/maven/repository/net/sf/taverna/t2/infrastructure/raven-log4j/2.4/raven-log4j-2.4.jar
3K downloaded  (raven-log4j-2.4.jar)
Downloading: http://www.mygrid.org.uk/maven/repository/org/mortbay/jetty/servlet-api/2.5-20081211/servlet-api-2.5-20081211.jar
[INFO] Unable to find resource 'org.mortbay.jetty:servlet-api:jar:2.5-20081211' in repository mygrid-repository (http://www.mygrid.org.uk/maven/repository)
Downloading: http://uk.maven.org/maven2/org/mortbay/jetty/servlet-api/2.5-20081211/servlet-api-2.5-20081211.jar
130K downloaded  (servlet-api-2.5-20081211.jar)
Downloading: http://www.mygrid.org.uk/maven/repository/org/apache/geronimo/specs/geronimo-activation_1.1_spec/1.0.2/geronimo-activation_1.1_spec-1.0.2.jar
[INFO] Unable to find resource 'org.apache.geronimo.specs:geronimo-activation_1.1_spec:jar:1.0.2' in repository mygrid-repository (http://www.mygrid.org.uk/maven/repository)
Downloading: http://repository.apache.org/snapshots/org/apache/geronimo/specs/geronimo-activation_1.1_spec/1.0.2/geronimo-activation_1.1_spec-1.0.2.jar
1613K downloaded  (bcprov-jdk16-140.jar)
Downloading: http://www.mygrid.org.uk/maven/repository/org/apache/abdera/abdera-client/1.1.2/abdera-client-1.1.2.jar
[INFO] Unable to find resource 'org.apache.abdera:abdera-client:jar:1.1.2' in repository mygrid-repository (http://www.mygrid.org.uk/maven/repository)
Downloading: http://uk.maven.org/maven2/org/apache/abdera/abdera-client/1.1.2/abdera-client-1.1.2.jar
[INFO] Unable to find resource 'org.apache.ws.commons.axiom:axiom-api:jar:1.2.10' in repository apache.snapshots (http://repository.apache.org/snapshots)
Downloading: http://uk.maven.org/maven2/org/apache/ws/commons/axiom/axiom-api/1.2.10/axiom-api-1.2.10.jar
407K downloaded  (axiom-api-1.2.10.jar)
Downloading: http://www.mygrid.org.uk/maven/repository/net/sf/taverna/t2/infrastructure/appconfig/2.4/appconfig-2.4.jar
35K downloaded  (appconfig-2.4.jar)
Downloading: http://www.mygrid.org.uk/maven/repository/net/sf/taverna/t2/infrastructure/launcher-api/2.4/launcher-api-2.4.jar
2K downloaded  (launcher-api-2.4.jar)
59K downloaded  (abdera-client-1.1.2.jar)
Downloading: http://www.mygrid.org.uk/maven/repository/net/sf/taverna/t2/infrastructure/prelauncher/2.4/prelauncher-2.4.jar
8K downloaded  (prelauncher-2.4.jar)
[INFO] Unable to find resource 'org.apache.geronimo.specs:geronimo-activation_1.1_spec:jar:1.0.2' in repository apache.snapshots (http://repository.apache.org/snapshots)
Downloading: http://uk.maven.org/maven2/org/apache/geronimo/specs/geronimo-activation_1.1_spec/1.0.2/geronimo-activation_1.1_spec-1.0.2.jar
33K downloaded  (geronimo-activation_1.1_spec-1.0.2.jar)
Downloading: http://www.mygrid.org.uk/maven/repository/org/apache/geronimo/specs/geronimo-javamail_1.4_spec/1.6/geronimo-javamail_1.4_spec-1.6.jar
[INFO] Unable to find resource 'org.apache.geronimo.specs:geronimo-javamail_1.4_spec:jar:1.6' in repository mygrid-repository (http://www.mygrid.org.uk/maven/repository)
Downloading: http://repository.apache.org/snapshots/org/apache/geronimo/specs/geronimo-javamail_1.4_spec/1.6/geronimo-javamail_1.4_spec-1.6.jar
Downloading: http://www.mygrid.org.uk/maven/repository/org/apache/abdera/abdera-parser/1.1.2/abdera-parser-1.1.2.jar
[INFO] Unable to find resource 'org.apache.abdera:abdera-parser:jar:1.1.2' in repository mygrid-repository (http://www.mygrid.org.uk/maven/repository)
Downloading: http://uk.maven.org/maven2/org/apache/abdera/abdera-parser/1.1.2/abdera-parser-1.1.2.jar
472K downloaded  (spring-beans-2.5.4.jar)
Downloading: http://www.mygrid.org.uk/maven/repository/org/springframework/spring-core/2.5.4/spring-core-2.5.4.jar
[INFO] Unable to find resource 'org.springframework:spring-core:jar:2.5.4' in repository mygrid-repository (http://www.mygrid.org.uk/maven/repository)
Downloading: http://uk.maven.org/maven2//org/springframework/spring-core/2.5.4/spring-core-2.5.4.jar
949K downloaded  (abdera-parser-1.1.2.jar)
Downloading: http://www.mygrid.org.uk/maven/repository/org/apache/abdera/abdera-server/1.1.2/abdera-server-1.1.2.jar
[INFO] Unable to find resource 'org.apache.abdera:abdera-server:jar:1.1.2' in repository mygrid-repository (http://www.mygrid.org.uk/maven/repository)
[INFO] Unable to find resource 'org.apache.geronimo.specs:geronimo-javamail_1.4_spec:jar:1.6' in repository apache.snapshots (http://repository.apache.org/snapshots)
Downloading: http://uk.maven.org/maven2/org/apache/abdera/abdera-server/1.1.2/abdera-server-1.1.2.jar
Downloading: http://uk.maven.org/maven2/org/apache/geronimo/specs/geronimo-javamail_1.4_spec/1.6/geronimo-javamail_1.4_spec-1.6.jar
764K downloaded  (jackson-mapper-lgpl-1.9.4.jar)
200K downloaded  (geronimo-javamail_1.4_spec-1.6.jar)
279K downloaded  (spring-core-2.5.4.jar)
157K downloaded  (abdera-server-1.1.2.jar)
Downloading: http://www.mygrid.org.uk/maven/repository/org/springframework/spring-context/2.5.4/spring-context-2.5.4.jar
[INFO] Unable to find resource 'org.springframework:spring-context:jar:2.5.4' in repository mygrid-repository (http://www.mygrid.org.uk/maven/repository)
Downloading: http://uk.maven.org/maven2//org/springframework/spring-context/2.5.4/spring-context-2.5.4.jar
Downloading: http://www.mygrid.org.uk/maven/repository/org/apache/abdera/abdera-extensions-main/1.1.2/abdera-extensions-main-1.1.2.jar
[INFO] Unable to find resource 'org.apache.abdera:abdera-extensions-main:jar:1.1.2' in repository mygrid-repository (http://www.mygrid.org.uk/maven/repository)
Downloading: http://uk.maven.org/maven2/org/apache/abdera/abdera-extensions-main/1.1.2/abdera-extensions-main-1.1.2.jar
25K downloaded  (abdera-extensions-main-1.1.2.jar)
Downloading: http://www.mygrid.org.uk/maven/repository/org/apache/abdera/abdera-extensions-html/1.1.2/abdera-extensions-html-1.1.2.jar
[INFO] Unable to find resource 'org.apache.abdera:abdera-extensions-html:jar:1.1.2' in repository mygrid-repository (http://www.mygrid.org.uk/maven/repository)
Downloading: http://uk.maven.org/maven2/org/apache/abdera/abdera-extensions-html/1.1.2/abdera-extensions-html-1.1.2.jar
458K downloaded  (spring-context-2.5.4.jar)
16K downloaded  (abdera-extensions-html-1.1.2.jar)
Downloading: http://www.mygrid.org.uk/maven/repository/org/apache/abdera/abdera-extensions-json/1.1.2/abdera-extensions-json-1.1.2.jar
[INFO] Unable to find resource 'org.apache.abdera:abdera-extensions-json:jar:1.1.2' in repository mygrid-repository (http://www.mygrid.org.uk/maven/repository)
Downloading: http://uk.maven.org/maven2/org/apache/abdera/abdera-extensions-json/1.1.2/abdera-extensions-json-1.1.2.jar
26K downloaded  (abdera-extensions-json-1.1.2.jar)
Downloading: http://www.mygrid.org.uk/maven/repository/org/apache/maven/maven-toolchain/1.0/maven-toolchain-1.0.pom
[INFO] Unable to find resource 'org.apache.maven:maven-toolchain:pom:1.0' in repository mygrid-repository (http://www.mygrid.org.uk/maven/repository)
Downloading: http://uk.maven.org/maven2/org/apache/maven/maven-toolchain/1.0/maven-toolchain-1.0.pom
3K downloaded  (maven-toolchain-1.0.pom)
Downloading: http://www.mygrid.org.uk/maven/repository/org/codehaus/plexus/plexus-compiler-api/1.8.1/plexus-compiler-api-1.8.1.pom
[INFO] Unable to find resource 'org.codehaus.plexus:plexus-compiler-api:pom:1.8.1' in repository mygrid-repository (http://www.mygrid.org.uk/maven/repository)
Downloading: http://uk.maven.org/maven2/org/codehaus/plexus/plexus-compiler-api/1.8.1/plexus-compiler-api-1.8.1.pom
805b downloaded  (plexus-compiler-api-1.8.1.pom)
Downloading: http://www.mygrid.org.uk/maven/repository/org/codehaus/plexus/plexus-compiler/1.8.1/plexus-compiler-1.8.1.pom
[INFO] Unable to find resource 'org.codehaus.plexus:plexus-compiler:pom:1.8.1' in repository mygrid-repository (http://www.mygrid.org.uk/maven/repository)
Downloading: http://uk.maven.org/maven2/org/codehaus/plexus/plexus-compiler/1.8.1/plexus-compiler-1.8.1.pom
3K downloaded  (plexus-compiler-1.8.1.pom)
Downloading: http://www.mygrid.org.uk/maven/repository/org/codehaus/plexus/plexus-components/1.1.18/plexus-components-1.1.18.pom
[INFO] Unable to find resource 'org.codehaus.plexus:plexus-components:pom:1.1.18' in repository mygrid-repository (http://www.mygrid.org.uk/maven/repository)
Downloading: http://uk.maven.org/maven2/org/codehaus/plexus/plexus-components/1.1.18/plexus-components-1.1.18.pom
5K downloaded  (plexus-components-1.1.18.pom)
Downloading: http://www.mygrid.org.uk/maven/repository/org/codehaus/plexus/plexus/2.0.7/plexus-2.0.7.pom
[INFO] Unable to find resource 'org.codehaus.plexus:plexus:pom:2.0.7' in repository mygrid-repository (http://www.mygrid.org.uk/maven/repository)
Downloading: http://uk.maven.org/maven2/org/codehaus/plexus/plexus/2.0.7/plexus-2.0.7.pom
16K downloaded  (plexus-2.0.7.pom)
Downloading: http://www.mygrid.org.uk/maven/repository/org/codehaus/plexus/plexus-compiler-manager/1.8.1/plexus-compiler-manager-1.8.1.pom
[INFO] Unable to find resource 'org.codehaus.plexus:plexus-compiler-manager:pom:1.8.1' in repository mygrid-repository (http://www.mygrid.org.uk/maven/repository)
Downloading: http://uk.maven.org/maven2/org/codehaus/plexus/plexus-compiler-manager/1.8.1/plexus-compiler-manager-1.8.1.pom
713b downloaded  (plexus-compiler-manager-1.8.1.pom)
Downloading: http://www.mygrid.org.uk/maven/repository/org/codehaus/plexus/plexus-compiler-javac/1.8.1/plexus-compiler-javac-1.8.1.pom
[INFO] Unable to find resource 'org.codehaus.plexus:plexus-compiler-javac:pom:1.8.1' in repository mygrid-repository (http://www.mygrid.org.uk/maven/repository)
Downloading: http://uk.maven.org/maven2/org/codehaus/plexus/plexus-compiler-javac/1.8.1/plexus-compiler-javac-1.8.1.pom
710b downloaded  (plexus-compiler-javac-1.8.1.pom)
Downloading: http://www.mygrid.org.uk/maven/repository/org/codehaus/plexus/plexus-compilers/1.8.1/plexus-compilers-1.8.1.pom
[INFO] Unable to find resource 'org.codehaus.plexus:plexus-compilers:pom:1.8.1' in repository mygrid-repository (http://www.mygrid.org.uk/maven/repository)
Downloading: http://uk.maven.org/maven2/org/codehaus/plexus/plexus-compilers/1.8.1/plexus-compilers-1.8.1.pom
1K downloaded  (plexus-compilers-1.8.1.pom)
Downloading: http://www.mygrid.org.uk/maven/repository/org/codehaus/plexus/plexus-compiler-api/1.8.1/plexus-compiler-api-1.8.1.jar
[INFO] Unable to find resource 'org.codehaus.plexus:plexus-compiler-api:jar:1.8.1' in repository mygrid-repository (http://www.mygrid.org.uk/maven/repository)
Downloading: http://uk.maven.org/maven2/org/codehaus/plexus/plexus-compiler-api/1.8.1/plexus-compiler-api-1.8.1.jar
19K downloaded  (plexus-compiler-api-1.8.1.jar)
Downloading: http://www.mygrid.org.uk/maven/repository/org/codehaus/plexus/plexus-compiler-manager/1.8.1/plexus-compiler-manager-1.8.1.jar
[INFO] Unable to find resource 'org.codehaus.plexus:plexus-compiler-manager:jar:1.8.1' in repository mygrid-repository (http://www.mygrid.org.uk/maven/repository)
Downloading: http://uk.maven.org/maven2/org/codehaus/plexus/plexus-compiler-manager/1.8.1/plexus-compiler-manager-1.8.1.jar
5K downloaded  (plexus-compiler-manager-1.8.1.jar)
Downloading: http://www.mygrid.org.uk/maven/repository/org/codehaus/plexus/plexus-compiler-javac/1.8.1/plexus-compiler-javac-1.8.1.jar
[INFO] Unable to find resource 'org.codehaus.plexus:plexus-compiler-javac:jar:1.8.1' in repository mygrid-repository (http://www.mygrid.org.uk/maven/repository)
Downloading: http://uk.maven.org/maven2/org/codehaus/plexus/plexus-compiler-javac/1.8.1/plexus-compiler-javac-1.8.1.jar
12K downloaded  (plexus-compiler-javac-1.8.1.jar)
[INFO] [compiler:compile {execution: default-compile}]
[WARNING] File encoding has not been set, using platform encoding ANSI_X3.4-1968, i.e. build is platform dependent!
[INFO] Compiling 22 source files to /var/lib/jenkins/workspace/Interaction Service/interaction-activity/target/classes
[INFO] [resources:testResources {execution: default-testResources}]
[WARNING] Using platform encoding (ANSI_X3.4-1968 actually) to copy filtered resources, i.e. build is platform dependent!
[INFO] skip non existing resourceDirectory /var/lib/jenkins/workspace/Interaction Service/interaction-activity/src/test/resources
Downloading: http://www.mygrid.org.uk/maven/repository/dom4j/dom4j/1.6.1/dom4j-1.6.1.jar
Downloading: http://www.mygrid.org.uk/maven/repository/org/aspectj/aspectjrt/1.6.9/aspectjrt-1.6.9.jar
Downloading: http://www.mygrid.org.uk/maven/repository/net/sf/taverna/t2/activities/activity-test-utils/1.4/activity-test-utils-1.4.jar
[INFO] Unable to find resource 'org.aspectj:aspectjrt:jar:1.6.9' in repository mygrid-repository (http://www.mygrid.org.uk/maven/repository)
[INFO] Unable to find resource 'dom4j:dom4j:jar:1.6.1' in repository mygrid-repository (http://www.mygrid.org.uk/maven/repository)
Downloading: http://uk.maven.org/maven2//org/aspectj/aspectjrt/1.6.9/aspectjrt-1.6.9.jar
Downloading: http://www.mygrid.org.uk/maven/repository/xmlpull/xmlpull/1.1.3.1/xmlpull-1.1.3.1.jar
Downloading: http://www.mygrid.org.uk/maven/repository/xpp3/xpp3_min/1.1.4c/xpp3_min-1.1.4c.jar
Downloading: http://uk.maven.org/maven2//dom4j/dom4j/1.6.1/dom4j-1.6.1.jar
13K downloaded  (activity-test-utils-1.4.jar)
[INFO] Unable to find resource 'xmlpull:xmlpull:jar:1.1.3.1' in repository mygrid-repository (http://www.mygrid.org.uk/maven/repository)
Downloading: http://uk.maven.org/maven2//xmlpull/xmlpull/1.1.3.1/xmlpull-1.1.3.1.jar
[INFO] Unable to find resource 'xpp3:xpp3_min:jar:1.1.4c' in repository mygrid-repository (http://www.mygrid.org.uk/maven/repository)
Downloading: http://www.mygrid.org.uk/maven/repository/antlr/antlr/2.7.7/antlr-2.7.7.jar
7K downloaded  (xmlpull-1.1.3.1.jar)
[INFO] Unable to find resource 'antlr:antlr:jar:2.7.7' in repository mygrid-repository (http://www.mygrid.org.uk/maven/repository)
113K downloaded  (aspectjrt-1.6.9.jar)
Downloading: http://www.mygrid.org.uk/maven/repository/com/thoughtworks/xstream/xstream/1.4.1/xstream-1.4.1.jar
Downloading: http://uk.maven.org/maven2//xpp3/xpp3_min/1.1.4c/xpp3_min-1.1.4c.jar
Downloading: http://uk.maven.org/maven2//antlr/antlr/2.7.7/antlr-2.7.7.jar
[INFO] Unable to find resource 'com.thoughtworks.xstream:xstream:jar:1.4.1' in repository mygrid-repository (http://www.mygrid.org.uk/maven/repository)
24K downloaded  (xpp3_min-1.1.4c.jar)
Downloading: http://www.mygrid.org.uk/maven/repository/geronimo-spec/geronimo-spec-jta/1.0-M1/geronimo-spec-jta-1.0-M1.jar
Downloading: http://uk.maven.org/maven2//com/thoughtworks/xstream/xstream/1.4.1/xstream-1.4.1.jar
[INFO] Unable to find resource 'geronimo-spec:geronimo-spec-jta:jar:1.0-M1' in repository mygrid-repository (http://www.mygrid.org.uk/maven/repository)
Downloading: http://uk.maven.org/maven2//geronimo-spec/geronimo-spec-jta/1.0-M1/geronimo-spec-jta-1.0-M1.jar
306K downloaded  (dom4j-1.6.1.jar)
Downloading: http://www.mygrid.org.uk/maven/repository/org/hibernate/hibernate/3.2.5.ga.raven/hibernate-3.2.5.ga.raven.jar
Downloading: http://www.mygrid.org.uk/maven/repository/cglib/cglib/2.1_3/cglib-2.1_3.jar
13K downloaded  (geronimo-spec-jta-1.0-M1.jar)
[INFO] Unable to find resource 'cglib:cglib:jar:2.1_3' in repository mygrid-repository (http://www.mygrid.org.uk/maven/repository)
Downloading: http://uk.maven.org/maven2//cglib/cglib/2.1_3/cglib-2.1_3.jar
Downloading: http://www.mygrid.org.uk/maven/repository/asm/asm/1.5.3/asm-1.5.3.jar
484K downloaded  (xstream-1.4.1.jar)
Downloading: http://www.mygrid.org.uk/maven/repository/org/aspectj/aspectjweaver/1.6.9/aspectjweaver-1.6.9.jar
[INFO] Unable to find resource 'org.aspectj:aspectjweaver:jar:1.6.9' in repository mygrid-repository (http://www.mygrid.org.uk/maven/repository)
Downloading: http://uk.maven.org/maven2//org/aspectj/aspectjweaver/1.6.9/aspectjweaver-1.6.9.jar
275K downloaded  (cglib-2.1_3.jar)
Downloading: http://www.mygrid.org.uk/maven/repository/net/sf/taverna/t2/core/workflowmodel-impl/1.4/workflowmodel-impl-1.4.jar
434K downloaded  (antlr-2.7.7.jar)
Downloading: http://www.mygrid.org.uk/maven/repository/org/springframework/spring-orm/2.5.4/spring-orm-2.5.4.jar
293K downloaded  (workflowmodel-impl-1.4.jar)
[INFO] Unable to find resource 'org.springframework:spring-orm:jar:2.5.4' in repository mygrid-repository (http://www.mygrid.org.uk/maven/repository)
Downloading: http://uk.maven.org/maven2//org/springframework/spring-orm/2.5.4/spring-orm-2.5.4.jar
Downloading: http://www.mygrid.org.uk/maven/repository/net/sf/taverna/t2/core/reference-impl/1.4/reference-impl-1.4.jar
2223K downloaded  (hibernate-3.2.5.ga.raven.jar)
[INFO] Unable to find resource 'asm:asm:jar:1.5.3' in repository mygrid-repository (http://www.mygrid.org.uk/maven/repository)
Downloading: http://uk.maven.org/maven2//asm/asm/1.5.3/asm-1.5.3.jar
111K downloaded  (reference-impl-1.4.jar)
25K downloaded  (asm-1.5.3.jar)
Downloading: http://www.mygrid.org.uk/maven/repository/net/sf/taverna/t2/core/reference-core-extensions/1.4/reference-core-extensions-1.4.jar
31K downloaded  (reference-core-extensions-1.4.jar)
363K downloaded  (spring-orm-2.5.4.jar)
Downloading: http://www.mygrid.org.uk/maven/repository/org/springframework/spring-aop/2.5.4/spring-aop-2.5.4.jar
[INFO] Unable to find resource 'org.springframework:spring-aop:jar:2.5.4' in repository mygrid-repository (http://www.mygrid.org.uk/maven/repository)
Downloading: http://uk.maven.org/maven2//org/springframework/spring-aop/2.5.4/spring-aop-2.5.4.jar
1624K downloaded  (aspectjweaver-1.6.9.jar)
318K downloaded  (spring-aop-2.5.4.jar)
Downloading: http://www.mygrid.org.uk/maven/repository/org/springframework/spring-jdbc/2.5.4/spring-jdbc-2.5.4.jar
[INFO] Unable to find resource 'org.springframework:spring-jdbc:jar:2.5.4' in repository mygrid-repository (http://www.mygrid.org.uk/maven/repository)
Downloading: http://uk.maven.org/maven2//org/springframework/spring-jdbc/2.5.4/spring-jdbc-2.5.4.jar
309K downloaded  (spring-jdbc-2.5.4.jar)
[INFO] [compiler:testCompile {execution: default-testCompile}]
[WARNING] File encoding has not been set, using platform encoding ANSI_X3.4-1968, i.e. build is platform dependent!
[INFO] Compiling 2 source files to /var/lib/jenkins/workspace/Interaction Service/interaction-activity/target/test-classes
Downloading: http://www.mygrid.org.uk/maven/repository/org/apache/maven/surefire/surefire-booter/2.7.1/surefire-booter-2.7.1.pom
[INFO] Unable to find resource 'org.apache.maven.surefire:surefire-booter:pom:2.7.1' in repository mygrid-repository (http://www.mygrid.org.uk/maven/repository)
Downloading: http://uk.maven.org/maven2/org/apache/maven/surefire/surefire-booter/2.7.1/surefire-booter-2.7.1.pom
1K downloaded  (surefire-booter-2.7.1.pom)
Downloading: http://www.mygrid.org.uk/maven/repository/org/apache/maven/surefire/surefire-api/2.7.1/surefire-api-2.7.1.pom
[INFO] Unable to find resource 'org.apache.maven.surefire:surefire-api:pom:2.7.1' in repository mygrid-repository (http://www.mygrid.org.uk/maven/repository)
Downloading: http://www.mygrid.org.uk/maven/repository/org/apache/maven/surefire/surefire-api/2.7.1/surefire-api-2.7.1.pom
[INFO] Unable to find resource 'org.apache.maven.surefire:surefire-api:pom:2.7.1' in repository mygrid-repository (http://www.mygrid.org.uk/maven/repository)
Downloading: http://uk.maven.org/maven2/org/apache/maven/surefire/surefire-api/2.7.1/surefire-api-2.7.1.pom
1K downloaded  (surefire-api-2.7.1.pom)
Downloading: http://www.mygrid.org.uk/maven/repository/org/apache/maven/surefire/maven-surefire-common/2.7.1/maven-surefire-common-2.7.1.pom
[INFO] Unable to find resource 'org.apache.maven.surefire:maven-surefire-common:pom:2.7.1' in repository mygrid-repository (http://www.mygrid.org.uk/maven/repository)
Downloading: http://uk.maven.org/maven2/org/apache/maven/surefire/maven-surefire-common/2.7.1/maven-surefire-common-2.7.1.pom
3K downloaded  (maven-surefire-common-2.7.1.pom)
Downloading: http://www.mygrid.org.uk/maven/repository/org/apache/maven/maven-core/2.0.9/maven-core-2.0.9.pom
[INFO] Unable to find resource 'org.apache.maven:maven-core:pom:2.0.9' in repository mygrid-repository (http://www.mygrid.org.uk/maven/repository)
Downloading: http://www.mygrid.org.uk/maven/repository/org/apache/maven/maven-core/2.0.9/maven-core-2.0.9.pom
[INFO] Unable to find resource 'org.apache.maven:maven-core:pom:2.0.9' in repository mygrid-repository (http://www.mygrid.org.uk/maven/repository)
Downloading: http://uk.maven.org/maven2/org/apache/maven/maven-core/2.0.9/maven-core-2.0.9.pom
7K downloaded  (maven-core-2.0.9.pom)
Downloading: http://www.mygrid.org.uk/maven/repository/org/apache/maven/maven-plugin-parameter-documenter/2.0.9/maven-plugin-parameter-documenter-2.0.9.pom
[INFO] Unable to find resource 'org.apache.maven:maven-plugin-parameter-documenter:pom:2.0.9' in repository mygrid-repository (http://www.mygrid.org.uk/maven/repository)
Downloading: http://www.mygrid.org.uk/maven/repository/org/apache/maven/maven-plugin-parameter-documenter/2.0.9/maven-plugin-parameter-documenter-2.0.9.pom
[INFO] Unable to find resource 'org.apache.maven:maven-plugin-parameter-documenter:pom:2.0.9' in repository mygrid-repository (http://www.mygrid.org.uk/maven/repository)
Downloading: http://uk.maven.org/maven2/org/apache/maven/maven-plugin-parameter-documenter/2.0.9/maven-plugin-parameter-documenter-2.0.9.pom
1K downloaded  (maven-plugin-parameter-documenter-2.0.9.pom)
Downloading: http://www.mygrid.org.uk/maven/repository/org/apache/maven/reporting/maven-reporting-api/2.0.9/maven-reporting-api-2.0.9.pom
[INFO] Unable to find resource 'org.apache.maven.reporting:maven-reporting-api:pom:2.0.9' in repository mygrid-repository (http://www.mygrid.org.uk/maven/repository)
Downloading: http://www.mygrid.org.uk/maven/repository/org/apache/maven/reporting/maven-reporting-api/2.0.9/maven-reporting-api-2.0.9.pom
[INFO] Unable to find resource 'org.apache.maven.reporting:maven-reporting-api:pom:2.0.9' in repository mygrid-repository (http://www.mygrid.org.uk/maven/repository)
Downloading: http://uk.maven.org/maven2/org/apache/maven/reporting/maven-reporting-api/2.0.9/maven-reporting-api-2.0.9.pom
1K downloaded  (maven-reporting-api-2.0.9.pom)
Downloading: http://www.mygrid.org.uk/maven/repository/org/apache/maven/reporting/maven-reporting/2.0.9/maven-reporting-2.0.9.pom
[INFO] Unable to find resource 'org.apache.maven.reporting:maven-reporting:pom:2.0.9' in repository mygrid-repository (http://www.mygrid.org.uk/maven/repository)
Downloading: http://www.mygrid.org.uk/maven/repository/org/apache/maven/reporting/maven-reporting/2.0.9/maven-reporting-2.0.9.pom
[INFO] Unable to find resource 'org.apache.maven.reporting:maven-reporting:pom:2.0.9' in repository mygrid-repository (http://www.mygrid.org.uk/maven/repository)
Downloading: http://uk.maven.org/maven2/org/apache/maven/reporting/maven-reporting/2.0.9/maven-reporting-2.0.9.pom
1K downloaded  (maven-reporting-2.0.9.pom)
Downloading: http://www.mygrid.org.uk/maven/repository/org/apache/maven/maven-error-diagnostics/2.0.9/maven-error-diagnostics-2.0.9.pom
[INFO] Unable to find resource 'org.apache.maven:maven-error-diagnostics:pom:2.0.9' in repository mygrid-repository (http://www.mygrid.org.uk/maven/repository)
Downloading: http://www.mygrid.org.uk/maven/repository/org/apache/maven/maven-error-diagnostics/2.0.9/maven-error-diagnostics-2.0.9.pom
[INFO] Unable to find resource 'org.apache.maven:maven-error-diagnostics:pom:2.0.9' in repository mygrid-repository (http://www.mygrid.org.uk/maven/repository)
Downloading: http://uk.maven.org/maven2/org/apache/maven/maven-error-diagnostics/2.0.9/maven-error-diagnostics-2.0.9.pom
1K downloaded  (maven-error-diagnostics-2.0.9.pom)
Downloading: http://www.mygrid.org.uk/maven/repository/org/apache/maven/maven-plugin-descriptor/2.0.9/maven-plugin-descriptor-2.0.9.pom
[INFO] Unable to find resource 'org.apache.maven:maven-plugin-descriptor:pom:2.0.9' in repository mygrid-repository (http://www.mygrid.org.uk/maven/repository)
Downloading: http://www.mygrid.org.uk/maven/repository/org/apache/maven/maven-plugin-descriptor/2.0.9/maven-plugin-descriptor-2.0.9.pom
[INFO] Unable to find resource 'org.apache.maven:maven-plugin-descriptor:pom:2.0.9' in repository mygrid-repository (http://www.mygrid.org.uk/maven/repository)
Downloading: http://uk.maven.org/maven2/org/apache/maven/maven-plugin-descriptor/2.0.9/maven-plugin-descriptor-2.0.9.pom
2K downloaded  (maven-plugin-descriptor-2.0.9.pom)
Downloading: http://www.mygrid.org.uk/maven/repository/org/apache/maven/maven-monitor/2.0.9/maven-monitor-2.0.9.pom
[INFO] Unable to find resource 'org.apache.maven:maven-monitor:pom:2.0.9' in repository mygrid-repository (http://www.mygrid.org.uk/maven/repository)
Downloading: http://www.mygrid.org.uk/maven/repository/org/apache/maven/maven-monitor/2.0.9/maven-monitor-2.0.9.pom
[INFO] Unable to find resource 'org.apache.maven:maven-monitor:pom:2.0.9' in repository mygrid-repository (http://www.mygrid.org.uk/maven/repository)
Downloading: http://uk.maven.org/maven2/org/apache/maven/maven-monitor/2.0.9/maven-monitor-2.0.9.pom
1K downloaded  (maven-monitor-2.0.9.pom)
Downloading: http://www.mygrid.org.uk/maven/repository/org/apache/maven/maven-toolchain/2.0.9/maven-toolchain-2.0.9.pom
[INFO] Unable to find resource 'org.apache.maven:maven-toolchain:pom:2.0.9' in repository mygrid-repository (http://www.mygrid.org.uk/maven/repository)
Downloading: http://www.mygrid.org.uk/maven/repository/org/apache/maven/maven-toolchain/2.0.9/maven-toolchain-2.0.9.pom
[INFO] Unable to find resource 'org.apache.maven:maven-toolchain:pom:2.0.9' in repository mygrid-repository (http://www.mygrid.org.uk/maven/repository)
Downloading: http://uk.maven.org/maven2/org/apache/maven/maven-toolchain/2.0.9/maven-toolchain-2.0.9.pom
3K downloaded  (maven-toolchain-2.0.9.pom)
Downloading: http://www.mygrid.org.uk/maven/repository/org/apache/maven/shared/maven-common-artifact-filters/1.3/maven-common-artifact-filters-1.3.pom
[INFO] Unable to find resource 'org.apache.maven.shared:maven-common-artifact-filters:pom:1.3' in repository mygrid-repository (http://www.mygrid.org.uk/maven/repository)
Downloading: http://www.mygrid.org.uk/maven/repository/org/apache/maven/shared/maven-common-artifact-filters/1.3/maven-common-artifact-filters-1.3.pom
[INFO] Unable to find resource 'org.apache.maven.shared:maven-common-artifact-filters:pom:1.3' in repository mygrid-repository (http://www.mygrid.org.uk/maven/repository)
Downloading: http://uk.maven.org/maven2/org/apache/maven/shared/maven-common-artifact-filters/1.3/maven-common-artifact-filters-1.3.pom
3K downloaded  (maven-common-artifact-filters-1.3.pom)
Downloading: http://www.mygrid.org.uk/maven/repository/org/apache/maven/shared/maven-shared-components/12/maven-shared-components-12.pom
[INFO] Unable to find resource 'org.apache.maven.shared:maven-shared-components:pom:12' in repository mygrid-repository (http://www.mygrid.org.uk/maven/repository)
Downloading: http://www.mygrid.org.uk/maven/repository/org/apache/maven/shared/maven-shared-components/12/maven-shared-components-12.pom
[INFO] Unable to find resource 'org.apache.maven.shared:maven-shared-components:pom:12' in repository mygrid-repository (http://www.mygrid.org.uk/maven/repository)
Downloading: http://uk.maven.org/maven2/org/apache/maven/shared/maven-shared-components/12/maven-shared-components-12.pom
9K downloaded  (maven-shared-components-12.pom)
Downloading: http://www.mygrid.org.uk/maven/repository/org/apache/maven/maven-parent/13/maven-parent-13.pom
[INFO] Unable to find resource 'org.apache.maven:maven-parent:pom:13' in repository mygrid-repository (http://www.mygrid.org.uk/maven/repository)
Downloading: http://www.mygrid.org.uk/maven/repository/org/apache/maven/maven-parent/13/maven-parent-13.pom
[INFO] Unable to find resource 'org.apache.maven:maven-parent:pom:13' in repository mygrid-repository (http://www.mygrid.org.uk/maven/repository)
Downloading: http://uk.maven.org/maven2/org/apache/maven/maven-parent/13/maven-parent-13.pom
22K downloaded  (maven-parent-13.pom)
Downloading: http://www.mygrid.org.uk/maven/repository/org/apache/apache/6/apache-6.pom
[INFO] Unable to find resource 'org.apache:apache:pom:6' in repository mygrid-repository (http://www.mygrid.org.uk/maven/repository)
Downloading: http://www.mygrid.org.uk/maven/repository/org/apache/apache/6/apache-6.pom
[INFO] Unable to find resource 'org.apache:apache:pom:6' in repository mygrid-repository (http://www.mygrid.org.uk/maven/repository)
Downloading: http://uk.maven.org/maven2/org/apache/apache/6/apache-6.pom
12K downloaded  (apache-6.pom)
Downloading: http://www.mygrid.org.uk/maven/repository/org/apache/maven/maven-artifact/2.0.8/maven-artifact-2.0.8.pom
[INFO] Unable to find resource 'org.apache.maven:maven-artifact:pom:2.0.8' in repository mygrid-repository (http://www.mygrid.org.uk/maven/repository)
Downloading: http://www.mygrid.org.uk/maven/repository/org/apache/maven/maven-artifact/2.0.8/maven-artifact-2.0.8.pom
[INFO] Unable to find resource 'org.apache.maven:maven-artifact:pom:2.0.8' in repository mygrid-repository (http://www.mygrid.org.uk/maven/repository)
Downloading: http://uk.maven.org/maven2/org/apache/maven/maven-artifact/2.0.8/maven-artifact-2.0.8.pom
1K downloaded  (maven-artifact-2.0.8.pom)
Downloading: http://www.mygrid.org.uk/maven/repository/org/apache/maven/maven/2.0.8/maven-2.0.8.pom
[INFO] Unable to find resource 'org.apache.maven:maven:pom:2.0.8' in repository mygrid-repository (http://www.mygrid.org.uk/maven/repository)
Downloading: http://www.mygrid.org.uk/maven/repository/org/apache/maven/maven/2.0.8/maven-2.0.8.pom
[INFO] Unable to find resource 'org.apache.maven:maven:pom:2.0.8' in repository mygrid-repository (http://www.mygrid.org.uk/maven/repository)
Downloading: http://uk.maven.org/maven2/org/apache/maven/maven/2.0.8/maven-2.0.8.pom
11K downloaded  (maven-2.0.8.pom)
Downloading: http://www.mygrid.org.uk/maven/repository/org/apache/maven/maven-parent/6/maven-parent-6.pom
[INFO] Unable to find resource 'org.apache.maven:maven-parent:pom:6' in repository mygrid-repository (http://www.mygrid.org.uk/maven/repository)
Downloading: http://www.mygrid.org.uk/maven/repository/org/apache/maven/maven-parent/6/maven-parent-6.pom
[INFO] Unable to find resource 'org.apache.maven:maven-parent:pom:6' in repository mygrid-repository (http://www.mygrid.org.uk/maven/repository)
Downloading: http://uk.maven.org/maven2/org/apache/maven/maven-parent/6/maven-parent-6.pom
19K downloaded  (maven-parent-6.pom)
Downloading: http://www.mygrid.org.uk/maven/repository/org/apache/maven/maven-model/2.0.8/maven-model-2.0.8.pom
[INFO] Unable to find resource 'org.apache.maven:maven-model:pom:2.0.8' in repository mygrid-repository (http://www.mygrid.org.uk/maven/repository)
Downloading: http://www.mygrid.org.uk/maven/repository/org/apache/maven/maven-model/2.0.8/maven-model-2.0.8.pom
[INFO] Unable to find resource 'org.apache.maven:maven-model:pom:2.0.8' in repository mygrid-repository (http://www.mygrid.org.uk/maven/repository)
Downloading: http://uk.maven.org/maven2/org/apache/maven/maven-model/2.0.8/maven-model-2.0.8.pom
3K downloaded  (maven-model-2.0.8.pom)
Downloading: http://www.mygrid.org.uk/maven/repository/org/apache/maven/maven-project/2.0.8/maven-project-2.0.8.pom
[INFO] Unable to find resource 'org.apache.maven:maven-project:pom:2.0.8' in repository mygrid-repository (http://www.mygrid.org.uk/maven/repository)
Downloading: http://www.mygrid.org.uk/maven/repository/org/apache/maven/maven-project/2.0.8/maven-project-2.0.8.pom
[INFO] Unable to find resource 'org.apache.maven:maven-project:pom:2.0.8' in repository mygrid-repository (http://www.mygrid.org.uk/maven/repository)
Downloading: http://uk.maven.org/maven2/org/apache/maven/maven-project/2.0.8/maven-project-2.0.8.pom
2K downloaded  (maven-project-2.0.8.pom)
Downloading: http://www.mygrid.org.uk/maven/repository/org/apache/maven/maven-plugin-api/2.0.8/maven-plugin-api-2.0.8.pom
[INFO] Unable to find resource 'org.apache.maven:maven-plugin-api:pom:2.0.8' in repository mygrid-repository (http://www.mygrid.org.uk/maven/repository)
Downloading: http://www.mygrid.org.uk/maven/repository/org/apache/maven/maven-plugin-api/2.0.8/maven-plugin-api-2.0.8.pom
[INFO] Unable to find resource 'org.apache.maven:maven-plugin-api:pom:2.0.8' in repository mygrid-repository (http://www.mygrid.org.uk/maven/repository)
Downloading: http://uk.maven.org/maven2/org/apache/maven/maven-plugin-api/2.0.8/maven-plugin-api-2.0.8.pom
1K downloaded  (maven-plugin-api-2.0.8.pom)
Downloading: http://www.mygrid.org.uk/maven/repository/org/apache/maven/shared/maven-common-artifact-filters/1.3/maven-common-artifact-filters-1.3.jar
Downloading: http://www.mygrid.org.uk/maven/repository/org/apache/maven/surefire/surefire-booter/2.7.1/surefire-booter-2.7.1.jar
[INFO] Unable to find resource 'org.apache.maven.shared:maven-common-artifact-filters:jar:1.3' in repository mygrid-repository (http://www.mygrid.org.uk/maven/repository)
Downloading: http://www.mygrid.org.uk/maven/repository/org/apache/maven/shared/maven-common-artifact-filters/1.3/maven-common-artifact-filters-1.3.jar
[INFO] Unable to find resource 'org.apache.maven.surefire:surefire-booter:jar:2.7.1' in repository mygrid-repository (http://www.mygrid.org.uk/maven/repository)
Downloading: http://uk.maven.org/maven2/org/apache/maven/surefire/surefire-booter/2.7.1/surefire-booter-2.7.1.jar
[INFO] Unable to find resource 'org.apache.maven.shared:maven-common-artifact-filters:jar:1.3' in repository mygrid-repository (http://www.mygrid.org.uk/maven/repository)
31K downloaded  (surefire-booter-2.7.1.jar)
Downloading: http://uk.maven.org/maven2/org/apache/maven/shared/maven-common-artifact-filters/1.3/maven-common-artifact-filters-1.3.jar
Downloading: http://www.mygrid.org.uk/maven/repository/org/apache/maven/surefire/surefire-api/2.7.1/surefire-api-2.7.1.jar
30K downloaded  (maven-common-artifact-filters-1.3.jar)
[INFO] Unable to find resource 'org.apache.maven.surefire:surefire-api:jar:2.7.1' in repository mygrid-repository (http://www.mygrid.org.uk/maven/repository)
Downloading: http://www.mygrid.org.uk/maven/repository/org/apache/maven/surefire/surefire-api/2.7.1/surefire-api-2.7.1.jar
[INFO] Unable to find resource 'org.apache.maven.surefire:surefire-api:jar:2.7.1' in repository mygrid-repository (http://www.mygrid.org.uk/maven/repository)
Downloading: http://uk.maven.org/maven2/org/apache/maven/surefire/surefire-api/2.7.1/surefire-api-2.7.1.jar
111K downloaded  (surefire-api-2.7.1.jar)
Downloading: http://www.mygrid.org.uk/maven/repository/org/apache/maven/surefire/maven-surefire-common/2.7.1/maven-surefire-common-2.7.1.jar
[INFO] Unable to find resource 'org.apache.maven.surefire:maven-surefire-common:jar:2.7.1' in repository mygrid-repository (http://www.mygrid.org.uk/maven/repository)
Downloading: http://uk.maven.org/maven2/org/apache/maven/surefire/maven-surefire-common/2.7.1/maven-surefire-common-2.7.1.jar
55K downloaded  (maven-surefire-common-2.7.1.jar)
[WARNING] DEPRECATED [systemProperties]: Use systemPropertyVariables instead.
[INFO] [surefire:test {execution: default-test}]
[INFO] Surefire report directory: /var/lib/jenkins/workspace/Interaction Service/interaction-activity/target/surefire-reports
Downloading: http://www.mygrid.org.uk/maven/repository/org/apache/maven/surefire/surefire-junit4/2.7.1/surefire-junit4-2.7.1.pom
[INFO] Unable to find resource 'org.apache.maven.surefire:surefire-junit4:pom:2.7.1' in repository mygrid-repository (http://www.mygrid.org.uk/maven/repository)
Downloading: http://uk.maven.org/maven2/org/apache/maven/surefire/surefire-junit4/2.7.1/surefire-junit4-2.7.1.pom
2K downloaded  (surefire-junit4-2.7.1.pom)
Downloading: http://www.mygrid.org.uk/maven/repository/org/apache/maven/surefire/surefire-providers/2.7.1/surefire-providers-2.7.1.pom
[INFO] Unable to find resource 'org.apache.maven.surefire:surefire-providers:pom:2.7.1' in repository mygrid-repository (http://www.mygrid.org.uk/maven/repository)
Downloading: http://uk.maven.org/maven2/org/apache/maven/surefire/surefire-providers/2.7.1/surefire-providers-2.7.1.pom
1K downloaded  (surefire-providers-2.7.1.pom)
Downloading: http://www.mygrid.org.uk/maven/repository/org/apache/maven/surefire/surefire-junit4/2.7.1/surefire-junit4-2.7.1.jar
[INFO] Unable to find resource 'org.apache.maven.surefire:surefire-junit4:jar:2.7.1' in repository mygrid-repository (http://www.mygrid.org.uk/maven/repository)
Downloading: http://uk.maven.org/maven2/org/apache/maven/surefire/surefire-junit4/2.7.1/surefire-junit4-2.7.1.jar
15K downloaded  (surefire-junit4-2.7.1.jar)

-------------------------------------------------------
 T E S T S
-------------------------------------------------------
Running net.sf.taverna.t2.activities.interaction.InteractionActivityTest
Tests run: 5, Failures: 0, Errors: 0, Skipped: 5, Time elapsed: 0.115 sec
Running net.sf.taverna.t2.activities.interaction.FeedListenerTest
Tests run: 1, Failures: 0, Errors: 0, Skipped: 0, Time elapsed: 0.456 sec

Results :

Tests run: 6, Failures: 0, Errors: 0, Skipped: 5

[JENKINS] Recording test results
[INFO] [jar:jar {execution: default-jar}]
[INFO] Building jar: /var/lib/jenkins/workspace/Interaction Service/interaction-activity/target/interaction-activity-1.0.4.jar
[INFO] Preparing source:jar
[WARNING] Removing: jar from forked lifecycle, to prevent recursive invocation.
[INFO] No goals needed for project - skipping
[INFO] [source:jar {execution: default}]
[INFO] Building jar: /var/lib/jenkins/workspace/Interaction Service/interaction-activity/target/interaction-activity-1.0.4-sources.jar
[INFO] Preparing source:test-jar
[WARNING] Removing: jar from forked lifecycle, to prevent recursive invocation.
[WARNING] Removing: test-jar from forked lifecycle, to prevent recursive invocation.
[INFO] No goals needed for project - skipping
[INFO] [source:test-jar {execution: default}]
[INFO] Building jar: /var/lib/jenkins/workspace/Interaction Service/interaction-activity/target/interaction-activity-1.0.4-test-sources.jar
[INFO] [jar:test-jar {execution: default}]
[INFO] Building jar: /var/lib/jenkins/workspace/Interaction Service/interaction-activity/target/interaction-activity-1.0.4-tests.jar
[INFO] [install:install {execution: default-install}]
[INFO] Installing /var/lib/jenkins/workspace/Interaction Service/interaction-activity/target/interaction-activity-1.0.4.jar to /var/lib/jenkins/workspace/Interaction Service/.repository/net/sf/taverna/t2/activities/interaction-activity/1.0.4/interaction-activity-1.0.4.jar
[INFO] Installing /var/lib/jenkins/workspace/Interaction Service/interaction-activity/target/interaction-activity-1.0.4-sources.jar to /var/lib/jenkins/workspace/Interaction Service/.repository/net/sf/taverna/t2/activities/interaction-activity/1.0.4/interaction-activity-1.0.4-sources.jar
[INFO] Installing /var/lib/jenkins/workspace/Interaction Service/interaction-activity/target/interaction-activity-1.0.4-test-sources.jar to /var/lib/jenkins/workspace/Interaction Service/.repository/net/sf/taverna/t2/activities/interaction-activity/1.0.4/interaction-activity-1.0.4-test-sources.jar
[INFO] Installing /var/lib/jenkins/workspace/Interaction Service/interaction-activity/target/interaction-activity-1.0.4-tests.jar to /var/lib/jenkins/workspace/Interaction Service/.repository/net/sf/taverna/t2/activities/interaction-activity/1.0.4/interaction-activity-1.0.4-tests.jar
[JENKINS] Archiving /var/lib/jenkins/workspace/Interaction Service/interaction-activity/pom.xml to /local/jenkins/jobs/Interaction Service/modules/net.sf.taverna.t2.activities$interaction-activity/builds/2013-08-06_16-22-59/archive/net.sf.taverna.t2.activities/interaction-activity/1.0.4/interaction-activity-1.0.4.pom
[JENKINS] Archiving /var/lib/jenkins/workspace/Interaction Service/interaction-activity/target/interaction-activity-1.0.4.jar to /local/jenkins/jobs/Interaction Service/modules/net.sf.taverna.t2.activities$interaction-activity/builds/2013-08-06_16-22-59/archive/net.sf.taverna.t2.activities/interaction-activity/1.0.4/interaction-activity-1.0.4.jar
[JENKINS] Archiving /var/lib/jenkins/workspace/Interaction Service/interaction-activity/target/interaction-activity-1.0.4-sources.jar to /local/jenkins/jobs/Interaction Service/modules/net.sf.taverna.t2.activities$interaction-activity/builds/2013-08-06_16-22-59/archive/net.sf.taverna.t2.activities/interaction-activity/1.0.4/interaction-activity-1.0.4-sources.jar
[JENKINS] Archiving /var/lib/jenkins/workspace/Interaction Service/interaction-activity/target/interaction-activity-1.0.4-test-sources.jar to /local/jenkins/jobs/Interaction Service/modules/net.sf.taverna.t2.activities$interaction-activity/builds/2013-08-06_16-22-59/archive/net.sf.taverna.t2.activities/interaction-activity/1.0.4/interaction-activity-1.0.4-test-sources.jar
[JENKINS] Archiving /var/lib/jenkins/workspace/Interaction Service/interaction-activity/target/interaction-activity-1.0.4-tests.jar to /local/jenkins/jobs/Interaction Service/modules/net.sf.taverna.t2.activities$interaction-activity/builds/2013-08-06_16-22-59/archive/net.sf.taverna.t2.activities/interaction-activity/1.0.4/interaction-activity-1.0.4-tests.jar
[INFO] ------------------------------------------------------------------------
[INFO] Building Example Taverna activity UI bindings
[INFO]    task-segment: [clean, install]
[INFO] ------------------------------------------------------------------------
[INFO] [clean:clean {execution: default-clean}]
[INFO] [resources:resources {execution: default-resources}]
[WARNING] Using platform encoding (ANSI_X3.4-1968 actually) to copy filtered resources, i.e. build is platform dependent!
[INFO] Copying 8 resources
Downloading: http://www.mygrid.org.uk/maven/repository/net/sf/taverna/t2/ui-api/activity-palette-api/1.4/activity-palette-api-1.4.pom
1K downloaded  (activity-palette-api-1.4.pom)
Downloading: http://www.mygrid.org.uk/maven/repository/net/sf/taverna/t2/ui-api/1.4/ui-api-1.4.pom
3K downloaded  (ui-api-1.4.pom)
Downloading: http://www.mygrid.org.uk/maven/repository/net/sf/taverna/t2/lang/partition/1.4/partition-1.4.pom
723b downloaded  (partition-1.4.pom)
Downloading: http://www.mygrid.org.uk/maven/repository/net/sf/taverna/t2/ui-api/configuration-api/1.4/configuration-api-1.4.pom
1K downloaded  (configuration-api-1.4.pom)
Downloading: http://www.mygrid.org.uk/maven/repository/net/sf/opencsv/opencsv/2.1/opencsv-2.1.pom
[INFO] Unable to find resource 'net.sf.opencsv:opencsv:pom:2.1' in repository mygrid-repository (http://www.mygrid.org.uk/maven/repository)
Downloading: http://uk.maven.org/maven2//net/sf/opencsv/opencsv/2.1/opencsv-2.1.pom
5K downloaded  (opencsv-2.1.pom)
Downloading: http://www.mygrid.org.uk/maven/repository/net/sf/taverna/t2/lang/beans/1.4/beans-1.4.pom
640b downloaded  (beans-1.4.pom)
Downloading: http://www.mygrid.org.uk/maven/repository/net/sf/taverna/t2/ui-api/menu-api/1.4/menu-api-1.4.pom
802b downloaded  (menu-api-1.4.pom)
Downloading: http://www.mygrid.org.uk/maven/repository/net/sf/taverna/t2/ui-api/contextual-views-api/1.4/contextual-views-api-1.4.pom
2K downloaded  (contextual-views-api-1.4.pom)
Downloading: http://www.mygrid.org.uk/maven/repository/net/sf/taverna/t2/ui-api/activity-icons-api/1.4/activity-icons-api-1.4.pom
901b downloaded  (activity-icons-api-1.4.pom)
Downloading: http://www.mygrid.org.uk/maven/repository/net/sf/taverna/t2/ui-api/workbench-api/1.4/workbench-api-1.4.pom
1K downloaded  (workbench-api-1.4.pom)
Downloading: http://www.mygrid.org.uk/maven/repository/net/sf/taverna/t2/lang/ui/1.4/ui-1.4.pom
811b downloaded  (ui-1.4.pom)
Downloading: http://www.mygrid.org.uk/maven/repository/net/sf/taverna/t2/ui-api/helper-api/1.4/helper-api-1.4.pom
1K downloaded  (helper-api-1.4.pom)
Downloading: http://www.mygrid.org.uk/maven/repository/javax/help/javahelp/2.0.02/javahelp-2.0.02.pom
[INFO] Unable to find resource 'javax.help:javahelp:pom:2.0.02' in repository mygrid-repository (http://www.mygrid.org.uk/maven/repository)
Downloading: http://uk.maven.org/maven2//javax/help/javahelp/2.0.02/javahelp-2.0.02.pom
482b downloaded  (javahelp-2.0.02.pom)
Downloading: http://www.mygrid.org.uk/maven/repository/net/sf/taverna/t2/ui-api/file-api/1.4/file-api-1.4.pom
1K downloaded  (file-api-1.4.pom)
Downloading: http://www.mygrid.org.uk/maven/repository/net/sf/taverna/t2/ui-api/edits-api/1.4/edits-api-1.4.pom
1K downloaded  (edits-api-1.4.pom)
Downloading: http://www.mygrid.org.uk/maven/repository/net/sf/taverna/t2/ui-api/common-icons/1.4/common-icons-1.4.pom
594b downloaded  (common-icons-1.4.pom)
Downloading: http://www.mygrid.org.uk/maven/repository/net/sf/taverna/t2/ui-impl/contextual-views-impl/1.4/contextual-views-impl-1.4.pom
1K downloaded  (contextual-views-impl-1.4.pom)
Downloading: http://www.mygrid.org.uk/maven/repository/net/sf/taverna/t2/ui-impl/1.4/ui-impl-1.4.pom
3K downloaded  (ui-impl-1.4.pom)
Downloading: http://www.mygrid.org.uk/maven/repository/net/sf/taverna/t2/ui-impl/workbench-impl/1.4/workbench-impl-1.4.pom
3K downloaded  (workbench-impl-1.4.pom)
Downloading: http://www.mygrid.org.uk/maven/repository/uk/org/mygrid/taverna/osxapplication/1.5.1/osxapplication-1.5.1.pom
2K downloaded  (osxapplication-1.5.1.pom)
Downloading: http://www.mygrid.org.uk/maven/repository/net/sf/taverna/t2/ui-api/perspective-core/1.4/perspective-core-1.4.pom
1K downloaded  (perspective-core-1.4.pom)
Downloading: http://www.mygrid.org.uk/maven/repository/net/sf/taverna/t2/ui-impl/file-impl/1.4/file-impl-1.4.pom
2K downloaded  (file-impl-1.4.pom)
Downloading: http://www.mygrid.org.uk/maven/repository/commons-lang/commons-lang/2.5/commons-lang-2.5.pom
[INFO] Unable to find resource 'commons-lang:commons-lang:pom:2.5' in repository mygrid-repository (http://www.mygrid.org.uk/maven/repository)
Downloading: http://uk.maven.org/maven2//commons-lang/commons-lang/2.5/commons-lang-2.5.pom
16K downloaded  (commons-lang-2.5.pom)
Downloading: http://www.mygrid.org.uk/maven/repository/org/apache/commons/commons-parent/12/commons-parent-12.pom
[INFO] Unable to find resource 'org.apache.commons:commons-parent:pom:12' in repository mygrid-repository (http://www.mygrid.org.uk/maven/repository)
Downloading: http://uk.maven.org/maven2//org/apache/commons/commons-parent/12/commons-parent-12.pom
26K downloaded  (commons-parent-12.pom)
Downloading: http://www.mygrid.org.uk/maven/repository/net/sf/taverna/t2/ui-impl/configuration-impl/1.4/configuration-impl-1.4.pom
1K downloaded  (configuration-impl-1.4.pom)
Downloading: http://www.mygrid.org.uk/maven/repository/net/sf/taverna/t2/ui-impl/helper/1.4/helper-1.4.pom
753b downloaded  (helper-1.4.pom)
Downloading: http://www.mygrid.org.uk/maven/repository/net/sf/taverna/t2/ui-impl/zaria/1.4/zaria-1.4.pom
1K downloaded  (zaria-1.4.pom)
Downloading: http://www.mygrid.org.uk/maven/repository/net/sf/taverna/t2/ui-impl/edits-impl/1.4/edits-impl-1.4.pom
1K downloaded  (edits-impl-1.4.pom)
Downloading: http://www.mygrid.org.uk/maven/repository/BrowserLauncher2/BrowserLauncher2/1.3/BrowserLauncher2-1.3.pom
160b downloaded  (BrowserLauncher2-1.3.pom)
Downloading: http://www.mygrid.org.uk/maven/repository/net/sf/taverna/t2/ui-impl/activity-tools/1.4/activity-tools-1.4.pom
1K downloaded  (activity-tools-1.4.pom)
Downloading: http://www.mygrid.org.uk/maven/repository/net/sf/taverna/t2/ui-components/credential-manager-ui/1.4/credential-manager-ui-1.4.pom
2K downloaded  (credential-manager-ui-1.4.pom)
Downloading: http://www.mygrid.org.uk/maven/repository/net/sf/taverna/t2/ui-components/1.4/ui-components-1.4.pom
3K downloaded  (ui-components-1.4.pom)
Downloading: http://www.mygrid.org.uk/maven/repository/net/sf/taverna/t2/ui-components/workflow-view/1.4/workflow-view-1.4.pom
3K downloaded  (workflow-view-1.4.pom)
Downloading: http://www.mygrid.org.uk/maven/repository/net/sf/taverna/t2/lang/io/1.4/io-1.4.pom
637b downloaded  (io-1.4.pom)
Downloading: http://www.mygrid.org.uk/maven/repository/net/sf/taverna/t2/ui-impl/menu-impl/1.4/menu-impl-1.4.pom
1K downloaded  (menu-impl-1.4.pom)
Downloading: http://www.mygrid.org.uk/maven/repository/net/sf/taverna/t2/ui-components/design-ui/1.4/design-ui-1.4.pom
2K downloaded  (design-ui-1.4.pom)
Downloading: http://www.mygrid.org.uk/maven/repository/net/sf/taverna/t2/ui-components/graph-view/1.4.1/graph-view-1.4.1.pom
3K downloaded  (graph-view-1.4.1.pom)
Downloading: http://www.mygrid.org.uk/maven/repository/net/sf/taverna/t2/ui-components/1.4.1/ui-components-1.4.1.pom
3K downloaded  (ui-components-1.4.1.pom)
Downloading: http://www.mygrid.org.uk/maven/repository/net/sf/taverna/t2/ui-components/graph-model/1.4.1/graph-model-1.4.1.pom
3K downloaded  (graph-model-1.4.1.pom)
Downloading: http://www.mygrid.org.uk/maven/repository/org/apache/xmlgraphics/batik-svg-dom/1.7/batik-svg-dom-1.7.pom
[INFO] Unable to find resource 'org.apache.xmlgraphics:batik-svg-dom:pom:1.7' in repository mygrid-repository (http://www.mygrid.org.uk/maven/repository)
Downloading: http://uk.maven.org/maven2//org/apache/xmlgraphics/batik-svg-dom/1.7/batik-svg-dom-1.7.pom
4K downloaded  (batik-svg-dom-1.7.pom)
Downloading: http://www.mygrid.org.uk/maven/repository/org/apache/xmlgraphics/batik-anim/1.7/batik-anim-1.7.pom
[INFO] Unable to find resource 'org.apache.xmlgraphics:batik-anim:pom:1.7' in repository mygrid-repository (http://www.mygrid.org.uk/maven/repository)
Downloading: http://uk.maven.org/maven2//org/apache/xmlgraphics/batik-anim/1.7/batik-anim-1.7.pom
4K downloaded  (batik-anim-1.7.pom)
Downloading: http://www.mygrid.org.uk/maven/repository/org/apache/xmlgraphics/batik-awt-util/1.7/batik-awt-util-1.7.pom
[INFO] Unable to find resource 'org.apache.xmlgraphics:batik-awt-util:pom:1.7' in repository mygrid-repository (http://www.mygrid.org.uk/maven/repository)
Downloading: http://uk.maven.org/maven2//org/apache/xmlgraphics/batik-awt-util/1.7/batik-awt-util-1.7.pom
3K downloaded  (batik-awt-util-1.7.pom)
Downloading: http://www.mygrid.org.uk/maven/repository/org/apache/xmlgraphics/batik-util/1.7/batik-util-1.7.pom
[INFO] Unable to find resource 'org.apache.xmlgraphics:batik-util:pom:1.7' in repository mygrid-repository (http://www.mygrid.org.uk/maven/repository)
Downloading: http://uk.maven.org/maven2//org/apache/xmlgraphics/batik-util/1.7/batik-util-1.7.pom
2K downloaded  (batik-util-1.7.pom)
Downloading: http://www.mygrid.org.uk/maven/repository/org/apache/xmlgraphics/batik-dom/1.7/batik-dom-1.7.pom
[INFO] Unable to find resource 'org.apache.xmlgraphics:batik-dom:pom:1.7' in repository mygrid-repository (http://www.mygrid.org.uk/maven/repository)
Downloading: http://uk.maven.org/maven2//org/apache/xmlgraphics/batik-dom/1.7/batik-dom-1.7.pom
3K downloaded  (batik-dom-1.7.pom)
Downloading: http://www.mygrid.org.uk/maven/repository/org/apache/xmlgraphics/batik-css/1.7/batik-css-1.7.pom
[INFO] Unable to find resource 'org.apache.xmlgraphics:batik-css:pom:1.7' in repository mygrid-repository (http://www.mygrid.org.uk/maven/repository)
Downloading: http://uk.maven.org/maven2//org/apache/xmlgraphics/batik-css/1.7/batik-css-1.7.pom
3K downloaded  (batik-css-1.7.pom)
Downloading: http://www.mygrid.org.uk/maven/repository/org/apache/xmlgraphics/batik-ext/1.7/batik-ext-1.7.pom
[INFO] Unable to find resource 'org.apache.xmlgraphics:batik-ext:pom:1.7' in repository mygrid-repository (http://www.mygrid.org.uk/maven/repository)
Downloading: http://uk.maven.org/maven2//org/apache/xmlgraphics/batik-ext/1.7/batik-ext-1.7.pom
3K downloaded  (batik-ext-1.7.pom)
Downloading: http://www.mygrid.org.uk/maven/repository/xml-apis/xml-apis/1.3.04/xml-apis-1.3.04.pom
[INFO] Unable to find resource 'xml-apis:xml-apis:pom:1.3.04' in repository mygrid-repository (http://www.mygrid.org.uk/maven/repository)
Downloading: http://uk.maven.org/maven2//xml-apis/xml-apis/1.3.04/xml-apis-1.3.04.pom
1K downloaded  (xml-apis-1.3.04.pom)
Downloading: http://www.mygrid.org.uk/maven/repository/xml-apis/xml-apis-ext/1.3.04/xml-apis-ext-1.3.04.pom
[INFO] Unable to find resource 'xml-apis:xml-apis-ext:pom:1.3.04' in repository mygrid-repository (http://www.mygrid.org.uk/maven/repository)
Downloading: http://uk.maven.org/maven2//xml-apis/xml-apis-ext/1.3.04/xml-apis-ext-1.3.04.pom
1K downloaded  (xml-apis-ext-1.3.04.pom)
Downloading: http://www.mygrid.org.uk/maven/repository/org/apache/xmlgraphics/batik-xml/1.7/batik-xml-1.7.pom
[INFO] Unable to find resource 'org.apache.xmlgraphics:batik-xml:pom:1.7' in repository mygrid-repository (http://www.mygrid.org.uk/maven/repository)
Downloading: http://uk.maven.org/maven2//org/apache/xmlgraphics/batik-xml/1.7/batik-xml-1.7.pom
3K downloaded  (batik-xml-1.7.pom)
Downloading: http://www.mygrid.org.uk/maven/repository/xalan/xalan/2.6.0/xalan-2.6.0.pom
[INFO] Unable to find resource 'xalan:xalan:pom:2.6.0' in repository mygrid-repository (http://www.mygrid.org.uk/maven/repository)
Downloading: http://uk.maven.org/maven2//xalan/xalan/2.6.0/xalan-2.6.0.pom
491b downloaded  (xalan-2.6.0.pom)
Downloading: http://www.mygrid.org.uk/maven/repository/xml-apis/xml-apis/2.0.2/xml-apis-2.0.2.pom
[INFO] Unable to find resource 'xml-apis:xml-apis:pom:2.0.2' in repository mygrid-repository (http://www.mygrid.org.uk/maven/repository)
Downloading: http://uk.maven.org/maven2//xml-apis/xml-apis/2.0.2/xml-apis-2.0.2.pom
346b downloaded  (xml-apis-2.0.2.pom)
Downloading: http://www.mygrid.org.uk/maven/repository/org/apache/xmlgraphics/batik-parser/1.7/batik-parser-1.7.pom
[INFO] Unable to find resource 'org.apache.xmlgraphics:batik-parser:pom:1.7' in repository mygrid-repository (http://www.mygrid.org.uk/maven/repository)
Downloading: http://uk.maven.org/maven2//org/apache/xmlgraphics/batik-parser/1.7/batik-parser-1.7.pom
3K downloaded  (batik-parser-1.7.pom)
Downloading: http://www.mygrid.org.uk/maven/repository/org/apache/xmlgraphics/batik-swing/1.7/batik-swing-1.7.pom
[INFO] Unable to find resource 'org.apache.xmlgraphics:batik-swing:pom:1.7' in repository mygrid-repository (http://www.mygrid.org.uk/maven/repository)
Downloading: http://uk.maven.org/maven2//org/apache/xmlgraphics/batik-swing/1.7/batik-swing-1.7.pom
4K downloaded  (batik-swing-1.7.pom)
Downloading: http://www.mygrid.org.uk/maven/repository/org/apache/xmlgraphics/batik-bridge/1.7/batik-bridge-1.7.pom
[INFO] Unable to find resource 'org.apache.xmlgraphics:batik-bridge:pom:1.7' in repository mygrid-repository (http://www.mygrid.org.uk/maven/repository)
Downloading: http://uk.maven.org/maven2//org/apache/xmlgraphics/batik-bridge/1.7/batik-bridge-1.7.pom
5K downloaded  (batik-bridge-1.7.pom)
Downloading: http://www.mygrid.org.uk/maven/repository/org/apache/xmlgraphics/batik-gvt/1.7/batik-gvt-1.7.pom
[INFO] Unable to find resource 'org.apache.xmlgraphics:batik-gvt:pom:1.7' in repository mygrid-repository (http://www.mygrid.org.uk/maven/repository)
Downloading: http://uk.maven.org/maven2//org/apache/xmlgraphics/batik-gvt/1.7/batik-gvt-1.7.pom
3K downloaded  (batik-gvt-1.7.pom)
Downloading: http://www.mygrid.org.uk/maven/repository/org/apache/xmlgraphics/batik-script/1.7/batik-script-1.7.pom
[INFO] Unable to find resource 'org.apache.xmlgraphics:batik-script:pom:1.7' in repository mygrid-repository (http://www.mygrid.org.uk/maven/repository)
Downloading: http://uk.maven.org/maven2//org/apache/xmlgraphics/batik-script/1.7/batik-script-1.7.pom
4K downloaded  (batik-script-1.7.pom)
Downloading: http://www.mygrid.org.uk/maven/repository/org/apache/xmlgraphics/batik-gui-util/1.7/batik-gui-util-1.7.pom
[INFO] Unable to find resource 'org.apache.xmlgraphics:batik-gui-util:pom:1.7' in repository mygrid-repository (http://www.mygrid.org.uk/maven/repository)
Downloading: http://uk.maven.org/maven2//org/apache/xmlgraphics/batik-gui-util/1.7/batik-gui-util-1.7.pom
3K downloaded  (batik-gui-util-1.7.pom)
Downloading: http://www.mygrid.org.uk/maven/repository/org/apache/xmlgraphics/batik-transcoder/1.7/batik-transcoder-1.7.pom
[INFO] Unable to find resource 'org.apache.xmlgraphics:batik-transcoder:pom:1.7' in repository mygrid-repository (http://www.mygrid.org.uk/maven/repository)
Downloading: http://uk.maven.org/maven2//org/apache/xmlgraphics/batik-transcoder/1.7/batik-transcoder-1.7.pom
5K downloaded  (batik-transcoder-1.7.pom)
Downloading: http://www.mygrid.org.uk/maven/repository/org/apache/xmlgraphics/fop/0.94/fop-0.94.pom
[INFO] Unable to find resource 'org.apache.xmlgraphics:fop:pom:0.94' in repository mygrid-repository (http://www.mygrid.org.uk/maven/repository)
Downloading: http://uk.maven.org/maven2//org/apache/xmlgraphics/fop/0.94/fop-0.94.pom
5K downloaded  (fop-0.94.pom)
Downloading: http://www.mygrid.org.uk/maven/repository/org/apache/xmlgraphics/xmlgraphics-commons/1.2/xmlgraphics-commons-1.2.pom
[INFO] Unable to find resource 'org.apache.xmlgraphics:xmlgraphics-commons:pom:1.2' in repository mygrid-repository (http://www.mygrid.org.uk/maven/repository)
Downloading: http://uk.maven.org/maven2//org/apache/xmlgraphics/xmlgraphics-commons/1.2/xmlgraphics-commons-1.2.pom
3K downloaded  (xmlgraphics-commons-1.2.pom)
Downloading: http://www.mygrid.org.uk/maven/repository/commons-io/commons-io/1.1/commons-io-1.1.pom
[INFO] Unable to find resource 'commons-io:commons-io:pom:1.1' in repository mygrid-repository (http://www.mygrid.org.uk/maven/repository)
Downloading: http://uk.maven.org/maven2//commons-io/commons-io/1.1/commons-io-1.1.pom
5K downloaded  (commons-io-1.1.pom)
Downloading: http://www.mygrid.org.uk/maven/repository/org/apache/avalon/framework/avalon-framework-api/4.3.1/avalon-framework-api-4.3.1.pom
[INFO] Unable to find resource 'org.apache.avalon.framework:avalon-framework-api:pom:4.3.1' in repository mygrid-repository (http://www.mygrid.org.uk/maven/repository)
Downloading: http://uk.maven.org/maven2//org/apache/avalon/framework/avalon-framework-api/4.3.1/avalon-framework-api-4.3.1.pom
2K downloaded  (avalon-framework-api-4.3.1.pom)
Downloading: http://www.mygrid.org.uk/maven/repository/org/apache/avalon/avalon-framework/1/avalon-framework-1.pom
[INFO] Unable to find resource 'org.apache.avalon:avalon-framework:pom:1' in repository mygrid-repository (http://www.mygrid.org.uk/maven/repository)
Downloading: http://uk.maven.org/maven2//org/apache/avalon/avalon-framework/1/avalon-framework-1.pom
1K downloaded  (avalon-framework-1.pom)
Downloading: http://www.mygrid.org.uk/maven/repository/org/apache/excalibur/excalibur/1/excalibur-1.pom
[INFO] Unable to find resource 'org.apache.excalibur:excalibur:pom:1' in repository mygrid-repository (http://www.mygrid.org.uk/maven/repository)
Downloading: http://uk.maven.org/maven2//org/apache/excalibur/excalibur/1/excalibur-1.pom
7K downloaded  (excalibur-1.pom)
Downloading: http://www.mygrid.org.uk/maven/repository/org/apache/avalon/framework/avalon-framework-impl/4.3.1/avalon-framework-impl-4.3.1.pom
[INFO] Unable to find resource 'org.apache.avalon.framework:avalon-framework-impl:pom:4.3.1' in repository mygrid-repository (http://www.mygrid.org.uk/maven/repository)
Downloading: http://uk.maven.org/maven2//org/apache/avalon/framework/avalon-framework-impl/4.3.1/avalon-framework-impl-4.3.1.pom
2K downloaded  (avalon-framework-impl-4.3.1.pom)
Downloading: http://www.mygrid.org.uk/maven/repository/org/apache/xmlgraphics/batik-svggen/1.7/batik-svggen-1.7.pom
[INFO] Unable to find resource 'org.apache.xmlgraphics:batik-svggen:pom:1.7' in repository mygrid-repository (http://www.mygrid.org.uk/maven/repository)
Downloading: http://uk.maven.org/maven2//org/apache/xmlgraphics/batik-svggen/1.7/batik-svggen-1.7.pom
3K downloaded  (batik-svggen-1.7.pom)
Downloading: http://www.mygrid.org.uk/maven/repository/commons-beanutils/commons-beanutils/1.8.3/commons-beanutils-1.8.3.pom
[INFO] Unable to find resource 'commons-beanutils:commons-beanutils:pom:1.8.3' in repository mygrid-repository (http://www.mygrid.org.uk/maven/repository)
Downloading: http://uk.maven.org/maven2//commons-beanutils/commons-beanutils/1.8.3/commons-beanutils-1.8.3.pom
10K downloaded  (commons-beanutils-1.8.3.pom)
Downloading: http://www.mygrid.org.uk/maven/repository/org/apache/commons/commons-parent/14/commons-parent-14.pom
[INFO] Unable to find resource 'org.apache.commons:commons-parent:pom:14' in repository mygrid-repository (http://www.mygrid.org.uk/maven/repository)
Downloading: http://uk.maven.org/maven2//org/apache/commons/commons-parent/14/commons-parent-14.pom
30K downloaded  (commons-parent-14.pom)
Downloading: http://www.mygrid.org.uk/maven/repository/net/sf/taverna/t2/ui-components/perspective-results/1.4/perspective-results-1.4.pom
1K downloaded  (perspective-results-1.4.pom)
Downloading: http://www.mygrid.org.uk/maven/repository/org/apache/abdera/abdera-filesystem/1.1.2/abdera-filesystem-1.1.2.pom
[INFO] Unable to find resource 'org.apache.abdera:abdera-filesystem:pom:1.1.2' in repository mygrid-repository (http://www.mygrid.org.uk/maven/repository)
Downloading: http://uk.maven.org/maven2/org/apache/abdera/abdera-filesystem/1.1.2/abdera-filesystem-1.1.2.pom
1K downloaded  (abdera-filesystem-1.1.2.pom)
Downloading: http://www.mygrid.org.uk/maven/repository/org/apache/abdera/abdera-adapters-parent/1.1.2/abdera-adapters-parent-1.1.2.pom
[INFO] Unable to find resource 'org.apache.abdera:abdera-adapters-parent:pom:1.1.2' in repository mygrid-repository (http://www.mygrid.org.uk/maven/repository)
Downloading: http://uk.maven.org/maven2/org/apache/abdera/abdera-adapters-parent/1.1.2/abdera-adapters-parent-1.1.2.pom
2K downloaded  (abdera-adapters-parent-1.1.2.pom)
Downloading: http://www.mygrid.org.uk/maven/repository/net/sf/taverna/t2/taverna-commandline/taverna-commandline-common/1.4/taverna-commandline-common-1.4.pom
3K downloaded  (taverna-commandline-common-1.4.pom)
Downloading: http://www.mygrid.org.uk/maven/repository/net/sf/taverna/t2/taverna-commandline/taverna-commandline/1.4/taverna-commandline-1.4.pom
1K downloaded  (taverna-commandline-1.4.pom)
Downloading: http://www.mygrid.org.uk/maven/repository/uk/org/mygrid/taverna/baclava/baclava-core/1.7.2.2/baclava-core-1.7.2.2.pom
1K downloaded  (baclava-core-1.7.2.2.pom)
Downloading: http://www.mygrid.org.uk/maven/repository/uk/org/mygrid/taverna/baclava/1.7.2.2/baclava-1.7.2.2.pom
801b downloaded  (baclava-1.7.2.2.pom)
Downloading: http://www.mygrid.org.uk/maven/repository/uk/org/mygrid/taverna/taverna/1.7.2.2/taverna-1.7.2.2.pom
9K downloaded  (taverna-1.7.2.2.pom)
Downloading: http://www.mygrid.org.uk/maven/repository/uk/org/mygrid/taverna/taverna-core/1.7.2.2/taverna-core-1.7.2.2.pom
1K downloaded  (taverna-core-1.7.2.2.pom)
Downloading: http://www.mygrid.org.uk/maven/repository/jdom/jdom/1.0/jdom-1.0.pom
[INFO] Unable to find resource 'jdom:jdom:pom:1.0' in repository mygrid-repository (http://www.mygrid.org.uk/maven/repository)
Downloading: http://uk.maven.org/maven2//jdom/jdom/1.0/jdom-1.0.pom
1K downloaded  (jdom-1.0.pom)
Downloading: http://www.mygrid.org.uk/maven/repository/uk/org/mygrid/taverna/raven/raven-log4j/1.9/raven-log4j-1.9.pom
889b downloaded  (raven-log4j-1.9.pom)
Downloading: http://www.mygrid.org.uk/maven/repository/net/sf/taverna/raven-parent/1.9/raven-parent-1.9.pom
6K downloaded  (raven-parent-1.9.pom)
Downloading: http://www.mygrid.org.uk/maven/repository/net/sf/taverna/parent/0.1.2008-11-03/parent-0.1.2008-11-03.pom
4K downloaded  (parent-0.1.2008-11-03.pom)
Downloading: http://www.mygrid.org.uk/maven/repository/uk/org/mygrid/taverna/taverna-bootstrap/1.7.2.2/taverna-bootstrap-1.7.2.2.pom
1K downloaded  (taverna-bootstrap-1.7.2.2.pom)
Downloading: http://www.mygrid.org.uk/maven/repository/commons-io/commons-io/1.2/commons-io-1.2.pom
[INFO] Unable to find resource 'commons-io:commons-io:pom:1.2' in repository mygrid-repository (http://www.mygrid.org.uk/maven/repository)
Downloading: http://uk.maven.org/maven2//commons-io/commons-io/1.2/commons-io-1.2.pom
6K downloaded  (commons-io-1.2.pom)
Downloading: http://www.mygrid.org.uk/maven/repository/net/sf/taverna/t2/ui-impl/data-management-config/1.4/data-management-config-1.4.pom
3K downloaded  (data-management-config-1.4.pom)
Downloading: http://www.mygrid.org.uk/maven/repository/org/apache/derby/derbyclient/10.6.1.0/derbyclient-10.6.1.0.pom
[INFO] Unable to find resource 'org.apache.derby:derbyclient:pom:10.6.1.0' in repository mygrid-repository (http://www.mygrid.org.uk/maven/repository)
Downloading: http://uk.maven.org/maven2//org/apache/derby/derbyclient/10.6.1.0/derbyclient-10.6.1.0.pom
2K downloaded  (derbyclient-10.6.1.0.pom)
Downloading: http://www.mygrid.org.uk/maven/repository/org/apache/derby/derby-project/10.6.1.0/derby-project-10.6.1.0.pom
[INFO] Unable to find resource 'org.apache.derby:derby-project:pom:10.6.1.0' in repository mygrid-repository (http://www.mygrid.org.uk/maven/repository)
Downloading: http://uk.maven.org/maven2//org/apache/derby/derby-project/10.6.1.0/derby-project-10.6.1.0.pom
6K downloaded  (derby-project-10.6.1.0.pom)
Downloading: http://www.mygrid.org.uk/maven/repository/org/apache/derby/derby/10.6.1.0/derby-10.6.1.0.pom
[INFO] Unable to find resource 'org.apache.derby:derby:pom:10.6.1.0' in repository mygrid-repository (http://www.mygrid.org.uk/maven/repository)
Downloading: http://uk.maven.org/maven2//org/apache/derby/derby/10.6.1.0/derby-10.6.1.0.pom
2K downloaded  (derby-10.6.1.0.pom)
Downloading: http://www.mygrid.org.uk/maven/repository/org/apache/derby/derbynet/10.6.1.0/derbynet-10.6.1.0.pom
[INFO] Unable to find resource 'org.apache.derby:derbynet:pom:10.6.1.0' in repository mygrid-repository (http://www.mygrid.org.uk/maven/repository)
Downloading: http://uk.maven.org/maven2//org/apache/derby/derbynet/10.6.1.0/derbynet-10.6.1.0.pom
2K downloaded  (derbynet-10.6.1.0.pom)
Downloading: http://www.mygrid.org.uk/maven/repository/simple-jndi/simple-jndi/0.11.1/simple-jndi-0.11.1.pom
[INFO] Unable to find resource 'simple-jndi:simple-jndi:pom:0.11.1' in repository mygrid-repository (http://www.mygrid.org.uk/maven/repository)
Downloading: http://uk.maven.org/maven2//simple-jndi/simple-jndi/0.11.1/simple-jndi-0.11.1.pom
3K downloaded  (simple-jndi-0.11.1.pom)
Downloading: http://www.mygrid.org.uk/maven/repository/commons-dbcp/commons-dbcp/1.4/commons-dbcp-1.4.pom
[INFO] Unable to find resource 'commons-dbcp:commons-dbcp:pom:1.4' in repository mygrid-repository (http://www.mygrid.org.uk/maven/repository)
Downloading: http://uk.maven.org/maven2//commons-dbcp/commons-dbcp/1.4/commons-dbcp-1.4.pom
10K downloaded  (commons-dbcp-1.4.pom)
Downloading: http://www.mygrid.org.uk/maven/repository/commons-pool/commons-pool/1.5.4/commons-pool-1.5.4.pom
[INFO] Unable to find resource 'commons-pool:commons-pool:pom:1.5.4' in repository mygrid-repository (http://www.mygrid.org.uk/maven/repository)
Downloading: http://uk.maven.org/maven2//commons-pool/commons-pool/1.5.4/commons-pool-1.5.4.pom
11K downloaded  (commons-pool-1.5.4.pom)
Downloading: http://www.mygrid.org.uk/maven/repository/net/sf/taverna/t2/lang/results/1.4/results-1.4.pom
1K downloaded  (results-1.4.pom)
Downloading: http://www.mygrid.org.uk/maven/repository/uk/org/mygrid/resources/mimeutil/mime-util/2.1.2-4/mime-util-2.1.2-4.pom
8K downloaded  (mime-util-2.1.2-4.pom)
Downloading: http://www.mygrid.org.uk/maven/repository/uk/org/mygrid/resources/clapper/ocutil/2.5.1/ocutil-2.5.1.pom
211b downloaded  (ocutil-2.5.1.pom)
Downloading: http://www.mygrid.org.uk/maven/repository/net/sf/taverna/t2/core/provenanceconnector/1.4/provenanceconnector-1.4.pom
4K downloaded  (provenanceconnector-1.4.pom)
Downloading: http://www.mygrid.org.uk/maven/repository/org/tupeloproject/tupelo-cet/2.6/tupelo-cet-2.6.pom
2K downloaded  (tupelo-cet-2.6.pom)
Downloading: http://www.mygrid.org.uk/maven/repository/org/tupeloproject/tupelo-core/2.6/tupelo-core-2.6.pom
2K downloaded  (tupelo-core-2.6.pom)
Downloading: http://www.mygrid.org.uk/maven/repository/org/tupeloproject/tupelo-all/2.6/tupelo-all-2.6.pom
3K downloaded  (tupelo-all-2.6.pom)
Downloading: http://www.mygrid.org.uk/maven/repository/org/tupeloproject/tupelo-kernel/2.6/tupelo-kernel-2.6.pom
3K downloaded  (tupelo-kernel-2.6.pom)
Downloading: http://www.mygrid.org.uk/maven/repository/org/tupeloproject/tupelo-util/2.6/tupelo-util-2.6.pom
2K downloaded  (tupelo-util-2.6.pom)
Downloading: http://www.mygrid.org.uk/maven/repository/org/openprovenance/opm-core/1.1.8/opm-core-1.1.8.pom
17K downloaded  (opm-core-1.1.8.pom)
Downloading: http://www.mygrid.org.uk/maven/repository/org/openprovenance/specs/1.1.8/specs-1.1.8.pom
9K downloaded  (specs-1.1.8.pom)
Downloading: http://www.mygrid.org.uk/maven/repository/javax/xml/bind/jaxb-api/2.1/jaxb-api-2.1.pom
[INFO] Unable to find resource 'javax.xml.bind:jaxb-api:pom:2.1' in repository mygrid-repository (http://www.mygrid.org.uk/maven/repository)
Downloading: http://uk.maven.org/maven2//javax/xml/bind/jaxb-api/2.1/jaxb-api-2.1.pom
486b downloaded  (jaxb-api-2.1.pom)
Downloading: http://www.mygrid.org.uk/maven/repository/javax/xml/stream/stax-api/1.0-2/stax-api-1.0-2.pom
[INFO] Unable to find resource 'javax.xml.stream:stax-api:pom:1.0-2' in repository mygrid-repository (http://www.mygrid.org.uk/maven/repository)
Downloading: http://uk.maven.org/maven2//javax/xml/stream/stax-api/1.0-2/stax-api-1.0-2.pom
962b downloaded  (stax-api-1.0-2.pom)
Downloading: http://www.mygrid.org.uk/maven/repository/com/sun/xml/bind/jaxb-impl/2.1.12/jaxb-impl-2.1.12.pom
[INFO] Unable to find resource 'com.sun.xml.bind:jaxb-impl:pom:2.1.12' in repository mygrid-repository (http://www.mygrid.org.uk/maven/repository)
Downloading: http://uk.maven.org/maven2//com/sun/xml/bind/jaxb-impl/2.1.12/jaxb-impl-2.1.12.pom
340b downloaded  (jaxb-impl-2.1.12.pom)
Downloading: http://www.mygrid.org.uk/maven/repository/org/jvnet/jaxb2_commons/runtime/0.4.1.5/runtime-0.4.1.5.pom
[INFO] Unable to find resource 'org.jvnet.jaxb2_commons:runtime:pom:0.4.1.5' in repository mygrid-repository (http://www.mygrid.org.uk/maven/repository)
Downloading: http://uk.maven.org/maven2//org/jvnet/jaxb2_commons/runtime/0.4.1.5/runtime-0.4.1.5.pom
1K downloaded  (runtime-0.4.1.5.pom)
Downloading: http://www.mygrid.org.uk/maven/repository/org/jvnet/jaxb2_commons/project/0.4.1.5/project-0.4.1.5.pom
[INFO] Unable to find resource 'org.jvnet.jaxb2_commons:project:pom:0.4.1.5' in repository mygrid-repository (http://www.mygrid.org.uk/maven/repository)
Downloading: http://uk.maven.org/maven2//org/jvnet/jaxb2_commons/project/0.4.1.5/project-0.4.1.5.pom
8K downloaded  (project-0.4.1.5.pom)
Downloading: http://www.mygrid.org.uk/maven/repository/com/sun/xml/bind/jaxb-impl/2.1.10/jaxb-impl-2.1.10.pom
[INFO] Unable to find resource 'com.sun.xml.bind:jaxb-impl:pom:2.1.10' in repository mygrid-repository (http://www.mygrid.org.uk/maven/repository)
Downloading: http://uk.maven.org/maven2//com/sun/xml/bind/jaxb-impl/2.1.10/jaxb-impl-2.1.10.pom
340b downloaded  (jaxb-impl-2.1.10.pom)
Downloading: http://www.mygrid.org.uk/maven/repository/commons-lang/commons-lang/2.2/commons-lang-2.2.pom
[INFO] Unable to find resource 'commons-lang:commons-lang:pom:2.2' in repository mygrid-repository (http://www.mygrid.org.uk/maven/repository)
Downloading: http://uk.maven.org/maven2//commons-lang/commons-lang/2.2/commons-lang-2.2.pom
10K downloaded  (commons-lang-2.2.pom)
Downloading: http://www.mygrid.org.uk/maven/repository/commons-jxpath/commons-jxpath/1.2/commons-jxpath-1.2.pom
[INFO] Unable to find resource 'commons-jxpath:commons-jxpath:pom:1.2' in repository mygrid-repository (http://www.mygrid.org.uk/maven/repository)
Downloading: http://uk.maven.org/maven2//commons-jxpath/commons-jxpath/1.2/commons-jxpath-1.2.pom
4K downloaded  (commons-jxpath-1.2.pom)
Downloading: http://www.mygrid.org.uk/maven/repository/servletapi/servletapi/2.2/servletapi-2.2.pom
[INFO] Unable to find resource 'servletapi:servletapi:pom:2.2' in repository mygrid-repository (http://www.mygrid.org.uk/maven/repository)
Downloading: http://uk.maven.org/maven2//servletapi/servletapi/2.2/servletapi-2.2.pom
740b downloaded  (servletapi-2.2.pom)
Downloading: http://www.mygrid.org.uk/maven/repository/javax/servlet/servlet-api/2.2/servlet-api-2.2.pom
[INFO] Unable to find resource 'javax.servlet:servlet-api:pom:2.2' in repository mygrid-repository (http://www.mygrid.org.uk/maven/repository)
Downloading: http://uk.maven.org/maven2//javax/servlet/servlet-api/2.2/servlet-api-2.2.pom
156b downloaded  (servlet-api-2.2.pom)
Downloading: http://www.mygrid.org.uk/maven/repository/junit/junit/3.8/junit-3.8.pom
[INFO] Unable to find resource 'junit:junit:pom:3.8' in repository mygrid-repository (http://www.mygrid.org.uk/maven/repository)
Downloading: http://uk.maven.org/maven2//junit/junit/3.8/junit-3.8.pom
744b downloaded  (junit-3.8.pom)
Downloading: http://www.mygrid.org.uk/maven/repository/jdom/jdom/b9/jdom-b9.pom
[INFO] Unable to find resource 'jdom:jdom:pom:b9' in repository mygrid-repository (http://www.mygrid.org.uk/maven/repository)
Downloading: http://uk.maven.org/maven2//jdom/jdom/b9/jdom-b9.pom
139b downloaded  (jdom-b9.pom)
Downloading: http://www.mygrid.org.uk/maven/repository/commons-beanutils/commons-beanutils/1.4/commons-beanutils-1.4.pom
[INFO] Unable to find resource 'commons-beanutils:commons-beanutils:pom:1.4' in repository mygrid-repository (http://www.mygrid.org.uk/maven/repository)
Downloading: http://uk.maven.org/maven2//commons-beanutils/commons-beanutils/1.4/commons-beanutils-1.4.pom
1K downloaded  (commons-beanutils-1.4.pom)
Downloading: http://www.mygrid.org.uk/maven/repository/commons-logging/commons-logging/1.0/commons-logging-1.0.pom
[INFO] Unable to find resource 'commons-logging:commons-logging:pom:1.0' in repository mygrid-repository (http://www.mygrid.org.uk/maven/repository)
Downloading: http://uk.maven.org/maven2//commons-logging/commons-logging/1.0/commons-logging-1.0.pom
163b downloaded  (commons-logging-1.0.pom)
Downloading: http://www.mygrid.org.uk/maven/repository/commons-collections/commons-collections/2.0/commons-collections-2.0.pom
[INFO] Unable to find resource 'commons-collections:commons-collections:pom:2.0' in repository mygrid-repository (http://www.mygrid.org.uk/maven/repository)
Downloading: http://uk.maven.org/maven2//commons-collections/commons-collections/2.0/commons-collections-2.0.pom
171b downloaded  (commons-collections-2.0.pom)
Downloading: http://www.mygrid.org.uk/maven/repository/net/sf/taverna/t2/provenance-client/0.1/provenance-client-0.1.pom
2K downloaded  (provenance-client-0.1.pom)
Downloading: http://www.mygrid.org.uk/maven/repository/net/sf/taverna/t2/core/provenance-mysql/1.4/provenance-mysql-1.4.pom
1K downloaded  (provenance-mysql-1.4.pom)
Downloading: http://www.mygrid.org.uk/maven/repository/net/sf/taverna/t2/core/provenance-derby/1.4/provenance-derby-1.4.pom
2K downloaded  (provenance-derby-1.4.pom)
Downloading: http://www.mygrid.org.uk/maven/repository/com/hp/hpl/jena/arq/2.8.7/arq-2.8.7.pom
[INFO] Unable to find resource 'com.hp.hpl.jena:arq:pom:2.8.7' in repository mygrid-repository (http://www.mygrid.org.uk/maven/repository)
Downloading: http://uk.maven.org/maven2//com/hp/hpl/jena/arq/2.8.7/arq-2.8.7.pom
13K downloaded  (arq-2.8.7.pom)
Downloading: http://www.mygrid.org.uk/maven/repository/com/hp/hpl/jena/jena/2.6.4/jena-2.6.4.pom
[INFO] Unable to find resource 'com.hp.hpl.jena:jena:pom:2.6.4' in repository mygrid-repository (http://www.mygrid.org.uk/maven/repository)
Downloading: http://uk.maven.org/maven2//com/hp/hpl/jena/jena/2.6.4/jena-2.6.4.pom
14K downloaded  (jena-2.6.4.pom)
Downloading: http://www.mygrid.org.uk/maven/repository/com/hp/hpl/jena/iri/0.8/iri-0.8.pom
[INFO] Unable to find resource 'com.hp.hpl.jena:iri:pom:0.8' in repository mygrid-repository (http://www.mygrid.org.uk/maven/repository)
Downloading: http://uk.maven.org/maven2//com/hp/hpl/jena/iri/0.8/iri-0.8.pom
5K downloaded  (iri-0.8.pom)
Downloading: http://www.mygrid.org.uk/maven/repository/com/ibm/icu/icu4j/3.4.4/icu4j-3.4.4.pom
[INFO] Unable to find resource 'com.ibm.icu:icu4j:pom:3.4.4' in repository mygrid-repository (http://www.mygrid.org.uk/maven/repository)
Downloading: http://uk.maven.org/maven2//com/ibm/icu/icu4j/3.4.4/icu4j-3.4.4.pom
1009b downloaded  (icu4j-3.4.4.pom)
Downloading: http://www.mygrid.org.uk/maven/repository/xerces/xercesImpl/2.7.1/xercesImpl-2.7.1.pom
[INFO] Unable to find resource 'xerces:xercesImpl:pom:2.7.1' in repository mygrid-repository (http://www.mygrid.org.uk/maven/repository)
Downloading: http://uk.maven.org/maven2//xerces/xercesImpl/2.7.1/xercesImpl-2.7.1.pom
150b downloaded  (xercesImpl-2.7.1.pom)
Downloading: http://www.mygrid.org.uk/maven/repository/org/apache/lucene/lucene-core/2.3.1/lucene-core-2.3.1.pom
[INFO] Unable to find resource 'org.apache.lucene:lucene-core:pom:2.3.1' in repository mygrid-repository (http://www.mygrid.org.uk/maven/repository)
Downloading: http://uk.maven.org/maven2//org/apache/lucene/lucene-core/2.3.1/lucene-core-2.3.1.pom
1K downloaded  (lucene-core-2.3.1.pom)
Downloading: http://www.mygrid.org.uk/maven/repository/org/apache/lucene/lucene-parent/2.3.1/lucene-parent-2.3.1.pom
[INFO] Unable to find resource 'org.apache.lucene:lucene-parent:pom:2.3.1' in repository mygrid-repository (http://www.mygrid.org.uk/maven/repository)
Downloading: http://uk.maven.org/maven2//org/apache/lucene/lucene-parent/2.3.1/lucene-parent-2.3.1.pom
3K downloaded  (lucene-parent-2.3.1.pom)
Downloading: http://www.mygrid.org.uk/maven/repository/log4j/log4j/1.2.14/log4j-1.2.14.pom
[INFO] Unable to find resource 'log4j:log4j:pom:1.2.14' in repository mygrid-repository (http://www.mygrid.org.uk/maven/repository)
Downloading: http://uk.maven.org/maven2//log4j/log4j/1.2.14/log4j-1.2.14.pom
2K downloaded  (log4j-1.2.14.pom)
Downloading: http://www.mygrid.org.uk/maven/repository/commons-net/commons-net/2.0/commons-net-2.0.pom
[INFO] Unable to find resource 'commons-net:commons-net:pom:2.0' in repository mygrid-repository (http://www.mygrid.org.uk/maven/repository)
Downloading: http://uk.maven.org/maven2//commons-net/commons-net/2.0/commons-net-2.0.pom
7K downloaded  (commons-net-2.0.pom)
Downloading: http://www.mygrid.org.uk/maven/repository/net/sf/taverna/t2/taverna-workbench/workbench-dev/2.4.1/workbench-dev-2.4.1.pom
2K downloaded  (workbench-dev-2.4.1.pom)
Downloading: http://www.mygrid.org.uk/maven/repository/net/sf/taverna/t2/taverna-workbench/2.4.1/taverna-workbench-2.4.1.pom
2K downloaded  (taverna-workbench-2.4.1.pom)
Downloading: http://www.mygrid.org.uk/maven/repository/net/sf/taverna/t2/taverna-workbench/workbench-common/2.4.1/workbench-common-2.4.1.pom
4K downloaded  (workbench-common-2.4.1.pom)
Downloading: http://www.mygrid.org.uk/maven/repository/net/sf/taverna/t2/infrastructure/launcher/2.4/launcher-2.4.pom
1K downloaded  (launcher-2.4.pom)
Downloading: http://www.mygrid.org.uk/maven/repository/net/sf/taverna/t2/infrastructure/plugins-api/2.4/plugins-api-2.4.pom
2K downloaded  (plugins-api-2.4.pom)
Downloading: http://www.mygrid.org.uk/maven/repository/org/apache/xmlbeans/xmlbeans/2.4.0/xmlbeans-2.4.0.pom
[INFO] Unable to find resource 'org.apache.xmlbeans:xmlbeans:pom:2.4.0' in repository mygrid-repository (http://www.mygrid.org.uk/maven/repository)
Downloading: http://uk.maven.org/maven2//org/apache/xmlbeans/xmlbeans/2.4.0/xmlbeans-2.4.0.pom
4K downloaded  (xmlbeans-2.4.0.pom)
Downloading: http://www.mygrid.org.uk/maven/repository/stax/stax-api/1.0.1/stax-api-1.0.1.pom
[INFO] Unable to find resource 'stax:stax-api:pom:1.0.1' in repository mygrid-repository (http://www.mygrid.org.uk/maven/repository)
Downloading: http://uk.maven.org/maven2//stax/stax-api/1.0.1/stax-api-1.0.1.pom
1K downloaded  (stax-api-1.0.1.pom)
Downloading: http://www.mygrid.org.uk/maven/repository/saxpath/saxpath/1.0-FCS/saxpath-1.0-FCS.pom
[INFO] Unable to find resource 'saxpath:saxpath:pom:1.0-FCS' in repository mygrid-repository (http://www.mygrid.org.uk/maven/repository)
Downloading: http://uk.maven.org/maven2//saxpath/saxpath/1.0-FCS/saxpath-1.0-FCS.pom
150b downloaded  (saxpath-1.0-FCS.pom)
Downloading: http://www.mygrid.org.uk/maven/repository/xerces/xercesImpl/2.9.1/xercesImpl-2.9.1.pom
[INFO] Unable to find resource 'xerces:xercesImpl:pom:2.9.1' in repository mygrid-repository (http://www.mygrid.org.uk/maven/repository)
Downloading: http://uk.maven.org/maven2//xerces/xercesImpl/2.9.1/xercesImpl-2.9.1.pom
1K downloaded  (xercesImpl-2.9.1.pom)
Downloading: http://www.mygrid.org.uk/maven/repository/xalan/xalan/2.7.1/xalan-2.7.1.pom
[INFO] Unable to find resource 'xalan:xalan:pom:2.7.1' in repository mygrid-repository (http://www.mygrid.org.uk/maven/repository)
Downloading: http://uk.maven.org/maven2//xalan/xalan/2.7.1/xalan-2.7.1.pom
1K downloaded  (xalan-2.7.1.pom)
Downloading: http://www.mygrid.org.uk/maven/repository/javax/mail/mail/1.4.1/mail-1.4.1.pom
[INFO] Unable to find resource 'javax.mail:mail:pom:1.4.1' in repository mygrid-repository (http://www.mygrid.org.uk/maven/repository)
Downloading: http://uk.maven.org/maven2//javax/mail/mail/1.4.1/mail-1.4.1.pom
995b downloaded  (mail-1.4.1.pom)
Downloading: http://www.mygrid.org.uk/maven/repository/javax/activation/activation/1.1.1/activation-1.1.1.pom
[INFO] Unable to find resource 'javax.activation:activation:pom:1.1.1' in repository mygrid-repository (http://www.mygrid.org.uk/maven/repository)
Downloading: http://uk.maven.org/maven2//javax/activation/activation/1.1.1/activation-1.1.1.pom
644b downloaded  (activation-1.1.1.pom)
Downloading: http://www.mygrid.org.uk/maven/repository/net/java/dev/jai-imageio/jai-imageio-core-standalone/1.2-pre-dr-b04-2010-04-30/jai-imageio-core-standalone-1.2-pre-dr-b04-2010-04-30.pom
4K downloaded  (jai-imageio-core-standalone-1.2-pre-dr-b04-2010-04-30.pom)
Downloading: http://www.mygrid.org.uk/maven/repository/net/sf/taverna/t2/taverna-workbench/plugins/activities-plugin/2.4.1/activities-plugin-2.4.1.pom
965b downloaded  (activities-plugin-2.4.1.pom)
Downloading: http://www.mygrid.org.uk/maven/repository/net/sf/taverna/t2/taverna-workbench/plugins/2.4.1/plugins-2.4.1.pom
868b downloaded  (plugins-2.4.1.pom)
Downloading: http://www.mygrid.org.uk/maven/repository/net/sf/taverna/t2/activities/all-activities/1.4/all-activities-1.4.pom
2K downloaded  (all-activities-1.4.pom)
Downloading: http://www.mygrid.org.uk/maven/repository/net/sf/taverna/t2/activities/beanshell-activity/1.4/beanshell-activity-1.4.pom
1K downloaded  (beanshell-activity-1.4.pom)
Downloading: http://www.mygrid.org.uk/maven/repository/net/sf/taverna/t2/activities/dependency-activity/1.4/dependency-activity-1.4.pom
918b downloaded  (dependency-activity-1.4.pom)
Downloading: http://www.mygrid.org.uk/maven/repository/org/beanshell/bsh/2.0b4/bsh-2.0b4.pom
[INFO] Unable to find resource 'org.beanshell:bsh:pom:2.0b4' in repository mygrid-repository (http://www.mygrid.org.uk/maven/repository)
Downloading: http://uk.maven.org/maven2//org/beanshell/bsh/2.0b4/bsh-2.0b4.pom
1K downloaded  (bsh-2.0b4.pom)
Downloading: http://www.mygrid.org.uk/maven/repository/org/beanshell/beanshell/2.0b4/beanshell-2.0b4.pom
[INFO] Unable to find resource 'org.beanshell:beanshell:pom:2.0b4' in repository mygrid-repository (http://www.mygrid.org.uk/maven/repository)
Downloading: http://uk.maven.org/maven2//org/beanshell/beanshell/2.0b4/beanshell-2.0b4.pom
1K downloaded  (beanshell-2.0b4.pom)
Downloading: http://www.mygrid.org.uk/maven/repository/net/sf/taverna/t2/activities/dataflow-activity/1.4/dataflow-activity-1.4.pom
1K downloaded  (dataflow-activity-1.4.pom)
Downloading: http://www.mygrid.org.uk/maven/repository/net/sf/taverna/t2/activities/localworker-activity/1.4/localworker-activity-1.4.pom
1K downloaded  (localworker-activity-1.4.pom)
Downloading: http://www.mygrid.org.uk/maven/repository/net/sf/taverna/t2/activities/rest-activity/1.4/rest-activity-1.4.pom
2K downloaded  (rest-activity-1.4.pom)
Downloading: http://www.mygrid.org.uk/maven/repository/org/apache/httpcomponents/httpclient/4.0.1/httpclient-4.0.1.pom
[INFO] Unable to find resource 'org.apache.httpcomponents:httpclient:pom:4.0.1' in repository mygrid-repository (http://www.mygrid.org.uk/maven/repository)
Downloading: http://uk.maven.org/maven2//org/apache/httpcomponents/httpclient/4.0.1/httpclient-4.0.1.pom
6K downloaded  (httpclient-4.0.1.pom)
Downloading: http://www.mygrid.org.uk/maven/repository/org/apache/httpcomponents/httpcomponents-client/4.0.1/httpcomponents-client-4.0.1.pom
[INFO] Unable to find resource 'org.apache.httpcomponents:httpcomponents-client:pom:4.0.1' in repository mygrid-repository (http://www.mygrid.org.uk/maven/repository)
Downloading: http://uk.maven.org/maven2//org/apache/httpcomponents/httpcomponents-client/4.0.1/httpcomponents-client-4.0.1.pom
8K downloaded  (httpcomponents-client-4.0.1.pom)
Downloading: http://www.mygrid.org.uk/maven/repository/org/apache/httpcomponents/project/4.0/project-4.0.pom
[INFO] Unable to find resource 'org.apache.httpcomponents:project:pom:4.0' in repository mygrid-repository (http://www.mygrid.org.uk/maven/repository)
Downloading: http://uk.maven.org/maven2//org/apache/httpcomponents/project/4.0/project-4.0.pom
12K downloaded  (project-4.0.pom)
Downloading: http://www.mygrid.org.uk/maven/repository/org/apache/httpcomponents/httpcore/4.0.1/httpcore-4.0.1.pom
[INFO] Unable to find resource 'org.apache.httpcomponents:httpcore:pom:4.0.1' in repository mygrid-repository (http://www.mygrid.org.uk/maven/repository)
Downloading: http://uk.maven.org/maven2//org/apache/httpcomponents/httpcore/4.0.1/httpcore-4.0.1.pom
4K downloaded  (httpcore-4.0.1.pom)
Downloading: http://www.mygrid.org.uk/maven/repository/org/apache/httpcomponents/httpcomponents-core/4.0.1/httpcomponents-core-4.0.1.pom
[INFO] Unable to find resource 'org.apache.httpcomponents:httpcomponents-core:pom:4.0.1' in repository mygrid-repository (http://www.mygrid.org.uk/maven/repository)
Downloading: http://uk.maven.org/maven2//org/apache/httpcomponents/httpcomponents-core/4.0.1/httpcomponents-core-4.0.1.pom
9K downloaded  (httpcomponents-core-4.0.1.pom)
Downloading: http://www.mygrid.org.uk/maven/repository/commons-codec/commons-codec/1.3/commons-codec-1.3.pom
[INFO] Unable to find resource 'commons-codec:commons-codec:pom:1.3' in repository mygrid-repository (http://www.mygrid.org.uk/maven/repository)
Downloading: http://uk.maven.org/maven2//commons-codec/commons-codec/1.3/commons-codec-1.3.pom
5K downloaded  (commons-codec-1.3.pom)
Downloading: http://www.mygrid.org.uk/maven/repository/net/sf/taverna/t2/ui-api/report-api/1.4/report-api-1.4.pom
1K downloaded  (report-api-1.4.pom)
Downloading: http://www.mygrid.org.uk/maven/repository/net/sf/taverna/t2/ui-components/report-view/1.4/report-view-1.4.pom
3K downloaded  (report-view-1.4.pom)
Downloading: http://www.mygrid.org.uk/maven/repository/net/sf/taverna/t2/activities/stringconstant-activity/1.4/stringconstant-activity-1.4.pom
1K downloaded  (stringconstant-activity-1.4.pom)
Downloading: http://www.mygrid.org.uk/maven/repository/net/sf/taverna/t2/activities/xpath-activity/1.4/xpath-activity-1.4.pom
1K downloaded  (xpath-activity-1.4.pom)
Downloading: http://www.mygrid.org.uk/maven/repository/net/sf/taverna/t2/ui-activities/all-activity-uis/1.4.1/all-activity-uis-1.4.1.pom
3K downloaded  (all-activity-uis-1.4.1.pom)
Downloading: http://www.mygrid.org.uk/maven/repository/net/sf/taverna/t2/ui-activities/1.4.1/ui-activities-1.4.1.pom
3K downloaded  (ui-activities-1.4.1.pom)
Downloading: http://www.mygrid.org.uk/maven/repository/net/sf/taverna/t2/ui-activities/beanshell-activity-ui/1.4.1/beanshell-activity-ui-1.4.1.pom
2K downloaded  (beanshell-activity-ui-1.4.1.pom)
Downloading: http://www.mygrid.org.uk/maven/repository/net/sf/taverna/t2/ui-activities/dataflow-activity-ui/1.4.1/dataflow-activity-ui-1.4.1.pom
2K downloaded  (dataflow-activity-ui-1.4.1.pom)
Downloading: http://www.mygrid.org.uk/maven/repository/net/sf/taverna/t2/ui-activities/disabled-activity-ui/1.4/disabled-activity-ui-1.4.pom
2K downloaded  (disabled-activity-ui-1.4.pom)
Downloading: http://www.mygrid.org.uk/maven/repository/net/sf/taverna/t2/ui-activities/1.4/ui-activities-1.4.pom
3K downloaded  (ui-activities-1.4.pom)
Downloading: http://www.mygrid.org.uk/maven/repository/net/sf/taverna/t2/lang/uibuilder/1.4/uibuilder-1.4.pom
798b downloaded  (uibuilder-1.4.pom)
Downloading: http://www.mygrid.org.uk/maven/repository/net/sf/taverna/t2/ui-activities/localworker-activity-ui/1.4.1/localworker-activity-ui-1.4.1.pom
2K downloaded  (localworker-activity-ui-1.4.1.pom)
Downloading: http://www.mygrid.org.uk/maven/repository/net/sf/taverna/t2/ui-activities/rest-activity-ui/1.4.1/rest-activity-ui-1.4.1.pom
2K downloaded  (rest-activity-ui-1.4.1.pom)
Downloading: http://www.mygrid.org.uk/maven/repository/net/sf/taverna/t2/ui-activities/stringconstant-activity-ui/1.4.1/stringconstant-activity-ui-1.4.1.pom
2K downloaded  (stringconstant-activity-ui-1.4.1.pom)
Downloading: http://www.mygrid.org.uk/maven/repository/net/sf/taverna/t2/ui-activities/unrecognized-activity-ui/1.4/unrecognized-activity-ui-1.4.pom
2K downloaded  (unrecognized-activity-ui-1.4.pom)
Downloading: http://www.mygrid.org.uk/maven/repository/net/sf/taverna/t2/ui-activities/xpath-activity-ui/1.4.1/xpath-activity-ui-1.4.1.pom
2K downloaded  (xpath-activity-ui-1.4.1.pom)
Downloading: http://www.mygrid.org.uk/maven/repository/net/sf/taverna/t2/taverna-workbench/plugins/externaltool-plugin/2.4.1/externaltool-plugin-2.4.1.pom
1K downloaded  (externaltool-plugin-2.4.1.pom)
Downloading: http://www.mygrid.org.uk/maven/repository/net/sf/taverna/t2/activities/external-tool-activity/1.4/external-tool-activity-1.4.pom
2K downloaded  (external-tool-activity-1.4.pom)
Downloading: http://www.mygrid.org.uk/maven/repository/com/jcraft/jsch/0.1.42/jsch-0.1.42.pom
[INFO] Unable to find resource 'com.jcraft:jsch:pom:0.1.42' in repository mygrid-repository (http://www.mygrid.org.uk/maven/repository)
Downloading: http://uk.maven.org/maven2//com/jcraft/jsch/0.1.42/jsch-0.1.42.pom
967b downloaded  (jsch-0.1.42.pom)
Downloading: http://www.mygrid.org.uk/maven/repository/net/sf/taverna/t2/activities/usecase-activity/1.4/usecase-activity-1.4.pom
723b downloaded  (usecase-activity-1.4.pom)
Downloading: http://www.mygrid.org.uk/maven/repository/net/sf/taverna/t2/ui-activities/external-tool-activity-ui/1.4.1/external-tool-activity-ui-1.4.1.pom
2K downloaded  (external-tool-activity-ui-1.4.1.pom)
Downloading: http://www.mygrid.org.uk/maven/repository/net/sf/taverna/t2/ui-impl/renderers-impl/1.4/renderers-impl-1.4.pom
1K downloaded  (renderers-impl-1.4.pom)
Downloading: http://www.mygrid.org.uk/maven/repository/net/sf/taverna/t2/ui-api/renderers-api/1.4/renderers-api-1.4.pom
940b downloaded  (renderers-api-1.4.pom)
Downloading: http://www.mygrid.org.uk/maven/repository/org/fife/ui/hex/hexeditor/1.0.2011-07-04/hexeditor-1.0.2011-07-04.pom
1K downloaded  (hexeditor-1.0.2011-07-04.pom)
Downloading: http://www.mygrid.org.uk/maven/repository/net/sf/taverna/t2/taverna-workbench/plugins/components-plugin/2.4.1/components-plugin-2.4.1.pom
6K downloaded  (components-plugin-2.4.1.pom)
Downloading: http://www.mygrid.org.uk/maven/repository/net/sf/taverna/t2/ui-impl/update-manager/1.4/update-manager-1.4.pom
875b downloaded  (update-manager-1.4.pom)
Downloading: http://www.mygrid.org.uk/maven/repository/net/sf/taverna/t2/ui-impl/plugins-gui/1.4/plugins-gui-1.4.pom
1K downloaded  (plugins-gui-1.4.pom)
Downloading: http://www.mygrid.org.uk/maven/repository/net/sf/taverna/t2/ui-components/activity-palette-ui/1.4/activity-palette-ui-1.4.pom
2K downloaded  (activity-palette-ui-1.4.pom)
Downloading: http://www.mygrid.org.uk/maven/repository/net/sf/taverna/t2/ui-impl/activity-palette-impl/1.4/activity-palette-impl-1.4.pom
1K downloaded  (activity-palette-impl-1.4.pom)
Downloading: http://www.mygrid.org.uk/maven/repository/net/sf/taverna/t2/ui-components/iteration-strategy-ui/1.4/iteration-strategy-ui-1.4.pom
2K downloaded  (iteration-strategy-ui-1.4.pom)
Downloading: http://www.mygrid.org.uk/maven/repository/net/sf/taverna/t2/ui-components/perspective-design/1.4.1/perspective-design-1.4.1.pom
1K downloaded  (perspective-design-1.4.1.pom)
Downloading: http://www.mygrid.org.uk/maven/repository/net/sf/taverna/t2/ui-components/results-view/1.4.1/results-view-1.4.1.pom
3K downloaded  (results-view-1.4.1.pom)
Downloading: http://www.mygrid.org.uk/maven/repository/org/apache/poi/poi/3.6/poi-3.6.pom
[INFO] Unable to find resource 'org.apache.poi:poi:pom:3.6' in repository mygrid-repository (http://www.mygrid.org.uk/maven/repository)
Downloading: http://uk.maven.org/maven2//org/apache/poi/poi/3.6/poi-3.6.pom
2K downloaded  (poi-3.6.pom)
Downloading: http://www.mygrid.org.uk/maven/repository/commons-logging/commons-logging/1.1/commons-logging-1.1.pom
[INFO] Unable to find resource 'commons-logging:commons-logging:pom:1.1' in repository mygrid-repository (http://www.mygrid.org.uk/maven/repository)
Downloading: http://uk.maven.org/maven2//commons-logging/commons-logging/1.1/commons-logging-1.1.pom
6K downloaded  (commons-logging-1.1.pom)
Downloading: http://www.mygrid.org.uk/maven/repository/net/sf/taverna/t2/ui-components/run-ui/1.4.1/run-ui-1.4.1.pom
2K downloaded  (run-ui-1.4.1.pom)
Downloading: http://www.mygrid.org.uk/maven/repository/net/sf/taverna/t2/ui-impl/httpproxy-config/1.4/httpproxy-config-1.4.pom
1K downloaded  (httpproxy-config-1.4.pom)
Downloading: http://www.mygrid.org.uk/maven/repository/axis/axis/1.4/axis-1.4.pom
[INFO] Unable to find resource 'axis:axis:pom:1.4' in repository mygrid-repository (http://www.mygrid.org.uk/maven/repository)
Downloading: http://uk.maven.org/maven2//axis/axis/1.4/axis-1.4.pom
2K downloaded  (axis-1.4.pom)
Downloading: http://www.mygrid.org.uk/maven/repository/axis/axis-jaxrpc/1.4/axis-jaxrpc-1.4.pom
185b downloaded  (axis-jaxrpc-1.4.pom)
Downloading: http://www.mygrid.org.uk/maven/repository/axis/axis-saaj/1.4/axis-saaj-1.4.pom
183b downloaded  (axis-saaj-1.4.pom)
Downloading: http://www.mygrid.org.uk/maven/repository/axis/axis-wsdl4j/1.5.1/axis-wsdl4j-1.5.1.pom
[INFO] Unable to find resource 'axis:axis-wsdl4j:pom:1.5.1' in repository mygrid-repository (http://www.mygrid.org.uk/maven/repository)
Downloading: http://uk.maven.org/maven2//axis/axis-wsdl4j/1.5.1/axis-wsdl4j-1.5.1.pom
149b downloaded  (axis-wsdl4j-1.5.1.pom)
Downloading: http://www.mygrid.org.uk/maven/repository/commons-discovery/commons-discovery/0.2/commons-discovery-0.2.pom
[INFO] Unable to find resource 'commons-discovery:commons-discovery:pom:0.2' in repository mygrid-repository (http://www.mygrid.org.uk/maven/repository)
Downloading: http://uk.maven.org/maven2//commons-discovery/commons-discovery/0.2/commons-discovery-0.2.pom
1K downloaded  (commons-discovery-0.2.pom)
Downloading: http://www.mygrid.org.uk/maven/repository/commons-logging/commons-logging/1.0.3/commons-logging-1.0.3.pom
[INFO] Unable to find resource 'commons-logging:commons-logging:pom:1.0.3' in repository mygrid-repository (http://www.mygrid.org.uk/maven/repository)
Downloading: http://uk.maven.org/maven2//commons-logging/commons-logging/1.0.3/commons-logging-1.0.3.pom
866b downloaded  (commons-logging-1.0.3.pom)
Downloading: http://www.mygrid.org.uk/maven/repository/net/sf/taverna/t2/ui-components/monitor-view/1.4.1/monitor-view-1.4.1.pom
2K downloaded  (monitor-view-1.4.1.pom)
Downloading: http://www.mygrid.org.uk/maven/repository/net/sf/taverna/t2/ui-components/reference-ui/1.4.1/reference-ui-1.4.1.pom
4K downloaded  (reference-ui-1.4.1.pom)
Downloading: http://www.mygrid.org.uk/maven/repository/net/sf/taverna/t2/ui-components/data-management-config-ui/1.4/data-management-config-ui-1.4.pom
2K downloaded  (data-management-config-ui-1.4.pom)
Downloading: http://www.mygrid.org.uk/maven/repository/net/sf/taverna/t2/ui-components/workflow-explorer/1.4/workflow-explorer-1.4.pom
2K downloaded  (workflow-explorer-1.4.pom)
Downloading: http://www.mygrid.org.uk/maven/repository/net/sf/taverna/t2/ui-components/contextual-views/1.4/contextual-views-1.4.pom
1K downloaded  (contextual-views-1.4.pom)
Downloading: http://www.mygrid.org.uk/maven/repository/net/sf/taverna/t2/ui-exts/constant-value/1.4.1/constant-value-1.4.1.pom
2K downloaded  (constant-value-1.4.1.pom)
Downloading: http://www.mygrid.org.uk/maven/repository/net/sf/taverna/t2/ui-exts/1.4.1/ui-exts-1.4.1.pom
3K downloaded  (ui-exts-1.4.1.pom)
Downloading: http://www.mygrid.org.uk/maven/repository/net/sf/taverna/t2/ui-exts/report-explainer/1.4.1/report-explainer-1.4.1.pom
3K downloaded  (report-explainer-1.4.1.pom)
Downloading: http://www.mygrid.org.uk/maven/repository/net/sf/taverna/t2/ui-exts/retry-ui/1.4/retry-ui-1.4.pom
1K downloaded  (retry-ui-1.4.pom)
Downloading: http://www.mygrid.org.uk/maven/repository/net/sf/taverna/t2/ui-exts/1.4/ui-exts-1.4.pom
3K downloaded  (ui-exts-1.4.pom)
Downloading: http://www.mygrid.org.uk/maven/repository/net/sf/taverna/t2/ui-exts/loop-ui/1.4.1/loop-ui-1.4.1.pom
1K downloaded  (loop-ui-1.4.1.pom)
Downloading: http://www.mygrid.org.uk/maven/repository/net/sf/taverna/t2/ui-exts/parallelize-ui/1.4/parallelize-ui-1.4.pom
1K downloaded  (parallelize-ui-1.4.pom)
Downloading: http://www.mygrid.org.uk/maven/repository/net/sf/taverna/t2/ui-exts/menu-items/1.4.1/menu-items-1.4.1.pom
2K downloaded  (menu-items-1.4.1.pom)
Downloading: http://www.mygrid.org.uk/maven/repository/net/sf/taverna/t2/ui-exts/renderers-exts/1.4/renderers-exts-1.4.pom
1K downloaded  (renderers-exts-1.4.pom)
Downloading: http://www.mygrid.org.uk/maven/repository/uk/org/mygrid/resources/Jmol/NO-VERSION/Jmol-NO-VERSION.pom
358b downloaded  (Jmol-NO-VERSION.pom)
Downloading: http://www.mygrid.org.uk/maven/repository/uk/org/mygrid/resources/seqvista-hacked/NO-VERSION/seqvista-hacked-NO-VERSION.pom
369b downloaded  (seqvista-hacked-NO-VERSION.pom)
Downloading: http://www.mygrid.org.uk/maven/repository/org/icepdf/icepdf-viewer/4.1.1-taverna/icepdf-viewer-4.1.1-taverna.pom
745b downloaded  (icepdf-viewer-4.1.1-taverna.pom)
Downloading: http://www.mygrid.org.uk/maven/repository/org/icepdf/icepdf-core/4.1.1/icepdf-core-4.1.1.pom
394b downloaded  (icepdf-core-4.1.1.pom)
Downloading: http://www.mygrid.org.uk/maven/repository/stax/stax-api/1.0/stax-api-1.0.pom
[INFO] Unable to find resource 'stax:stax-api:pom:1.0' in repository mygrid-repository (http://www.mygrid.org.uk/maven/repository)
Downloading: http://uk.maven.org/maven2//stax/stax-api/1.0/stax-api-1.0.pom
180b downloaded  (stax-api-1.0.pom)
Downloading: http://www.mygrid.org.uk/maven/repository/net/sf/taverna/t2/taverna-workbench/plugins/provenanceconnectors-plugin/2.4.0/provenanceconnectors-plugin-2.4.0.pom
981b downloaded  (provenanceconnectors-plugin-2.4.0.pom)
Downloading: http://www.mygrid.org.uk/maven/repository/net/sf/taverna/t2/taverna-workbench/plugins/2.4.0/plugins-2.4.0.pom
842b downloaded  (plugins-2.4.0.pom)
Downloading: http://www.mygrid.org.uk/maven/repository/net/sf/taverna/t2/taverna-workbench/2.4.0/taverna-workbench-2.4.0.pom
2K downloaded  (taverna-workbench-2.4.0.pom)
Downloading: http://www.mygrid.org.uk/maven/repository/net/sf/taverna/t2/taverna-workbench/plugins/servicecatalogue-plugin/2.4.1/servicecatalogue-plugin-2.4.1.pom
978b downloaded  (servicecatalogue-plugin-2.4.1.pom)
Downloading: http://www.mygrid.org.uk/maven/repository/org/apache/httpcomponents/httpclient/4.1-beta1/httpclient-4.1-beta1.pom
[INFO] Unable to find resource 'org.apache.httpcomponents:httpclient:pom:4.1-beta1' in repository mygrid-repository (http://www.mygrid.org.uk/maven/repository)
Downloading: http://uk.maven.org/maven2/org/apache/httpcomponents/httpclient/4.1-beta1/httpclient-4.1-beta1.pom
6K downloaded  (httpclient-4.1-beta1.pom)
Downloading: http://www.mygrid.org.uk/maven/repository/org/apache/httpcomponents/httpcomponents-client/4.1-beta1/httpcomponents-client-4.1-beta1.pom
[INFO] Unable to find resource 'org.apache.httpcomponents:httpcomponents-client:pom:4.1-beta1' in repository mygrid-repository (http://www.mygrid.org.uk/maven/repository)
Downloading: http://uk.maven.org/maven2/org/apache/httpcomponents/httpcomponents-client/4.1-beta1/httpcomponents-client-4.1-beta1.pom
9K downloaded  (httpcomponents-client-4.1-beta1.pom)
Downloading: http://www.mygrid.org.uk/maven/repository/org/apache/httpcomponents/project/4.1.1/project-4.1.1.pom
[INFO] Unable to find resource 'org.apache.httpcomponents:project:pom:4.1.1' in repository mygrid-repository (http://www.mygrid.org.uk/maven/repository)
Downloading: http://uk.maven.org/maven2/org/apache/httpcomponents/project/4.1.1/project-4.1.1.pom
16K downloaded  (project-4.1.1.pom)
Downloading: http://www.mygrid.org.uk/maven/repository/org/apache/httpcomponents/httpcore/4.1/httpcore-4.1.pom
[INFO] Unable to find resource 'org.apache.httpcomponents:httpcore:pom:4.1' in repository mygrid-repository (http://www.mygrid.org.uk/maven/repository)
Downloading: http://uk.maven.org/maven2/org/apache/httpcomponents/httpcore/4.1/httpcore-4.1.pom
8K downloaded  (httpcore-4.1.pom)
Downloading: http://www.mygrid.org.uk/maven/repository/org/apache/httpcomponents/httpcomponents-core/4.1/httpcomponents-core-4.1.pom
[INFO] Unable to find resource 'org.apache.httpcomponents:httpcomponents-core:pom:4.1' in repository mygrid-repository (http://www.mygrid.org.uk/maven/repository)
Downloading: http://uk.maven.org/maven2/org/apache/httpcomponents/httpcomponents-core/4.1/httpcomponents-core-4.1.pom
8K downloaded  (httpcomponents-core-4.1.pom)
Downloading: http://www.mygrid.org.uk/maven/repository/BrowserLauncher2/BrowserLauncher2/1.3/BrowserLauncher2-1.3.jar
Downloading: http://www.mygrid.org.uk/maven/repository/org/apache/httpcomponents/httpclient/4.1-beta1/httpclient-4.1-beta1.jar
Downloading: http://www.mygrid.org.uk/maven/repository/uk/org/mygrid/taverna/osxapplication/1.5.1/osxapplication-1.5.1.jar
Downloading: http://www.mygrid.org.uk/maven/repository/net/sf/taverna/t2/ui-impl/contextual-views-impl/1.4/contextual-views-impl-1.4.jar
62K downloaded  (contextual-views-impl-1.4.jar)
100K downloaded  (BrowserLauncher2-1.3.jar)
Downloading: http://www.mygrid.org.uk/maven/repository/javax/help/javahelp/2.0.02/javahelp-2.0.02.jar
Downloading: http://www.mygrid.org.uk/maven/repository/xml-apis/xml-apis/1.3.04/xml-apis-1.3.04.jar
[INFO] Unable to find resource 'org.apache.httpcomponents:httpclient:jar:4.1-beta1' in repository mygrid-repository (http://www.mygrid.org.uk/maven/repository)
Downloading: http://www.mygrid.org.uk/maven/repository/org/apache/xmlgraphics/batik-svg-dom/1.7/batik-svg-dom-1.7.jar
Downloading: http://uk.maven.org/maven2/org/apache/httpcomponents/httpclient/4.1-beta1/httpclient-4.1-beta1.jar
[INFO] Unable to find resource 'xml-apis:xml-apis:jar:1.3.04' in repository mygrid-repository (http://www.mygrid.org.uk/maven/repository)
Downloading: http://uk.maven.org/maven2//xml-apis/xml-apis/1.3.04/xml-apis-1.3.04.jar
[INFO] Unable to find resource 'org.apache.xmlgraphics:batik-svg-dom:jar:1.7' in repository mygrid-repository (http://www.mygrid.org.uk/maven/repository)
[INFO] Unable to find resource 'javax.help:javahelp:jar:2.0.02' in repository mygrid-repository (http://www.mygrid.org.uk/maven/repository)
Downloading: http://uk.maven.org/maven2//org/apache/xmlgraphics/batik-svg-dom/1.7/batik-svg-dom-1.7.jar
Downloading: http://uk.maven.org/maven2//javax/help/javahelp/2.0.02/javahelp-2.0.02.jar
5K downloaded  (osxapplication-1.5.1.jar)
Downloading: http://www.mygrid.org.uk/maven/repository/net/sf/taverna/t2/ui-components/credential-manager-ui/1.4/credential-manager-ui-1.4.jar
163K downloaded  (credential-manager-ui-1.4.jar)
189K downloaded  (xml-apis-1.3.04.jar)
Downloading: http://www.mygrid.org.uk/maven/repository/net/sf/taverna/t2/ui-api/activity-palette-api/1.4/activity-palette-api-1.4.jar
Downloading: http://www.mygrid.org.uk/maven/repository/org/apache/avalon/framework/avalon-framework-api/4.3.1/avalon-framework-api-4.3.1.jar
26K downloaded  (activity-palette-api-1.4.jar)
[INFO] Unable to find resource 'org.apache.avalon.framework:avalon-framework-api:jar:4.3.1' in repository mygrid-repository (http://www.mygrid.org.uk/maven/repository)
Downloading: http://www.mygrid.org.uk/maven/repository/net/sf/opencsv/opencsv/2.1/opencsv-2.1.jar
Downloading: http://uk.maven.org/maven2//org/apache/avalon/framework/avalon-framework-api/4.3.1/avalon-framework-api-4.3.1.jar
32K downloaded  (avalon-framework-api-4.3.1.jar)
Downloading: http://www.mygrid.org.uk/maven/repository/commons-beanutils/commons-beanutils/1.8.3/commons-beanutils-1.8.3.jar
574K downloaded  (javahelp-2.0.02.jar)
[INFO] Unable to find resource 'commons-beanutils:commons-beanutils:jar:1.8.3' in repository mygrid-repository (http://www.mygrid.org.uk/maven/repository)
Downloading: http://uk.maven.org/maven2//commons-beanutils/commons-beanutils/1.8.3/commons-beanutils-1.8.3.jar
[INFO] Unable to find resource 'net.sf.opencsv:opencsv:jar:2.1' in repository mygrid-repository (http://www.mygrid.org.uk/maven/repository)
Downloading: http://uk.maven.org/maven2//net/sf/opencsv/opencsv/2.1/opencsv-2.1.jar
587K downloaded  (batik-svg-dom-1.7.jar)
Downloading: http://www.mygrid.org.uk/maven/repository/xalan/xalan/2.7.1/xalan-2.7.1.jar
Downloading: http://www.mygrid.org.uk/maven/repository/log4j/log4j/1.2.16/log4j-1.2.16.jar
16K downloaded  (opencsv-2.1.jar)
[INFO] Unable to find resource 'log4j:log4j:jar:1.2.16' in repository mygrid-repository (http://www.mygrid.org.uk/maven/repository)
Downloading: http://uk.maven.org/maven2//log4j/log4j/1.2.16/log4j-1.2.16.jar
226K downloaded  (commons-beanutils-1.8.3.jar)
Downloading: http://www.mygrid.org.uk/maven/repository/net/sf/taverna/t2/ui-impl/workbench-impl/1.4/workbench-impl-1.4.jar
[INFO] Unable to find resource 'xalan:xalan:jar:2.7.1' in repository mygrid-repository (http://www.mygrid.org.uk/maven/repository)
Downloading: http://uk.maven.org/maven2//xalan/xalan/2.7.1/xalan-2.7.1.jar
Downloading: http://www.mygrid.org.uk/maven/repository/xml-apis/xml-apis-ext/1.3.04/xml-apis-ext-1.3.04.jar
470K downloaded  (log4j-1.2.16.jar)
339K downloaded  (httpclient-4.1-beta1.jar)
Downloading: http://www.mygrid.org.uk/maven/repository/net/sf/taverna/t2/ui-components/workflow-view/1.4/workflow-view-1.4.jar
37K downloaded  (workflow-view-1.4.jar)
Downloading: http://www.mygrid.org.uk/maven/repository/net/sf/taverna/t2/lang/partition/1.4/partition-1.4.jar
Downloading: http://www.mygrid.org.uk/maven/repository/net/sf/taverna/t2/ui-api/configuration-api/1.4/configuration-api-1.4.jar
11K downloaded  (configuration-api-1.4.jar)
37K downloaded  (partition-1.4.jar)
Downloading: http://www.mygrid.org.uk/maven/repository/org/apache/avalon/framework/avalon-framework-impl/4.3.1/avalon-framework-impl-4.3.1.jar
[INFO] Unable to find resource 'xml-apis:xml-apis-ext:jar:1.3.04' in repository mygrid-repository (http://www.mygrid.org.uk/maven/repository)
Downloading: http://uk.maven.org/maven2//xml-apis/xml-apis-ext/1.3.04/xml-apis-ext-1.3.04.jar
[INFO] Unable to find resource 'org.apache.avalon.framework:avalon-framework-impl:jar:4.3.1' in repository mygrid-repository (http://www.mygrid.org.uk/maven/repository)
Downloading: http://www.mygrid.org.uk/maven/repository/org/apache/xmlgraphics/batik-anim/1.7/batik-anim-1.7.jar
83K downloaded  (xml-apis-ext-1.3.04.jar)
97K downloaded  (workbench-impl-1.4.jar)
Downloading: http://uk.maven.org/maven2//org/apache/avalon/framework/avalon-framework-impl/4.3.1/avalon-framework-impl-4.3.1.jar
59K downloaded  (avalon-framework-impl-4.3.1.jar)
[INFO] Unable to find resource 'org.apache.xmlgraphics:batik-anim:jar:1.7' in repository mygrid-repository (http://www.mygrid.org.uk/maven/repository)
Downloading: http://uk.maven.org/maven2//org/apache/xmlgraphics/batik-anim/1.7/batik-anim-1.7.jar
Downloading: http://www.mygrid.org.uk/maven/repository/net/sf/taverna/t2/ui-components/design-ui/1.4/design-ui-1.4.jar
Downloading: http://www.mygrid.org.uk/maven/repository/org/apache/httpcomponents/httpcore/4.1/httpcore-4.1.jar
Downloading: http://www.mygrid.org.uk/maven/repository/net/sf/taverna/t2/ui-api/menu-api/1.4/menu-api-1.4.jar
93K downloaded  (batik-anim-1.7.jar)
3101K downloaded  (xalan-2.7.1.jar)
Downloading: http://www.mygrid.org.uk/maven/repository/net/sf/taverna/t2/lang/beans/1.4/beans-1.4.jar
16K downloaded  (menu-api-1.4.jar)
Downloading: http://www.mygrid.org.uk/maven/repository/net/sf/taverna/t2/ui-impl/file-impl/1.4/file-impl-1.4.jar
[INFO] Unable to find resource 'org.apache.httpcomponents:httpcore:jar:4.1' in repository mygrid-repository (http://www.mygrid.org.uk/maven/repository)
Downloading: http://uk.maven.org/maven2/org/apache/httpcomponents/httpcore/4.1/httpcore-4.1.jar
Downloading: http://www.mygrid.org.uk/maven/repository/org/apache/xmlgraphics/batik-awt-util/1.7/batik-awt-util-1.7.jar
[INFO] Unable to find resource 'org.apache.xmlgraphics:batik-awt-util:jar:1.7' in repository mygrid-repository (http://www.mygrid.org.uk/maven/repository)
Downloading: http://uk.maven.org/maven2//org/apache/xmlgraphics/batik-awt-util/1.7/batik-awt-util-1.7.jar
176K downloaded  (httpcore-4.1.jar)
Downloading: http://www.mygrid.org.uk/maven/repository/net/sf/taverna/t2/ui-api/contextual-views-api/1.4/contextual-views-api-1.4.jar
392K downloaded  (batik-awt-util-1.7.jar)
23K downloaded  (contextual-views-api-1.4.jar)
6K downloaded  (beans-1.4.jar)
Downloading: http://www.mygrid.org.uk/maven/repository/net/sf/taverna/t2/ui-api/activity-icons-api/1.4/activity-icons-api-1.4.jar
Downloading: http://www.mygrid.org.uk/maven/repository/org/apache/xmlgraphics/batik-util/1.7/batik-util-1.7.jar
[INFO] Unable to find resource 'org.apache.xmlgraphics:batik-util:jar:1.7' in repository mygrid-repository (http://www.mygrid.org.uk/maven/repository)
Downloading: http://uk.maven.org/maven2//org/apache/xmlgraphics/batik-util/1.7/batik-util-1.7.jar
107K downloaded  (file-impl-1.4.jar)
6K downloaded  (activity-icons-api-1.4.jar)
Downloading: http://www.mygrid.org.uk/maven/repository/net/sf/taverna/t2/ui-api/workbench-api/1.4/workbench-api-1.4.jar
Downloading: http://www.mygrid.org.uk/maven/repository/net/sf/taverna/t2/ui-impl/configuration-impl/1.4/configuration-impl-1.4.jar
Downloading: http://www.mygrid.org.uk/maven/repository/org/apache/abdera/abdera-filesystem/1.1.2/abdera-filesystem-1.1.2.jar
9K downloaded  (workbench-api-1.4.jar)
125K downloaded  (batik-util-1.7.jar)
[INFO] Unable to find resource 'org.apache.abdera:abdera-filesystem:jar:1.1.2' in repository mygrid-repository (http://www.mygrid.org.uk/maven/repository)
Downloading: http://uk.maven.org/maven2/org/apache/abdera/abdera-filesystem/1.1.2/abdera-filesystem-1.1.2.jar
Downloading: http://www.mygrid.org.uk/maven/repository/net/sf/taverna/t2/lang/ui/1.4/ui-1.4.jar
Downloading: http://www.mygrid.org.uk/maven/repository/org/apache/xmlgraphics/batik-dom/1.7/batik-dom-1.7.jar
[INFO] Unable to find resource 'org.apache.xmlgraphics:batik-dom:jar:1.7' in repository mygrid-repository (http://www.mygrid.org.uk/maven/repository)
Downloading: http://uk.maven.org/maven2//org/apache/xmlgraphics/batik-dom/1.7/batik-dom-1.7.jar
80K downloaded  (ui-1.4.jar)
Downloading: http://www.mygrid.org.uk/maven/repository/net/sf/taverna/t2/ui-api/helper-api/1.4/helper-api-1.4.jar
25K downloaded  (configuration-impl-1.4.jar)
12K downloaded  (helper-api-1.4.jar)
Downloading: http://www.mygrid.org.uk/maven/repository/net/sf/taverna/t2/lang/io/1.4/io-1.4.jar
169K downloaded  (batik-dom-1.7.jar)
Downloading: http://www.mygrid.org.uk/maven/repository/net/sf/taverna/t2/ui-impl/helper/1.4/helper-1.4.jar
1K downloaded  (helper-1.4.jar)
Downloading: http://www.mygrid.org.uk/maven/repository/net/sf/taverna/t2/ui-api/file-api/1.4/file-api-1.4.jar
4K downloaded  (io-1.4.jar)
Downloading: http://www.mygrid.org.uk/maven/repository/org/apache/xmlgraphics/batik-css/1.7/batik-css-1.7.jar
13K downloaded  (file-api-1.4.jar)
[INFO] Unable to find resource 'org.apache.xmlgraphics:batik-css:jar:1.7' in repository mygrid-repository (http://www.mygrid.org.uk/maven/repository)
14K downloaded  (abdera-filesystem-1.1.2.jar)
Downloading: http://uk.maven.org/maven2//org/apache/xmlgraphics/batik-css/1.7/batik-css-1.7.jar
Downloading: http://www.mygrid.org.uk/maven/repository/net/sf/taverna/t2/ui-impl/zaria/1.4/zaria-1.4.jar
Downloading: http://www.mygrid.org.uk/maven/repository/net/sf/taverna/t2/ui-api/edits-api/1.4/edits-api-1.4.jar
6K downloaded  (edits-api-1.4.jar)
31K downloaded  (design-ui-1.4.jar)
Downloading: http://www.mygrid.org.uk/maven/repository/net/sf/taverna/t2/ui-api/common-icons/1.4/common-icons-1.4.jar
89K downloaded  (zaria-1.4.jar)
Downloading: http://www.mygrid.org.uk/maven/repository/net/sf/taverna/t2/ui-components/graph-view/1.4.1/graph-view-1.4.1.jar
Downloading: http://www.mygrid.org.uk/maven/repository/net/sf/taverna/t2/ui-impl/edits-impl/1.4/edits-impl-1.4.jar
18K downloaded  (edits-impl-1.4.jar)
148K downloaded  (common-icons-1.4.jar)
Downloading: http://www.mygrid.org.uk/maven/repository/net/sf/taverna/t2/ui-impl/activity-tools/1.4/activity-tools-1.4.jar
93K downloaded  (graph-view-1.4.1.jar)
Downloading: http://www.mygrid.org.uk/maven/repository/net/sf/taverna/t2/ui-api/perspective-core/1.4/perspective-core-1.4.jar
4K downloaded  (activity-tools-1.4.jar)
8K downloaded  (perspective-core-1.4.jar)
Downloading: http://www.mygrid.org.uk/maven/repository/net/sf/taverna/t2/ui-components/graph-model/1.4.1/graph-model-1.4.1.jar
303K downloaded  (batik-css-1.7.jar)
Downloading: http://www.mygrid.org.uk/maven/repository/org/apache/xmlgraphics/batik-ext/1.7/batik-ext-1.7.jar
Downloading: http://www.mygrid.org.uk/maven/repository/net/sf/taverna/t2/ui-impl/menu-impl/1.4/menu-impl-1.4.jar
[INFO] Unable to find resource 'org.apache.xmlgraphics:batik-ext:jar:1.7' in repository mygrid-repository (http://www.mygrid.org.uk/maven/repository)
Downloading: http://uk.maven.org/maven2//org/apache/xmlgraphics/batik-ext/1.7/batik-ext-1.7.jar
182K downloaded  (graph-model-1.4.1.jar)
10K downloaded  (batik-ext-1.7.jar)
14K downloaded  (menu-impl-1.4.jar)
Downloading: http://www.mygrid.org.uk/maven/repository/org/apache/xmlgraphics/batik-xml/1.7/batik-xml-1.7.jar
[INFO] Unable to find resource 'org.apache.xmlgraphics:batik-xml:jar:1.7' in repository mygrid-repository (http://www.mygrid.org.uk/maven/repository)
Downloading: http://www.mygrid.org.uk/maven/repository/net/sf/taverna/t2/ui-components/perspective-results/1.4/perspective-results-1.4.jar
Downloading: http://uk.maven.org/maven2//org/apache/xmlgraphics/batik-xml/1.7/batik-xml-1.7.jar
4K downloaded  (perspective-results-1.4.jar)
30K downloaded  (batik-xml-1.7.jar)
Downloading: http://www.mygrid.org.uk/maven/repository/org/apache/xmlgraphics/batik-parser/1.7/batik-parser-1.7.jar
[INFO] Unable to find resource 'org.apache.xmlgraphics:batik-parser:jar:1.7' in repository mygrid-repository (http://www.mygrid.org.uk/maven/repository)
Downloading: http://uk.maven.org/maven2//org/apache/xmlgraphics/batik-parser/1.7/batik-parser-1.7.jar
71K downloaded  (batik-parser-1.7.jar)
Downloading: http://www.mygrid.org.uk/maven/repository/org/apache/xmlgraphics/batik-swing/1.7/batik-swing-1.7.jar
[INFO] Unable to find resource 'org.apache.xmlgraphics:batik-swing:jar:1.7' in repository mygrid-repository (http://www.mygrid.org.uk/maven/repository)
Downloading: http://uk.maven.org/maven2//org/apache/xmlgraphics/batik-swing/1.7/batik-swing-1.7.jar
181K downloaded  (batik-swing-1.7.jar)
Downloading: http://www.mygrid.org.uk/maven/repository/org/apache/xmlgraphics/batik-bridge/1.7/batik-bridge-1.7.jar
[INFO] Unable to find resource 'org.apache.xmlgraphics:batik-bridge:jar:1.7' in repository mygrid-repository (http://www.mygrid.org.uk/maven/repository)
Downloading: http://uk.maven.org/maven2//org/apache/xmlgraphics/batik-bridge/1.7/batik-bridge-1.7.jar
545K downloaded  (batik-bridge-1.7.jar)
Downloading: http://www.mygrid.org.uk/maven/repository/org/apache/xmlgraphics/batik-gvt/1.7/batik-gvt-1.7.jar
[INFO] Unable to find resource 'org.apache.xmlgraphics:batik-gvt:jar:1.7' in repository mygrid-repository (http://www.mygrid.org.uk/maven/repository)
Downloading: http://uk.maven.org/maven2//org/apache/xmlgraphics/batik-gvt/1.7/batik-gvt-1.7.jar
237K downloaded  (batik-gvt-1.7.jar)
Downloading: http://www.mygrid.org.uk/maven/repository/org/apache/xmlgraphics/batik-script/1.7/batik-script-1.7.jar
[INFO] Unable to find resource 'org.apache.xmlgraphics:batik-script:jar:1.7' in repository mygrid-repository (http://www.mygrid.org.uk/maven/repository)
Downloading: http://uk.maven.org/maven2//org/apache/xmlgraphics/batik-script/1.7/batik-script-1.7.jar
59K downloaded  (batik-script-1.7.jar)
Downloading: http://www.mygrid.org.uk/maven/repository/org/apache/xmlgraphics/batik-gui-util/1.7/batik-gui-util-1.7.jar
[INFO] Unable to find resource 'org.apache.xmlgraphics:batik-gui-util:jar:1.7' in repository mygrid-repository (http://www.mygrid.org.uk/maven/repository)
Downloading: http://uk.maven.org/maven2//org/apache/xmlgraphics/batik-gui-util/1.7/batik-gui-util-1.7.jar
165K downloaded  (batik-gui-util-1.7.jar)
Downloading: http://www.mygrid.org.uk/maven/repository/org/apache/xmlgraphics/batik-transcoder/1.7/batik-transcoder-1.7.jar
[INFO] Unable to find resource 'org.apache.xmlgraphics:batik-transcoder:jar:1.7' in repository mygrid-repository (http://www.mygrid.org.uk/maven/repository)
Downloading: http://uk.maven.org/maven2//org/apache/xmlgraphics/batik-transcoder/1.7/batik-transcoder-1.7.jar
119K downloaded  (batik-transcoder-1.7.jar)
Downloading: http://www.mygrid.org.uk/maven/repository/org/apache/xmlgraphics/fop/0.94/fop-0.94.jar
[INFO] Unable to find resource 'org.apache.xmlgraphics:fop:jar:0.94' in repository mygrid-repository (http://www.mygrid.org.uk/maven/repository)
Downloading: http://uk.maven.org/maven2//org/apache/xmlgraphics/fop/0.94/fop-0.94.jar
2038K downloaded  (fop-0.94.jar)
Downloading: http://www.mygrid.org.uk/maven/repository/org/apache/xmlgraphics/xmlgraphics-commons/1.2/xmlgraphics-commons-1.2.jar
[INFO] Unable to find resource 'org.apache.xmlgraphics:xmlgraphics-commons:jar:1.2' in repository mygrid-repository (http://www.mygrid.org.uk/maven/repository)
Downloading: http://uk.maven.org/maven2//org/apache/xmlgraphics/xmlgraphics-commons/1.2/xmlgraphics-commons-1.2.jar
335K downloaded  (xmlgraphics-commons-1.2.jar)
Downloading: http://www.mygrid.org.uk/maven/repository/org/apache/xmlgraphics/batik-svggen/1.7/batik-svggen-1.7.jar
[INFO] Unable to find resource 'org.apache.xmlgraphics:batik-svggen:jar:1.7' in repository mygrid-repository (http://www.mygrid.org.uk/maven/repository)
Downloading: http://uk.maven.org/maven2//org/apache/xmlgraphics/batik-svggen/1.7/batik-svggen-1.7.jar
210K downloaded  (batik-svggen-1.7.jar)
[INFO] [compiler:compile {execution: default-compile}]
[WARNING] File encoding has not been set, using platform encoding ANSI_X3.4-1968, i.e. build is platform dependent!
[INFO] Compiling 19 source files to /var/lib/jenkins/workspace/Interaction Service/interaction-activity-ui/target/classes
[INFO] -------------------------------------------------------------
[ERROR] COMPILATION ERROR : 
[INFO] -------------------------------------------------------------
[ERROR] /var/lib/jenkins/workspace/Interaction Service/interaction-activity-ui/src/main/java/net/sf/taverna/t2/activities/interaction/view/InteractionInputViewer.java:[32,45] error: package net.sf.taverna.t2.activities.beanshell does not exist
[ERROR] /var/lib/jenkins/workspace/Interaction Service/interaction-activity-ui/src/main/java/net/sf/taverna/t2/activities/interaction/view/InteractionOutputViewer.java:[31,45] error: package net.sf.taverna.t2.activities.beanshell does not exist
[INFO] 2 errors 
[INFO] -------------------------------------------------------------
[JENKINS] Archiving /var/lib/jenkins/workspace/Interaction Service/interaction-activity-ui/pom.xml to /local/jenkins/jobs/Interaction Service/modules/net.sf.taverna.t2.ui-activities$interaction-activity-ui/builds/2013-08-06_16-22-59/archive/net.sf.taverna.t2.ui-activities/interaction-activity-ui/1.0.4/interaction-activity-ui-1.0.4.pom
[INFO] ------------------------------------------------------------------------
[ERROR] BUILD FAILURE
[INFO] ------------------------------------------------------------------------
[INFO] Compilation failure

/var/lib/jenkins/workspace/Interaction Service/interaction-activity-ui/src/main/java/net/sf/taverna/t2/activities/interaction/view/InteractionInputViewer.java:[32,45] error: package net.sf.taverna.t2.activities.beanshell does not exist
/var/lib/jenkins/workspace/Interaction Service/interaction-activity-ui/src/main/java/net/sf/taverna/t2/activities/interaction/view/InteractionOutputViewer.java:[31,45] error: package net.sf.taverna.t2.activities.beanshell does not exist

[INFO] ------------------------------------------------------------------------
[INFO] For more information, run Maven with the -e switch
[INFO] ------------------------------------------------------------------------
[INFO] Total time: 1 minute 24 seconds
[INFO] Finished at: Tue Aug 06 16:24:31 BST 2013
[INFO] Final Memory: 69M/180M
[INFO] ------------------------------------------------------------------------
channel stopped
Finished: FAILURE